%YAML 1.1
%TAG !u! tag:unity3d.com,2011:
--- !u!1 &5524068356747300034
GameObject:
  m_ObjectHideFlags: 0
  m_CorrespondingSourceObject: {fileID: 0}
  m_PrefabInstance: {fileID: 0}
  m_PrefabAsset: {fileID: 0}
  serializedVersion: 6
  m_Component:
  - component: {fileID: 5524068356747300046}
  - component: {fileID: 5524068356747300047}
  - component: {fileID: 5524068356747300032}
  - component: {fileID: 5524068356747300033}
  m_Layer: 5
  m_Name: ArmCharge
  m_TagString: Untagged
  m_Icon: {fileID: 0}
  m_NavMeshLayer: 0
  m_StaticEditorFlags: 0
  m_IsActive: 1
--- !u!224 &5524068356747300046
RectTransform:
  m_ObjectHideFlags: 0
  m_CorrespondingSourceObject: {fileID: 0}
  m_PrefabInstance: {fileID: 0}
  m_PrefabAsset: {fileID: 0}
  m_GameObject: {fileID: 5524068356747300034}
  m_LocalRotation: {x: 0.7071068, y: 0, z: 0, w: 0.7071068}
  m_LocalPosition: {x: 0, y: 0, z: 235}
  m_LocalScale: {x: 0.1, y: 0.1, z: 0.1}
  m_Children:
  - {fileID: 7235018638616596428}
  m_Father: {fileID: 0}
  m_RootOrder: 0
  m_LocalEulerAnglesHint: {x: 90, y: 0, z: 0}
  m_AnchorMin: {x: 0, y: 0}
  m_AnchorMax: {x: 0, y: 0}
  m_AnchoredPosition: {x: 149, y: -14}
  m_SizeDelta: {x: 100, y: 100}
  m_Pivot: {x: 0.5, y: 0.5}
--- !u!223 &5524068356747300047
Canvas:
  m_ObjectHideFlags: 0
  m_CorrespondingSourceObject: {fileID: 0}
  m_PrefabInstance: {fileID: 0}
  m_PrefabAsset: {fileID: 0}
  m_GameObject: {fileID: 5524068356747300034}
  m_Enabled: 1
  serializedVersion: 3
  m_RenderMode: 2
  m_Camera: {fileID: 0}
  m_PlaneDistance: 100
  m_PixelPerfect: 0
  m_ReceivesEvents: 1
  m_OverrideSorting: 0
  m_OverridePixelPerfect: 0
  m_SortingBucketNormalizedSize: 0
  m_AdditionalShaderChannelsFlag: 25
  m_SortingLayerID: 0
  m_SortingOrder: 0
  m_TargetDisplay: 0
--- !u!114 &5524068356747300032
MonoBehaviour:
  m_ObjectHideFlags: 0
  m_CorrespondingSourceObject: {fileID: 0}
  m_PrefabInstance: {fileID: 0}
  m_PrefabAsset: {fileID: 0}
  m_GameObject: {fileID: 5524068356747300034}
  m_Enabled: 1
  m_EditorHideFlags: 0
  m_Script: {fileID: 11500000, guid: 0cd44c1031e13a943bb63640046fad76, type: 3}
  m_Name: 
  m_EditorClassIdentifier: 
  m_UiScaleMode: 0
  m_ReferencePixelsPerUnit: 100
  m_ScaleFactor: 1
  m_ReferenceResolution: {x: 800, y: 600}
  m_ScreenMatchMode: 0
  m_MatchWidthOrHeight: 0
  m_PhysicalUnit: 3
  m_FallbackScreenDPI: 96
  m_DefaultSpriteDPI: 96
  m_DynamicPixelsPerUnit: 1
  m_PresetInfoIsWorld: 0
--- !u!114 &5524068356747300033
MonoBehaviour:
  m_ObjectHideFlags: 0
  m_CorrespondingSourceObject: {fileID: 0}
  m_PrefabInstance: {fileID: 0}
  m_PrefabAsset: {fileID: 0}
  m_GameObject: {fileID: 5524068356747300034}
  m_Enabled: 1
  m_EditorHideFlags: 0
  m_Script: {fileID: 11500000, guid: dc42784cf147c0c48a680349fa168899, type: 3}
  m_Name: 
  m_EditorClassIdentifier: 
  m_IgnoreReversedGraphics: 1
  m_BlockingObjects: 0
  m_BlockingMask:
    serializedVersion: 2
    m_Bits: 4294967295
--- !u!1001 &3064068384549497564
PrefabInstance:
  m_ObjectHideFlags: 0
  serializedVersion: 2
  m_Modification:
    m_TransformParent: {fileID: 5524068356747300046}
    m_Modifications:
    - target: {fileID: 1773647233606504292, guid: 7cf7efd71c3779b41970279d42505860, type: 3}
      propertyPath: m_FillMethod
      value: 3
      objectReference: {fileID: 0}
    - target: {fileID: 4509830085630346737, guid: 7cf7efd71c3779b41970279d42505860, type: 3}
      propertyPath: m_FillMethod
      value: 3
      objectReference: {fileID: 0}
    - target: {fileID: 5629092145763907143, guid: 7cf7efd71c3779b41970279d42505860, type: 3}
      propertyPath: m_Name
      value: ArmChargeUI
      objectReference: {fileID: 0}
    - target: {fileID: 5684161653160109328, guid: 7cf7efd71c3779b41970279d42505860, type: 3}
      propertyPath: m_Pivot.x
      value: 0.5
      objectReference: {fileID: 0}
    - target: {fileID: 5684161653160109328, guid: 7cf7efd71c3779b41970279d42505860, type: 3}
      propertyPath: m_Pivot.y
      value: 0.5
      objectReference: {fileID: 0}
    - target: {fileID: 5684161653160109328, guid: 7cf7efd71c3779b41970279d42505860, type: 3}
      propertyPath: m_RootOrder
      value: 0
      objectReference: {fileID: 0}
    - target: {fileID: 5684161653160109328, guid: 7cf7efd71c3779b41970279d42505860, type: 3}
      propertyPath: m_AnchorMax.x
      value: 0.5
      objectReference: {fileID: 0}
    - target: {fileID: 5684161653160109328, guid: 7cf7efd71c3779b41970279d42505860, type: 3}
      propertyPath: m_AnchorMax.y
      value: 0.5
      objectReference: {fileID: 0}
    - target: {fileID: 5684161653160109328, guid: 7cf7efd71c3779b41970279d42505860, type: 3}
      propertyPath: m_AnchorMin.x
      value: 0.5
      objectReference: {fileID: 0}
    - target: {fileID: 5684161653160109328, guid: 7cf7efd71c3779b41970279d42505860, type: 3}
      propertyPath: m_AnchorMin.y
      value: 0.5
      objectReference: {fileID: 0}
    - target: {fileID: 5684161653160109328, guid: 7cf7efd71c3779b41970279d42505860, type: 3}
      propertyPath: m_SizeDelta.x
      value: 0
      objectReference: {fileID: 0}
    - target: {fileID: 5684161653160109328, guid: 7cf7efd71c3779b41970279d42505860, type: 3}
      propertyPath: m_SizeDelta.y
      value: 0
      objectReference: {fileID: 0}
    - target: {fileID: 5684161653160109328, guid: 7cf7efd71c3779b41970279d42505860, type: 3}
      propertyPath: m_LocalPosition.x
      value: 0
      objectReference: {fileID: 0}
    - target: {fileID: 5684161653160109328, guid: 7cf7efd71c3779b41970279d42505860, type: 3}
      propertyPath: m_LocalPosition.y
      value: 0
      objectReference: {fileID: 0}
    - target: {fileID: 5684161653160109328, guid: 7cf7efd71c3779b41970279d42505860, type: 3}
      propertyPath: m_LocalPosition.z
      value: -2
      objectReference: {fileID: 0}
    - target: {fileID: 5684161653160109328, guid: 7cf7efd71c3779b41970279d42505860, type: 3}
      propertyPath: m_LocalRotation.w
      value: 1
      objectReference: {fileID: 0}
    - target: {fileID: 5684161653160109328, guid: 7cf7efd71c3779b41970279d42505860, type: 3}
      propertyPath: m_LocalRotation.x
      value: 0
      objectReference: {fileID: 0}
    - target: {fileID: 5684161653160109328, guid: 7cf7efd71c3779b41970279d42505860, type: 3}
      propertyPath: m_LocalRotation.y
      value: 0
      objectReference: {fileID: 0}
    - target: {fileID: 5684161653160109328, guid: 7cf7efd71c3779b41970279d42505860, type: 3}
      propertyPath: m_LocalRotation.z
      value: 0
      objectReference: {fileID: 0}
    - target: {fileID: 5684161653160109328, guid: 7cf7efd71c3779b41970279d42505860, type: 3}
      propertyPath: m_AnchoredPosition.x
      value: 1.5
      objectReference: {fileID: 0}
    - target: {fileID: 5684161653160109328, guid: 7cf7efd71c3779b41970279d42505860, type: 3}
      propertyPath: m_AnchoredPosition.y
      value: -0.5
      objectReference: {fileID: 0}
    - target: {fileID: 5684161653160109328, guid: 7cf7efd71c3779b41970279d42505860, type: 3}
      propertyPath: m_LocalEulerAnglesHint.x
      value: 0
      objectReference: {fileID: 0}
    - target: {fileID: 5684161653160109328, guid: 7cf7efd71c3779b41970279d42505860, type: 3}
      propertyPath: m_LocalEulerAnglesHint.y
      value: 0
      objectReference: {fileID: 0}
    - target: {fileID: 5684161653160109328, guid: 7cf7efd71c3779b41970279d42505860, type: 3}
      propertyPath: m_LocalEulerAnglesHint.z
      value: 0
      objectReference: {fileID: 0}
    m_RemovedComponents: []
  m_SourcePrefab: {fileID: 100100000, guid: 7cf7efd71c3779b41970279d42505860, type: 3}
--- !u!224 &7235018638616596428 stripped
RectTransform:
  m_CorrespondingSourceObject: {fileID: 5684161653160109328, guid: 7cf7efd71c3779b41970279d42505860, type: 3}
  m_PrefabInstance: {fileID: 3064068384549497564}
  m_PrefabAsset: {fileID: 0}
