com\codeflex\springboot\service\ProductServiceImpl.class
com\codeflex\springboot\SpringbootRestOnlineStore.class
com\codeflex\springboot\model\Category.class
com\codeflex\springboot\model\Product.class
com\codeflex\springboot\service\ProductService.class
com\codeflex\springboot\controller\RestApiController.class
com\codeflex\springboot\util\CustomErrorType.class
