{
    "bannerImagePath": "/uploads/Solutions/ET/et-banner.jpg",
    "title": "404 - Page Not Found",
    "subTitle": "404 - Page Not Found",
    "mainDescriptions": [
        "Please check the URL you have typed, We can't find the data you are looking for !"
    ]
}