{
    "version": "https://jsonfeed.org/version/1",
    "title": "grønvald.vip",
    "description": "",
    "home_page_url": "https://another.network.gitlab.io/groenvald.vip",
    "feed_url": "https://another.network.gitlab.io/groenvald.vip/feed.json",
    "user_comment": "",
    "author": {
        "name": "Nilas Skytte Grønvald &quot;GrønSkytten&quot;"
    },
    "items": [
        {
            "id": "https://another.network.gitlab.io/groenvald.vip/pighvar-kantarel-og-rossini.html",
            "url": "https://another.network.gitlab.io/groenvald.vip/pighvar-kantarel-og-rossini.html",
            "title": "Pighvar, kantarel og Rossini!",
            "summary": "Soyaristede kantarel: De resterende små svampe ordnes. De steges ved middelhøj varme på en pande i neutralolie. Når svampene har fået en gylden farve tilsættes lidt soya&hellip;",
            "content_html": "<p><strong>Soyaristede kantarel:</strong></p>\n<p>De resterende små svampe ordnes. De steges ved middelhøj varme på en pande i neutralolie.<br>Når svampene har fået en gylden farve tilsættes lidt soya koges ind til svampene er glaseret.</p>\n<p>Steg godt af og hæld grøntsagsfonden ved.<br>Tag et lille stykke chili og put det i gryden sammen med lidt skrællet, groftskåret ingefær og lidt salt.<br>Rens trompethatte og pighatte og kom dem ned i gryden<br><br></p>\n<img class=\"post__image\" src=\"https://another.network.gitlab.io/groenvald.vip/media/posts/2/kantarel.jpg\" alt=\"\" width=\"720\" height=\"960\"><br><br>Pighvarren fileteres ved et snit ned langs rygbenet, og lad din kniv glide skråt ned langs benene. Til retten skal bruges en hel rygfilet uden ben.<br><br>Skindet fjernes ved, at du ligger fileten på rygsiden og sætter et lille snit ved halen. Kniven trækkes forsigtigt modsat haleenden, mens du holder igen i skindet ved halen. Herefter trimmer du fileten, så du har er pænt rektangulært stykke.<br>Pighvarren steges ved middelhøjvarme i neutral olie.<br><img class=\"post__image\" src=\"https://another.network.gitlab.io/groenvald.vip/media/posts/2/pigvar.jpg\" alt=\"\" width=\"720\" height=\"960\"><br><br>Lige før fileten vendes, putter du en klat smør på panden. Det hjælper med at løsne fisken fra panden<br>Vend fileten og steg den kort på den anden side. Pighvarren er klar til servering.<br><br><em>Velbekomme</em> og god appetit ...\n<p> <img class=\"post__image\" src=\"https://another.network.gitlab.io/groenvald.vip/media/posts/2/eating.jpg\" alt=\"\" width=\"354\" height=\"472\"><br><strong><br></strong>»Vi prøver at tage en masse friske, skandinaviske produkter og mikse dem med krydderier fra hele verden. I stedet for at lave et helt almindeligt køkken, vil vi prøve at servere nye smagsoplevelser«, siger ejeren af Grønvald VIP:</p>\n<p class=\"body__p \">»For eksempel laver vi ikke bare fusionsmad, som placerer sig et sted mellem det franske, italienske eller asiatiske køkken. Vi bruger mange ingredienser fra Mexico og Australien, fortæller GrønSkytten.</p>",
            "image": "https://another.network.gitlab.io/groenvald.vip/media/posts/2/guf.jpg",
            "author": {
                "name": "Nilas Skytte Grønvald &quot;GrønSkytten&quot;"
            },
            "tags": [
            ],
            "date_published": "2019-07-24T19:53:33+02:00",
            "date_modified": "2019-07-24T21:23:32+02:00"
        },
        {
            "id": "https://another.network.gitlab.io/groenvald.vip/en-lille-en-pa-gourmeten.html",
            "url": "https://another.network.gitlab.io/groenvald.vip/en-lille-en-pa-gourmeten.html",
            "title": "En lille en på gourmet´en",
            "summary": " God enkel mad med vægt på det klassiske håndværk, lavet af friske råvarer og serveret i afslappende rammer med udsigt til havet.",
            "content_html": "<p><img src=\"https://another.network.gitlab.io/groenvald.vip/media/posts/1/denvargod.jpg\" alt=\"\" width=\"960\" height=\"415\"></p>\n<p>God enkel mad med vægt på det klassiske håndværk, lavet af friske råvarer og serveret i afslappende rammer med udsigt til havet.</p>",
            "image": "https://another.network.gitlab.io/groenvald.vip/media/posts/1/hyggersig.jpg",
            "author": {
                "name": "Nilas Skytte Grønvald &quot;GrønSkytten&quot;"
            },
            "tags": [
            ],
            "date_published": "2019-07-24T19:43:52+02:00",
            "date_modified": "2019-07-24T21:19:24+02:00"
        }
    ]
}
