<!-- Generator: Adobe Illustrator 21.1.0, SVG Export Plug-In  -->
<svg version="1.1" 
    xmlns="http://www.w3.org/2000/svg" 
    xmlns:xlink="http://www.w3.org/1999/xlink" 
    xmlns:a="http://ns.adobe.com/AdobeSVGViewerExtensions/3.0/" x="0px" y="0px" width="33.7px" height="33.7px" viewBox="0 0 33.7 33.7" style="overflow:scroll;enable-background:new 0 0 33.7 33.7;" xml:space="preserve">
    <style type="text/css">
	.st0{fill:#FFF;fill-opacity:9.000000e-02;stroke:#FFF;stroke-width:1.7377;stroke-miterlimit:10;}
</style>
    <defs></defs>
    <circle class="st0" cx="16.9" cy="16.9" r="16"/>
</svg>
