{
 "description": "Disease symptoms. From the OBO Symptom Ontology",
 "source": "https://github.com/DiseaseOntology/SymptomOntology",
 "poetrywords":
 [
"I",
"feel",
"love",
"alone",
"isolated",
"thinking",
"wrong",
"you",
"not good enough",
"worries",
"afraid",
"end",
"also",
"maybe",
"dont",
"am",
"a little bit",
"and",
"alive",
"blessed",
"free",
"know",
"we",
"will",
"be",
"can't",
"don't",
"fine"
 ]
}
