ubx.c:787:13:doSum	20	static
ubx.c:768:17:readUInt	16	static
ubx.c:776:16:readInt	16	static
ubx.c:756:17:readUShort	8	static
ubx.c:72:6:UBXIdle	32	static
ubx.c:158:6:UBXCheckPackets	32	static
ubx.c:184:6:UBXIsNextValid	0	static
ubx.c:189:5:buildString	48	static
ubx.c:385:8:getString	0	static
ubx.c:396:8:getTPString	0	static
ubx.c:545:6:cfg_add	24	static
ubx.c:580:6:cfg_clear	0	static
ubx.c:586:6:cfg_transmit	24	static
ubx.c:401:6:sendStartSurvey	24	static
ubx.c:414:6:sendLockLocation	32	static
ubx.c:428:6:sendTPConfig	32	static
ubx.c:446:6:sendBaseConfig	16	static
ubx.c:488:6:sendRoverConfig	16	static
ubx.c:537:6:sendTelemConfig	16	static
