log.c:31:6:HAL_UART_TxCpltCallback	16	static
log.c:47:6:sd_openfile	64	static
log.c:75:6:roverLoggerTask	16	static
log.c:145:6:log_setName	16	static
log.c:161:6:log_writeLine	16	static
log.c:172:6:log_sendSync	24	static
