ringbuf.c:29:6:ring_init	0	static
ringbuf.c:39:6:store_char	0	static
ringbuf.c:53:5:Uart_read	0	static
ringbuf.c:70:6:Uart_write	0	static
ringbuf.c:91:5:IsDataAvailable	0	static
ringbuf.c:96:6:ring_uart_isr	4	static
