\babel@toc {english}{}
\contentsline {chapter}{\numberline {1}Drone Data Extraction and Preprocessing}{1}{chapter.1}% 
\contentsline {section}{\numberline {1.1}Download data from drone}{1}{section.1.1}% 
\contentsline {section}{\numberline {1.2}Convert from DAT to CSV}{1}{section.1.2}% 
\contentsline {chapter}{\numberline {2}Drone Data Processing Guide}{2}{chapter.2}% 
\contentsline {section}{\numberline {2.1}Directory structure}{2}{section.2.1}% 
\contentsline {section}{\numberline {2.2}Reading CSV files}{2}{section.2.2}% 
\contentsline {section}{\numberline {2.3}Processing data}{2}{section.2.3}% 
\contentsline {section}{\numberline {2.4}Producing Plots}{3}{section.2.4}% 
\contentsline {section}{\numberline {2.5}Point tagging}{3}{section.2.5}% 
\contentsline {section}{\numberline {2.6}Producing output files}{3}{section.2.6}% 
\contentsline {chapter}{\numberline {3}The Drone Data API reference}{4}{chapter.3}% 
\contentsline {section}{\numberline {3.1}Drone}{4}{section.3.1}% 
\contentsline {chapter}{Python Module Index}{11}{section*.22}% 
\contentsline {chapter}{Index}{12}{section*.23}% 
