(module USB_HOST-PTH (layer F.Cu) (tedit 0)
  (fp_text reference CN1 (at -7.52 -8.29) (layer F.SilkS)
    (effects (font (size 0.77216 0.77216) (thickness 0.138988)) (justify left bottom))
  )
  (fp_text value USBA_FEMALE (at -5.334 0.762) (layer F.Fab)
    (effects (font (size 0.9652 0.9652) (thickness 0.09652)) (justify left bottom))
  )
  (fp_line (start -7.4 6.38) (end 7.4 6.38) (layer F.Fab) (width 0.2032))
  (fp_line (start 7.4 6.38) (end 7.4 -7.92) (layer F.Fab) (width 0.2032))
  (fp_line (start 7.4 -7.92) (end -7.4 -7.92) (layer F.SilkS) (width 0.2032))
  (fp_line (start -7.4 -7.92) (end -7.4 6.38) (layer F.Fab) (width 0.2032))
  (fp_line (start -5.08 -0.94) (end -3.81 4.91) (layer F.Fab) (width 0.2032))
  (fp_line (start -3.81 4.91) (end -2.54 4.91) (layer F.Fab) (width 0.2032))
  (fp_line (start -2.54 4.91) (end -1.27 -0.94) (layer F.Fab) (width 0.2032))
  (fp_line (start 1.27 -0.94) (end 2.54 4.91) (layer F.Fab) (width 0.2032))
  (fp_line (start 2.54 4.91) (end 3.81 4.91) (layer F.Fab) (width 0.2032))
  (fp_line (start 3.81 4.91) (end 5.08 -0.94) (layer F.Fab) (width 0.2032))
  (fp_line (start -7.366 -7.874) (end -7.366 -2.032) (layer F.SilkS) (width 0.127))
  (fp_line (start 7.366 -7.874) (end 7.366 -2.032) (layer F.SilkS) (width 0.127))
  (pad D- thru_hole oval (at -1 -6.52 90) (size 2.916 1.458) (drill 0.95) (layers *.Cu *.Mask)
    (solder_mask_margin 0.0508))
  (pad D+ thru_hole oval (at 1 -6.52 90) (size 2.916 1.458) (drill 0.95) (layers *.Cu *.Mask)
    (solder_mask_margin 0.0508))
  (pad VBUS thru_hole oval (at -3.5 -6.52 90) (size 2.916 1.458) (drill 0.95) (layers *.Cu *.Mask)
    (solder_mask_margin 0.0508))
  (pad GND thru_hole oval (at 3.5 -6.52 90) (size 2.916 1.458) (drill 0.95) (layers *.Cu *.Mask)
    (solder_mask_margin 0.0508))
  (pad S1 thru_hole circle (at -6.57 -3.81) (size 2.9 2.9) (drill 2.3) (layers *.Cu *.Mask)
    (solder_mask_margin 0.0508))
  (pad S2 thru_hole circle (at 6.57 -3.81 180) (size 2.9 2.9) (drill 2.3) (layers *.Cu *.Mask)
    (solder_mask_margin 0.0508))
)
