\relax 
\providecommand\hyper@newdestlabel[2]{}
\providecommand\HyperFirstAtBeginDocument{\AtBeginDocument}
\HyperFirstAtBeginDocument{\ifx\hyper@anchor\@undefined
\global\let\oldcontentsline\contentsline
\gdef\contentsline#1#2#3#4{\oldcontentsline{#1}{#2}{#3}}
\global\let\oldnewlabel\newlabel
\gdef\newlabel#1#2{\newlabelxx{#1}#2}
\gdef\newlabelxx#1#2#3#4#5#6{\oldnewlabel{#1}{{#2}{#3}}}
\AtEndDocument{\ifx\hyper@anchor\@undefined
\let\contentsline\oldcontentsline
\let\newlabel\oldnewlabel
\fi}
\fi}
\global\let\hyper@last\relax 
\gdef\HyperFirstAtBeginDocument#1{#1}
\providecommand\HyField@AuxAddToFields[1]{}
\providecommand\HyField@AuxAddToCoFields[2]{}
\babel@aux{english}{}
\newlabel{index::doc}{{}{1}{}{section*.2}{}}
\@writefile{toc}{\contentsline {chapter}{\numberline {1}Drone Data Extraction and Preprocessing}{1}{chapter.1}\protected@file@percent }
\@writefile{lof}{\addvspace {10\p@ }}
\@writefile{lot}{\addvspace {10\p@ }}
\newlabel{drone:drone-data-extraction-and-preprocessing}{{1}{1}{Drone Data Extraction and Preprocessing}{chapter.1}{}}
\newlabel{drone::doc}{{1}{1}{Drone Data Extraction and Preprocessing}{chapter.1}{}}
\@writefile{toc}{\contentsline {section}{\numberline {1.1}Download data from drone}{1}{section.1.1}\protected@file@percent }
\newlabel{drone:download-data-from-drone}{{1.1}{1}{Download data from drone}{section.1.1}{}}
\@writefile{toc}{\contentsline {section}{\numberline {1.2}Convert from DAT to CSV}{1}{section.1.2}\protected@file@percent }
\newlabel{drone:convert-from-dat-to-csv}{{1.2}{1}{Convert from DAT to CSV}{section.1.2}{}}
\@writefile{toc}{\contentsline {chapter}{\numberline {2}Drone Data Processing Guide}{2}{chapter.2}\protected@file@percent }
\@writefile{lof}{\addvspace {10\p@ }}
\@writefile{lot}{\addvspace {10\p@ }}
\newlabel{guide:drone-data-processing-guide}{{2}{2}{Drone Data Processing Guide}{chapter.2}{}}
\newlabel{guide::doc}{{2}{2}{Drone Data Processing Guide}{chapter.2}{}}
\@writefile{toc}{\contentsline {section}{\numberline {2.1}Directory structure}{2}{section.2.1}\protected@file@percent }
\newlabel{guide:directory-structure}{{2.1}{2}{Directory structure}{section.2.1}{}}
\@writefile{toc}{\contentsline {section}{\numberline {2.2}Reading CSV files}{2}{section.2.2}\protected@file@percent }
\newlabel{guide:reading-csv-files}{{2.2}{2}{Reading CSV files}{section.2.2}{}}
\@writefile{toc}{\contentsline {section}{\numberline {2.3}Processing data}{2}{section.2.3}\protected@file@percent }
\newlabel{guide:processing-data}{{2.3}{2}{Processing data}{section.2.3}{}}
\@writefile{toc}{\contentsline {section}{\numberline {2.4}Producing Plots}{3}{section.2.4}\protected@file@percent }
\newlabel{guide:producing-plots}{{2.4}{3}{Producing Plots}{section.2.4}{}}
\@writefile{toc}{\contentsline {section}{\numberline {2.5}Point tagging}{3}{section.2.5}\protected@file@percent }
\newlabel{guide:point-tagging}{{2.5}{3}{Point tagging}{section.2.5}{}}
\@writefile{toc}{\contentsline {section}{\numberline {2.6}Producing output files}{3}{section.2.6}\protected@file@percent }
\newlabel{guide:producing-output-files}{{2.6}{3}{Producing output files}{section.2.6}{}}
\@writefile{toc}{\contentsline {chapter}{\numberline {3}The Drone Data API reference}{4}{chapter.3}\protected@file@percent }
\@writefile{lof}{\addvspace {10\p@ }}
\@writefile{lot}{\addvspace {10\p@ }}
\newlabel{api:the-drone-data-api-reference}{{3}{4}{The Drone Data API reference}{chapter.3}{}}
\newlabel{api::doc}{{3}{4}{The Drone Data API reference}{chapter.3}{}}
\@writefile{toc}{\contentsline {section}{\numberline {3.1}Drone}{4}{section.3.1}\protected@file@percent }
\newlabel{api:module-drone}{{3.1}{4}{Drone}{section.3.1}{}}
\newlabel{api:drone}{{3.1}{4}{Drone}{section.3.1}{}}
\newlabel{api:drone.chop_time}{{3.1}{4}{Drone}{section*.3}{}}
\newlabel{api:drone.dist_between_times}{{3.1}{4}{Drone}{section*.4}{}}
\newlabel{api:drone.fill_avMov}{{3.1}{4}{Drone}{section*.5}{}}
\newlabel{api:drone.fill_moving}{{3.1}{5}{Drone}{section*.6}{}}
\newlabel{api:drone.interval_stats}{{3.1}{5}{Drone}{section*.7}{}}
\newlabel{api:drone.make_ENU}{{3.1}{5}{Drone}{section*.8}{}}
\newlabel{api:drone.make_az_el}{{3.1}{6}{Drone}{section*.9}{}}
\newlabel{api:drone.mark_point}{{3.1}{6}{Drone}{section*.10}{}}
\newlabel{api:drone.output_df}{{3.1}{7}{Drone}{section*.11}{}}
\newlabel{api:drone.output_points}{{3.1}{7}{Drone}{section*.12}{}}
\newlabel{api:drone.plot_height}{{3.1}{7}{Drone}{section*.13}{}}
\newlabel{api:drone.plot_latitude}{{3.1}{7}{Drone}{section*.14}{}}
\newlabel{api:drone.plot_longitude}{{3.1}{8}{Drone}{section*.15}{}}
\newlabel{api:drone.plot_moving}{{3.1}{8}{Drone}{section*.16}{}}
\newlabel{api:drone.plot_points}{{3.1}{8}{Drone}{section*.17}{}}
\newlabel{api:drone.plot_satellite}{{3.1}{9}{Drone}{section*.18}{}}
\newlabel{api:drone.point_stats}{{3.1}{9}{Drone}{section*.19}{}}
\newlabel{api:drone.process_files}{{3.1}{9}{Drone}{section*.20}{}}
\newlabel{api:drone.set_border}{{3.1}{10}{Drone}{section*.21}{}}
\@writefile{toc}{\contentsline {chapter}{Python Module Index}{11}{section*.22}\protected@file@percent }
\@writefile{toc}{\contentsline {chapter}{Index}{12}{section*.23}\protected@file@percent }
