07082126
07082136
07082146
07082156
07082206
07082216
07082226
07082236
07082246
07082256
07082306
07082316
07082326
07082336
07082346
07082356
07090006
07090016
07090026
07090036
07090046
07090056
07090106
07090116
07090126
07090136
07090146
07090156
07090206
07090216
07090226
07090236
07090246
07090256
07090306
07090316
07090326
07090336
ls.txt
