chr - EUChr11 Eur11 1 37154267 30,108,209
chr - EUChr10 Eur10 1 40619429 30,108,209
chr - EUChr09 Eur9 1 35568223 30,108,209
chr - EUChr08 Eur8 1 60186531 30,108,209
chr - EUChr07 Eur7 1 42454922 30,108,209
chr - EUChr06 Eur6 1 47639447 30,108,209
chr - EUChr05 Eur5 1 40242915 30,108,209
chr - EUChr04 Eur4 1 35561653 30,108,209
chr - EUChr03 Eur3 1 49881599 30,108,209
chr - EUChr02 Eur2 1 46294847 30,108,209
chr - EUChr01 Eur1 1 45562418 30,108,209
