Scaffold ID,scaffold position,LG,genetic position
scf7180000003597_nd:60700-2431300,789075,1,2.357
scf7180000003597_nd:60700-2431300,674327,1,2.343
scf7180000003597_nd:60700-2431300,637577,1,2.359
scf7180000003597_nd:60700-2431300,576446,1,2.373
scf7180000003597_nd:60700-2431300,551706,1,2.373
scf7180000003597_nd:60700-2431300,473584,1,2.411
scf7180000003597_nd:2434400-5524000,2481118,1,6.646
scf7180000003597_nd:2434400-5524000,2398420,1,5.863
scf7180000002626_nd:0-3432369,2058788,1,4.124
scf7180000003194_nd:0-856900,787737,1,0
scf7180000003597_nd:60700-2431300,344560,1,2.077
scf7180000003597_nd:2434400-5524000,808041,1,4.965
scf7180000003597_nd:2434400-5524000,950068,1,4.989
scf7180000003597_nd:2434400-5524000,1054016,1,4.977
scf7180000002602_nd:0-2062600,1524606,1,13.35
scf7180000002681_nd:369800-403800,8170,1,13.35
scf7180000002602_nd:0-2062600,895069,1,13.039
scf7180000002602_nd:0-2062600,545813,1,12.18
scf7180000002602_nd:0-2062600,173193,1,11.303
scf7180000002579_nd:10616700-21372200,5047633,1,11.006
scf7180000002579_nd:10616700-21372200,4873764,1,11.011
scf7180000002579_nd:10616700-21372200,4794468,1,10.728
scf7180000002579_nd:10616700-21372200,4617831,1,10.434
scf7180000002579_nd:10616700-21372200,4286675,1,10.152
scf7180000002607_nd:660200-12628500,11302739,1,10.151
scf7180000002579_nd:10616700-21372200,3785055,1,10.147
scf7180000002579_nd:10616700-21372200,3733232,1,10.111
scf7180000002579_nd:10616700-21372200,3671326,1,10.151
scf7180000002579_nd:10616700-21372200,3520900,1,9.859
scf7180000002579_nd:10616700-21372200,3392742,1,9.845
scf7180000002579_nd:10616700-21372200,1991446,1,8.778
scf7180000002579_nd:10616700-21372200,1212761,1,7.895
scf7180000002579_nd:10616700-21372200,382292,1,7.909
scf7180000002579_nd:10616700-21372200,251402,1,7.902
scf7180000002667_nd:18300-1893730,1740138,1,35.004
scf7180000002857_nd:0-1048484,975046,1,36.312
scf7180000002857_nd:0-1048484,955419,1,36.987
scf7180000002857_nd:0-1048484,317565,1,39.402
scf7180000002657_nd:882500-4377700,2163848,1,18.244
scf7180000002657_nd:882500-4377700,2220421,1,18.254
scf7180000002657_nd:882500-4377700,2284919,1,18.242
scf7180000002657_nd:882500-4377700,2522729,1,18.256
scf7180000002657_nd:882500-4377700,2778843,1,17.648
scf7180000002623_nd:1031000-2097600,775776,1,15.69
scf7180000002623_nd:1031000-2097600,397662,1,15.688
scf7180000002623_nd:1031000-2097600,290522,1,15.691
scf7180000002623_nd:500-972700,882227,1,15.749
scf7180000002623_nd:500-972700,778831,1,15.607
scf7180000002623_nd:500-972700,387118,1,15.695
scf7180000003544_nd:1700-680224,75365,1,7.987
scf7180000003520_nd:0-403200,138799,1,7.902
scf7180000002667_nd:18300-1893730,1201273,1,31.831
scf7180000002667_nd:18300-1893730,934577,1,29.253
scf7180000002667_nd:18300-1893730,845204,1,28.934
scf7180000002667_nd:18300-1893730,552943,1,28.016
scf7180000002659_nd:45800-578300,77208,1,25.493
scf7180000002659_nd:45800-578300,261617,1,24.56
scf7180000002657_nd:3600-882200,194345,1,24.569
scf7180000002657_nd:3600-882200,253870,1,23.663
scf7180000002657_nd:3600-882200,761227,1,20.335
scf7180000002657_nd:882500-4377700,118585,1,20.328
scf7180000002657_nd:882500-4377700,151689,1,20.328
scf7180000002657_nd:882500-4377700,995702,1,19.132
scf7180000002657_nd:882500-4377700,1293593,1,19.13
scf7180000002657_nd:882500-4377700,1468054,1,19.13
scf7180000002657_nd:882500-4377700,1468537,1,19.234
scf7180000002657_nd:882500-4377700,1484484,1,18.831
scf7180000002657_nd:882500-4377700,1963285,1,18.242
scf7180000003517_nd:253400-1398500,715105,1,41.427
scf7180000003097_nd:4000-649300,276875,1,44.115
scf7180000003097_nd:4000-649300,60110,1,45.018
scf7180000003456_nd:855400-2008100,1091135,1,45.018
scf7180000003456_nd:855400-2008100,874965,1,45.015
scf7180000003456_nd:855400-2008100,701656,1,45.002
scf7180000003456_nd:855400-2008100,589105,1,45.285
scf7180000003456_nd:855400-2008100,582444,1,45.287
scf7180000003456_nd:855400-2008100,247634,1,45.294
scf7180000003456_nd:855400-2008100,229351,1,45.262
scf7180000003456_nd:855400-2008100,183354,1,45.892
scf7180000003456_nd:16600-855100,606726,1,46.023
scf7180000003456_nd:16600-855100,459778,1,47.079
scf7180000002604_nd:8500-470900,111556,1,47.99
scf7180000002604_nd:8500-470900,186755,1,47.99
scf7180000002604_nd:8500-470900,190255,1,48.291
scf7180000002604_nd:8500-470900,238267,1,48.643
scf7180000002604_nd:8500-470900,282974,1,48.891
scf7180000003592_nd:1500-248000,26848,1,49.491
scf7180000002604_nd:485600-2387900,52441,1,50.981
scf7180000002604_nd:485600-2387900,657180,1,53.086
scf7180000002604_nd:485600-2387900,659215,1,53.086
scf7180000002604_nd:485600-2387900,762527,1,53.386
scf7180000002604_nd:485600-2387900,762694,1,53.385
scf7180000002604_nd:485600-2387900,771751,1,53.387
scf7180000002604_nd:485600-2387900,773791,1,53.386
scf7180000002604_nd:485600-2387900,904200,1,54.248
scf7180000002604_nd:485600-2387900,1428542,1,57.268
scf7180000002604_nd:485600-2387900,1542764,1,57.877
scf7180000002604_nd:485600-2387900,1871134,1,57.876
scf7180000003275_nd:2400-58263,4366,1,57.876
scf7180000002714_nd:300-393100,283248,1,60.293
scf7180000002714_nd:300-393100,333602,1,60.569
scf7180000002714_nd:393500-560900,82514,1,60.897
scf7180000003127_nd:12500-666449,33550,1,61.199
scf7180000003127_nd:12500-666449,467997,1,62.45
scf7180000002864_nd:0-2835200,403318,1,64.788
scf7180000002864_nd:0-2835200,474005,1,65.089
scf7180000002864_nd:0-2835200,474934,1,65.09
scf7180000002864_nd:0-2835200,519385,1,65.991
scf7180000002864_nd:0-2835200,676107,1,66.889
scf7180000002864_nd:0-2835200,787149,1,68.085
scf7180000002864_nd:0-2835200,932335,1,68.388
scf7180000002864_nd:0-2835200,1044153,1,68.967
scf7180000002864_nd:0-2835200,1097096,1,69.858
scf7180000002864_nd:0-2835200,1218737,1,69.864
scf7180000002864_nd:0-2835200,1344630,1,70.161
scf7180000002864_nd:0-2835200,2005484,1,70.45
scf7180000002864_nd:0-2835200,2131992,1,70.464
scf7180000002864_nd:0-2835200,2155047,1,70.746
scf7180000002864_nd:0-2835200,2173502,1,70.711
scf7180000002864_nd:0-2835200,2309714,1,71.021
scf7180000002864_nd:0-2835200,2412695,1,71.042
scf7180000002932_nd:700-932300,476855,1,72.795
scf7180000002932_nd:700-932300,687566,1,73.093
scf7180000002932_nd:700-932300,744265,1,73.408
scf7180000002932_nd:700-932300,747181,1,73.704
scf7180000002932_nd:700-932300,759998,1,74
scf7180000002825_nd:3336900-3770600,44079,1,74.593
scf7180000002825_nd:2617500-3336700,92414,1,76.668
scf7180000003561_nd:0-1268092,252995,1,77.26
scf7180000003561_nd:0-1268092,347935,1,77.26
scf7180000003561_nd:0-1268092,372232,1,77.54
scf7180000003561_nd:0-1268092,1068036,1,77.54
scf7180000002609_nd:2000-2495700,155663,6,48.315
scf7180000002609_nd:2000-2495700,146041,6,48.307
scf7180000002764_nd:0-584400,158671,2,0.12
scf7180000002764_nd:0-584400,468811,2,0
scf7180000002764_nd:0-584400,478111,2,0.017
scf7180000003579_nd:2750800-5673800,2763103,2,0.718
scf7180000003579_nd:2750800-5673800,686838,2,3.467
scf7180000003579_nd:2750800-5673800,474911,2,4.984
scf7180000003579_nd:2750800-5673800,265889,2,5.878
scf7180000003579_nd:2750800-5673800,254861,2,5.878
scf7180000003579_nd:2750800-5673800,56508,2,6.114
scf7180000003579_nd:2750800-5673800,45197,2,6.181
scf7180000003579_nd:1188900-2750500,662619,2,7.081
scf7180000003579_nd:1188900-2750500,6212,2,9.812
scf7180000003579_nd:1800-1188300,1124946,2,10.115
scf7180000003579_nd:1800-1188300,1104062,2,10.099
scf7180000003579_nd:1800-1188300,1026924,2,10.418
scf7180000003579_nd:1800-1188300,894883,2,10.982
scf7180000003579_nd:1800-1188300,889157,2,11.012
scf7180000003579_nd:1800-1188300,801038,2,11.579
scf7180000003579_nd:1800-1188300,725599,2,11.91
scf7180000002594_nd:121000-1323800,295931,2,13.555
scf7180000002594_nd:121000-1323800,385240,2,13.853
scf7180000002594_nd:121000-1323800,780533,2,14.959
scf7180000002594_nd:121000-1323800,783255,2,14.981
scf7180000002594_nd:121000-1323800,1068439,2,15.621
scf7180000002594_nd:1323900-2081900,165767,2,15.734
scf7180000002666_nd:10700-398800,195204,2,16.507
scf7180000002705_nd:1800-149300,70751,2,27.507
scf7180000002705_nd:1800-149300,73235,2,27.503
scf7180000002705_nd:1800-149300,89433,2,16.507
scf7180000002705_nd:149500-754400,356524,2,16.499
scf7180000003264_nd:0-157791,106073,2,18.283
scf7180000002732_nd:2437700-4065900,209904,7,0.298
scf7180000002732_nd:2437700-4065900,212409,7,1.185
scf7180000003576_nd:1900-1107700,456660,2,21.533
scf7180000003593_nd:3119300-5719000,1235194,2,18.874
scf7180000003131_nd:800-610400,496844,2,18.103
scf7180000002875_nd:100-259400,68401,2,18.067
scf7180000003593_nd:3119300-5719000,2542528,2,18.284
scf7180000003593_nd:3119300-5719000,914882,2,18.804
scf7180000003593_nd:626500-2206200,983408,2,20.161
scf7180000003593_nd:626500-2206200,599390,2,20.69
scf7180000002825_nd:406200-2617100,544914,2,23.284
scf7180000002825_nd:406200-2617100,1332838,2,23.859
scf7180000002825_nd:406200-2617100,1582546,2,24.142
scf7180000002825_nd:406200-2617100,1583042,2,24.48
scf7180000003578_nd:3788200-5267355,615693,2,24.87
scf7180000003578_nd:3788200-5267355,1439281,2,24.799
scf7180000003578_nd:3788200-5267355,1442086,2,24.673
scf7180000003600_nd:12100-2147715,1855144,2,24.763
scf7180000003600_nd:12100-2147715,1702635,2,24.758
scf7180000003600_nd:12100-2147715,199998,2,24.764
scf7180000002825_nd:406200-2617100,1841490,2,24.857
scf7180000002751_nd:82400-2040400,1004275,2,25.316
scf7180000002751_nd:82400-2040400,1023328,2,25.24
scf7180000002751_nd:82400-2040400,1032217,2,25.312
scf7180000002751_nd:82400-2040400,848017,2,25.312
scf7180000002787_nd:162000-2117100,689763,2,28.092
scf7180000002602_nd:3689200-6409465,2555696,2,27.797
scf7180000002828_nd:348200-464217,26232,2,27.506
scf7180000002593_nd:79000-1910000,1768829,2,27.506
scf7180000003594_nd:529900-688200,150442,2,27.506
scf7180000002815_nd:300-318900,197218,2,27.507
scf7180000003042_nd:20200-486900,11597,2,25.029
scf7180000002729_nd:900-848910,530213,2,26.452
scf7180000002837_nd:0-308700,64363,2,26.362
scf7180000002729_nd:900-848910,606692,2,26.362
scf7180000002729_nd:900-848910,617729,2,26.567
scf7180000002684_nd:7200-2111300,957860,2,27.513
scf7180000003061_nd:500-361972,83735,2,25.496
scf7180000002595_nd:1300-2732500,2121675,5,26.211
scf7180000002787_nd:162000-2117100,1053618,2,28.092
scf7180000002787_nd:162000-2117100,1626315,2,28.121
scf7180000002787_nd:162000-2117100,1790728,2,28.103
scf7180000002665_nd:2055600-5357197,2720736,2,28.279
scf7180000002665_nd:2055600-5357197,2618542,2,28.38
scf7180000002665_nd:2055600-5357197,2514152,2,30.332
scf7180000002665_nd:2055600-5357197,2299150,2,30.66
scf7180000002665_nd:2055600-5357197,2213476,2,31.265
scf7180000002665_nd:2055600-5357197,2102533,2,31.797
scf7180000002665_nd:2055600-5357197,1822504,2,32.094
scf7180000002665_nd:2055600-5357197,1322944,2,35.331
scf7180000002665_nd:2055600-5357197,1013386,2,35.331
scf7180000002665_nd:2055600-5357197,910829,2,35.389
scf7180000002665_nd:2055600-5357197,873168,2,35.375
scf7180000002665_nd:2055600-5357197,269973,2,35.644
scf7180000002665_nd:2055600-5357197,219085,2,36.121
scf7180000002665_nd:2055600-5357197,114090,2,36.551
scf7180000002665_nd:2055600-5357197,82871,2,36.696
scf7180000002665_nd:7900-2051900,1680407,2,41.874
scf7180000002665_nd:7900-2051900,1679470,2,41.843
scf7180000003593_nd:626500-2206200,1440093,2,20.163
scf7180000002602_nd:2063000-3683700,1458415,1,15.688
scf7180000002602_nd:2063000-3683700,721226,1,14.227
scf7180000002602_nd:2063000-3683700,696551,1,14.239
scf7180000002602_nd:2063000-3683700,10414,1,13.934
scf7180000003574_nd:41400-894300,27663,2,52.366
scf7180000003574_nd:41400-894300,111221,2,54.029
scf7180000003574_nd:41400-894300,116053,2,54.029
scf7180000003574_nd:41400-894300,342564,2,55.225
scf7180000003574_nd:41400-894300,471809,2,55.937
scf7180000003583_nd:15178500-20706000,5418726,2,56.009
scf7180000003583_nd:15178500-20706000,5249891,2,56.335
scf7180000003583_nd:15178500-20706000,4971813,2,59.21
scf7180000003583_nd:15178500-20706000,4802263,2,60.474
scf7180000003583_nd:15178500-20706000,4795411,2,60.473
scf7180000003583_nd:15178500-20706000,4179929,2,66.949
scf7180000003583_nd:15178500-20706000,4387946,2,62.595
scf7180000003583_nd:15178500-20706000,4485473,2,61.723
scf7180000003583_nd:15178500-20706000,4491109,2,61.677
scf7180000003583_nd:15178500-20706000,4544417,2,60.474
scf7180000003001_nd:3700-1542400,1455516,2,71.749
scf7180000003001_nd:3700-1542400,1460205,2,71.742
scf7180000003483_nd:45400-52400,2651,2,71.749
scf7180000003001_nd:3700-1542400,1525861,2,72.334
scf7180000003001_nd:1542700-2270682,38356,2,72.328
scf7180000003001_nd:1542700-2270682,47598,2,72.627
scf7180000003001_nd:1542700-2270682,117983,2,72.597
scf7180000003001_nd:1542700-2270682,126682,2,72.627
scf7180000003001_nd:1542700-2270682,220179,2,73.211
scf7180000003001_nd:1542700-2270682,294914,2,73.206
scf7180000003001_nd:1542700-2270682,329659,2,73.211
scf7180000003001_nd:1542700-2270682,371590,2,73.479
scf7180000003001_nd:1542700-2270682,395611,2,73.454
scf7180000003001_nd:1542700-2270682,529725,2,73.794
scf7180000003001_nd:1542700-2270682,535087,2,73.785
scf7180000003001_nd:1542700-2270682,561194,2,73.794
scf7180000003583_nd:2161400-3116400,874654,2,75.54
scf7180000003583_nd:2161400-3116400,858044,2,75.521
scf7180000003583_nd:2161400-3116400,818638,2,75.83
scf7180000003583_nd:2161400-3116400,786688,2,76.379
scf7180000003583_nd:2161400-3116400,740468,2,76.379
scf7180000003583_nd:2161400-3116400,650322,2,76.379
scf7180000003583_nd:2161400-3116400,614113,2,76.38
scf7180000003583_nd:2161400-3116400,497368,2,76.671
scf7180000003583_nd:2161400-3116400,387482,2,76.667
scf7180000003583_nd:2161400-3116400,386877,2,76.671
scf7180000003583_nd:2161400-3116400,184185,2,77.547
scf7180000003583_nd:2161400-3116400,168636,2,77.839
scf7180000003583_nd:2161400-3116400,128755,2,77.965
scf7180000003583_nd:2161400-3116400,94835,2,77.841
scf7180000003583_nd:2161400-3116400,39232,2,77.839
scf7180000003583_nd:2161400-3116400,37206,2,77.839
scf7180000003583_nd:1086600-2161100,915309,2,78.422
scf7180000003583_nd:1086600-2161100,874388,2,78.999
scf7180000003583_nd:1086600-2161100,794221,2,79.091
scf7180000003583_nd:1086600-2161100,668168,2,79.874
scf7180000003583_nd:1086600-2161100,637166,2,79.874
scf7180000003583_nd:1086600-2161100,578888,2,80.165
scf7180000003583_nd:1086600-2161100,550662,2,80.456
scf7180000003583_nd:1086600-2161100,525307,2,80.456
scf7180000003583_nd:1086600-2161100,394685,2,80.731
scf7180000003583_nd:1086600-2161100,379657,2,80.731
scf7180000003583_nd:1086600-2161100,347436,2,81.021
scf7180000003583_nd:1086600-2161100,317887,2,81.603
scf7180000003583_nd:1086600-2161100,289133,2,81.904
scf7180000003583_nd:1086600-2161100,287448,2,81.894
scf7180000003583_nd:1086600-2161100,281867,2,81.894
scf7180000003583_nd:1086600-2161100,244179,2,82.214
scf7180000003583_nd:1086600-2161100,213499,2,82.185
scf7180000003583_nd:1086600-2161100,76738,2,82.477
scf7180000003583_nd:1086600-2161100,7904,2,82.768
scf7180000003583_nd:0-1086400,1060463,2,82.768
scf7180000003583_nd:0-1086400,1036940,2,83.06
scf7180000003583_nd:0-1086400,937326,2,83.06
scf7180000003583_nd:0-1086400,937228,2,83.106
scf7180000003583_nd:0-1086400,823504,2,83.134
scf7180000003583_nd:0-1086400,818647,2,82.953
scf7180000003583_nd:0-1086400,701488,2,82.941
scf7180000003583_nd:5207300-10260500,564724,5,60.367
scf7180000003196_nd:0-297237,233804,7,3.19
scf7180000002682_nd:0-4834500,4701290,3,89.018
scf7180000002579_nd:7700-7662300,1891525,3,0
scf7180000002579_nd:7700-7662300,2104372,3,1.477
scf7180000002579_nd:7700-7662300,2205340,3,1.466
scf7180000002579_nd:7700-7662300,2784559,3,5.761
scf7180000002579_nd:7700-7662300,5067223,3,17.535
scf7180000002579_nd:7700-7662300,5542723,3,26.215
scf7180000003522_nd:470200-2304200,1591028,3,34.269
scf7180000002602_nd:0-2062600,381502,1,70.422
scf7180000003522_nd:470200-2304200,1749464,3,32.497
scf7180000003522_nd:2304400-3296400,26698,3,31.934
scf7180000003124_nd:300-2782300,1133713,3,38.158
scf7180000003124_nd:300-2782300,1128791,3,38.092
scf7180000003124_nd:300-2782300,1128677,3,38.067
scf7180000003124_nd:300-2782300,644888,3,37.537
scf7180000003556_nd:1800-992908,496360,3,41.23
scf7180000003124_nd:300-2782300,2387313,3,40.391
scf7180000003124_nd:300-2782300,2284696,3,40.422
scf7180000003124_nd:300-2782300,1759347,3,39.857
scf7180000003124_nd:300-2782300,1613213,3,39.264
scf7180000002665_nd:2055600-5357197,453827,11,14.276
scf7180000002682_nd:0-4834500,1692582,3,46.01
scf7180000002682_nd:0-4834500,1902587,3,47.561
scf7180000002682_nd:0-4834500,2136422,3,49.706
scf7180000002682_nd:0-4834500,2373057,3,49.977
scf7180000002682_nd:0-4834500,2339789,3,50.166
scf7180000002682_nd:0-4834500,2439479,3,50.156
scf7180000002682_nd:0-4834500,2602626,3,50.473
scf7180000002682_nd:0-4834500,3098310,3,51.393
scf7180000002591_nd:8600-950800,868888,3,60.338
scf7180000002591_nd:8600-950800,820874,3,60.324
scf7180000002591_nd:8600-950800,252175,3,60.944
scf7180000002682_nd:0-4834500,3941586,3,57.806
scf7180000002590_nd:1714500-3074900,135816,5,34.353
scf7180000002990_nd:2600-626524,577150,3,66.991
scf7180000002990_nd:2600-626524,227099,3,66.07
scf7180000003142_nd:9400-427302,117013,3,68.497
scf7180000003583_nd:3116700-5192700,17829,3,68.497
scf7180000003583_nd:3116700-5192700,22113,3,68.483
scf7180000003583_nd:3116700-5192700,65196,3,69.152
scf7180000003583_nd:3116700-5192700,89484,3,69.095
scf7180000003583_nd:3116700-5192700,346137,3,70.538
scf7180000003583_nd:3116700-5192700,519921,3,70.598
scf7180000003583_nd:3116700-5192700,563443,3,70.594
scf7180000003583_nd:3116700-5192700,633810,3,70.583
scf7180000003583_nd:3116700-5192700,629335,3,70.598
scf7180000002922_nd:2900-1377900,214168,3,67.895
scf7180000003142_nd:9400-427302,285775,3,68.198
scf7180000003583_nd:3116700-5192700,1596570,3,72.481
scf7180000003583_nd:3116700-5192700,1706574,3,72.381
scf7180000003583_nd:3116700-5192700,1838338,3,72.387
scf7180000003583_nd:3116700-5192700,1920957,3,72.686
scf7180000003022_nd:0-660700,400315,3,74.484
scf7180000003022_nd:0-660700,214462,3,76.27
scf7180000003551_nd:207000-3365000,133580,3,77.165
scf7180000003551_nd:207000-3365000,269418,3,77.165
scf7180000003551_nd:207000-3365000,558818,3,78.645
scf7180000003583_nd:3116700-5192700,1321211,3,71.778
scf7180000003583_nd:3116700-5192700,1284419,3,71.483
scf7180000002824_nd:5000-503589,79315,3,88.67
scf7180000002824_nd:5000-503589,58823,3,88.682
scf7180000002731_nd:900-615900,568755,3,88.671
scf7180000002731_nd:900-615900,555371,3,88.682
scf7180000002731_nd:900-615900,553004,3,88.757
scf7180000002731_nd:900-615900,482694,3,88.683
scf7180000002731_nd:900-615900,345717,3,88.671
scf7180000002657_nd:4378100-5568100,1031617,3,87.824
scf7180000002657_nd:4378100-5568100,1024920,3,87.813
scf7180000003551_nd:207000-3365000,677336,3,78.645
scf7180000003551_nd:207000-3365000,1186956,3,79.241
scf7180000003551_nd:207000-3365000,1307318,3,79.854
scf7180000003551_nd:207000-3365000,1455680,3,80.124
scf7180000003551_nd:207000-3365000,1456399,3,80.128
scf7180000003551_nd:207000-3365000,1467325,3,80.422
scf7180000003551_nd:207000-3365000,1594519,3,81.908
scf7180000003551_nd:207000-3365000,1595993,3,81.908
scf7180000003551_nd:207000-3365000,2529802,3,82.501
scf7180000003551_nd:207000-3365000,2777999,3,83.963
scf7180000003551_nd:207000-3365000,2959841,3,86.011
scf7180000002657_nd:4378100-5568100,249857,3,86.608
scf7180000002657_nd:4378100-5568100,298057,3,86.379
scf7180000002657_nd:4378100-5568100,403964,3,86.927
scf7180000002657_nd:4378100-5568100,640564,5,74.117
scf7180000002959_nd:779200-4874100,748004,4,0
scf7180000002959_nd:779200-4874100,1544519,5,48.236
scf7180000002959_nd:779200-4874100,1933951,4,0.318
scf7180000002959_nd:779200-4874100,2082886,4,1.441
scf7180000002959_nd:779200-4874100,2327904,4,3.124
scf7180000002959_nd:779200-4874100,2690348,4,3.837
scf7180000002959_nd:779200-4874100,2732233,4,3.875
scf7180000002959_nd:779200-4874100,2778667,4,3.837
scf7180000002959_nd:779200-4874100,3042359,4,5.027
scf7180000002816_nd:22500-1202600,482325,4,5.611
scf7180000002621_nd:716600-3172500,212650,4,6.506
scf7180000002621_nd:716600-3172500,213481,4,6.518
scf7180000002621_nd:716600-3172500,232076,4,6.518
scf7180000002621_nd:716600-3172500,232773,4,6.537
scf7180000002579_nd:10616700-21372200,4904956,4,6.501
scf7180000002621_nd:716600-3172500,730646,4,6.57
scf7180000002621_nd:716600-3172500,1614752,4,6.814
scf7180000002621_nd:716600-3172500,1653349,4,7.405
scf7180000002621_nd:716600-3172500,1915286,4,7.984
scf7180000002621_nd:716600-3172500,2024537,4,8.651
scf7180000002621_nd:716600-3172500,2191455,4,8.885
scf7180000002621_nd:716600-3172500,2392054,4,9.766
scf7180000002621_nd:3172700-3618300,193295,4,10.062
scf7180000002621_nd:3172700-3618300,194262,4,10.055
scf7180000003588_nd:36300-1103200,319615,5,50.337
scf7180000002709_nd:0-1481200,43880,4,10.699
scf7180000002709_nd:0-1481200,559801,4,11.243
scf7180000002709_nd:0-1481200,798077,4,12.074
scf7180000002709_nd:0-1481200,957803,4,12.065
scf7180000003155_nd:0-2640700,2541970,4,12.792
scf7180000003155_nd:0-2640700,2549292,4,12.663
scf7180000003083_nd:8200-752700,566657,4,12.663
scf7180000003131_nd:800-610400,44917,4,12.069
scf7180000003129_nd:1200-297100,160613,4,12.074
scf7180000003129_nd:1200-297100,107614,4,12.071
scf7180000002730_nd:0-1061000,16166,4,17.85
scf7180000002691_nd:5900-325700,30577,4,17.853
scf7180000003253_nd:500-256097,189595,4,20.808
scf7180000003253_nd:500-256097,80451,4,21.097
scf7180000003571_nd:0-3968200,1152505,4,21.101
scf7180000003571_nd:0-3968200,1421006,4,21.465
scf7180000003571_nd:0-3968200,1425697,4,21.112
scf7180000003571_nd:0-3968200,1438212,4,20.968
scf7180000003571_nd:0-3968200,2455160,4,21.389
scf7180000003571_nd:0-3968200,2494923,4,21.336
scf7180000003571_nd:0-3968200,2980495,4,21.385
scf7180000003571_nd:0-3968200,3358323,4,21.711
scf7180000003571_nd:0-3968200,3601381,4,22.008
scf7180000003573_nd:4081900-5896500,1151014,4,24.387
scf7180000003573_nd:4081900-5896500,1076560,4,24.377
scf7180000003155_nd:0-2640700,1870098,4,12.918
scf7180000003155_nd:0-2640700,1869997,4,13.224
scf7180000003155_nd:0-2640700,1844934,4,13.224
scf7180000003155_nd:0-2640700,1641514,4,14.067
scf7180000003155_nd:0-2640700,1359431,4,15.813
scf7180000003155_nd:0-2640700,1357317,4,15.813
scf7180000003155_nd:0-2640700,1333480,4,15.953
scf7180000003155_nd:0-2640700,1333357,4,15.764
scf7180000002695_nd:1224300-1936435,146472,9,48.442
scf7180000003155_nd:0-2640700,241206,4,16.678
scf7180000002730_nd:0-1061000,1012097,4,17.59
scf7180000003295_nd:0-224184,149735,4,17.568
scf7180000003578_nd:2628000-3788100,1110176,4,17.589
scf7180000003573_nd:9620400-13114900,2367159,4,17.57
scf7180000002590_nd:0-637300,274512,4,17.589
scf7180000003573_nd:4081900-5896500,30157,4,25.244
scf7180000002870_nd:1915300-3929200,1062451,5,48.157
scf7180000002870_nd:1915300-3929200,1053049,5,48.055
scf7180000002870_nd:1915300-3929200,362597,5,48.487
scf7180000002622_nd:3425500-7370500,1701758,5,48.745
scf7180000002870_nd:1915300-3929200,17641,5,48.789
scf7180000003573_nd:137900-3816600,2865591,4,25.571
scf7180000003573_nd:137900-3816600,2755229,4,25.571
scf7180000003573_nd:137900-3816600,2568942,4,25.926
scf7180000003573_nd:137900-3816600,2373880,4,27.292
scf7180000003573_nd:137900-3816600,2328677,4,27.311
scf7180000003573_nd:137900-3816600,2324144,4,27.187
scf7180000003573_nd:137900-3816600,2265543,4,27.284
scf7180000003573_nd:137900-3816600,2260711,4,27.291
scf7180000003573_nd:137900-3816600,2006641,4,29.237
scf7180000003573_nd:137900-3816600,1806987,4,29.843
scf7180000003573_nd:137900-3816600,1729406,4,30.147
scf7180000003573_nd:137900-3816600,1687016,4,30.746
scf7180000003573_nd:137900-3816600,1575429,4,31.353
scf7180000003573_nd:137900-3816600,1447350,4,31.659
scf7180000003573_nd:137900-3816600,1272839,4,31.659
scf7180000003573_nd:137900-3816600,1226694,4,32.268
scf7180000003573_nd:137900-3816600,1115484,4,34.716
scf7180000003573_nd:137900-3816600,970945,4,35.738
scf7180000003573_nd:137900-3816600,685644,4,36.05
scf7180000003573_nd:137900-3816600,617696,4,36.396
scf7180000003573_nd:137900-3816600,351368,4,36.359
scf7180000003573_nd:137900-3816600,166224,4,38.184
scf7180000003573_nd:137900-3816600,140580,4,38.48
scf7180000003573_nd:137900-3816600,88046,4,38.494
scf7180000002671_nd:800-1914100,672940,4,47.39
scf7180000002671_nd:800-1914100,855221,4,48.491
scf7180000002671_nd:800-1914100,1002056,4,49.838
scf7180000002671_nd:800-1914100,1020075,4,49.838
scf7180000002671_nd:800-1914100,1059862,4,49.783
scf7180000002671_nd:800-1914100,1096690,4,50.142
scf7180000002671_nd:800-1914100,1542780,4,51.35
scf7180000002671_nd:800-1914100,1584690,4,51.952
scf7180000002671_nd:800-1914100,1726875,4,53.092
scf7180000002671_nd:800-1914100,1755072,4,53.44
scf7180000002671_nd:800-1914100,1824163,4,53.438
scf7180000003548_nd:375600-716243,142442,4,54.035
scf7180000003548_nd:375600-716243,72230,4,55.229
scf7180000003548_nd:375600-716243,49200,4,55.515
scf7180000003548_nd:10800-368100,222779,4,55.518
scf7180000003548_nd:10800-368100,99515,4,57.576
scf7180000003548_nd:10800-368100,98973,4,57.593
scf7180000003548_nd:10800-368100,77597,4,57.871
scf7180000003016_nd:0-587900,524680,4,59.586
scf7180000003016_nd:0-587900,371633,4,61.068
scf7180000003016_nd:0-587900,330858,4,61.086
scf7180000003026_nd:0-892784,189182,5,60.409
scf7180000002740_nd:0-874800,771357,5,0
scf7180000002740_nd:0-874800,770387,5,0.016
scf7180000002740_nd:0-874800,661813,5,0.39
scf7180000002740_nd:0-874800,577412,5,0.654
scf7180000002740_nd:0-874800,559313,5,0.232
scf7180000002740_nd:0-874800,385028,5,0.737
scf7180000002740_nd:0-874800,373021,5,0.955
scf7180000002740_nd:0-874800,252334,5,2.622
scf7180000002788_nd:1600100-2720002,120644,5,4.411
scf7180000002788_nd:63200-1183500,1057628,5,9.492
scf7180000002788_nd:63200-1183500,940432,5,9.792
scf7180000002788_nd:63200-1183500,537676,5,10.091
scf7180000002788_nd:63200-1183500,453776,5,10.091
scf7180000002788_nd:63200-1183500,227452,5,10.398
scf7180000002788_nd:63200-1183500,118451,5,10.389
scf7180000002788_nd:63200-1183500,103717,5,10.389
scf7180000002792_nd:1500-206600,59324,5,11.888
scf7180000002792_nd:1500-206600,72569,5,11.878
scf7180000003558_nd:700-606400,471519,5,12.187
scf7180000003558_nd:700-606400,389268,5,12.789
scf7180000003558_nd:700-606400,135717,5,13.994
scf7180000003558_nd:700-606400,94459,5,14.159
scf7180000003558_nd:700-606400,23122,5,15.641
scf7180000002972_nd:600-520200,178184,5,15.94
scf7180000002972_nd:600-520200,174068,5,15.964
scf7180000002972_nd:600-520200,119022,5,16.239
scf7180000002972_nd:600-520200,94377,5,16.157
scf7180000002579_nd:21372400-22423900,943573,5,16.239
scf7180000002579_nd:21372400-22423900,914847,5,16.534
scf7180000002579_nd:21372400-22423900,311529,5,18.068
scf7180000002579_nd:21372400-22423900,278987,5,19.226
scf7180000002620_nd:24100-981002,326394,5,20.745
scf7180000002620_nd:24100-981002,230836,5,21.033
scf7180000002620_nd:24100-981002,210363,5,21.033
scf7180000003457_nd:800-786347,186110,5,23.813
scf7180000003458_nd:99300-856100,293883,5,25.596
scf7180000003458_nd:99300-856100,340804,5,25.908
scf7180000003458_nd:99300-856100,340880,5,25.978
scf7180000003458_nd:99300-856100,361078,5,25.908
scf7180000003458_nd:99300-856100,700602,5,26.219
scf7180000003458_nd:857800-2494100,475,5,26.219
scf7180000003458_nd:857800-2494100,402814,5,26.845
scf7180000003458_nd:857800-2494100,670826,5,28.552
scf7180000003458_nd:857800-2494100,970944,5,29.015
scf7180000003522_nd:2304400-3296400,908510,5,31.137
scf7180000003458_nd:857800-2494100,1425055,5,32.254
scf7180000003579_nd:5683500-7952500,203519,5,32.538
scf7180000003579_nd:5683500-7952500,312032,5,32.837
scf7180000003579_nd:5683500-7952500,518453,5,33.132
scf7180000003579_nd:5683500-7952500,614529,5,33.754
scf7180000003579_nd:5683500-7952500,642932,5,33.654
scf7180000003579_nd:5683500-7952500,713792,5,33.74
scf7180000003579_nd:5683500-7952500,733103,5,33.754
scf7180000003579_nd:5683500-7952500,1531196,5,34.36
scf7180000003579_nd:5683500-7952500,1657172,5,35.214
scf7180000003579_nd:5683500-7952500,1659701,5,35.286
scf7180000003579_nd:5683500-7952500,1661177,5,35.286
scf7180000003579_nd:5683500-7952500,1810758,5,36.476
scf7180000003579_nd:7952900-8255400,145010,5,36.511
scf7180000003088_nd:700-473922,106824,5,36.476
scf7180000002721_nd:14700-1351788,787255,5,36.871
scf7180000002721_nd:14700-1351788,843563,5,36.779
scf7180000002721_nd:14700-1351788,1263426,5,37.358
scf7180000002626_nd:0-3432369,258007,5,37.385
scf7180000002626_nd:0-3432369,744230,5,38.297
scf7180000003573_nd:7068900-9152900,158976,5,39.958
scf7180000002626_nd:0-3432369,2516139,5,40.001
scf7180000002595_nd:1300-2732500,1645839,5,40.111
scf7180000002626_nd:0-3432369,2359352,5,39.137
scf7180000002626_nd:0-3432369,2124366,5,38.264
scf7180000002626_nd:0-3432369,1970213,5,38.394
scf7180000002626_nd:0-3432369,1850304,5,38.285
scf7180000002590_nd:637700-825800,94667,5,42.312
scf7180000002605_nd:9200-709700,636304,5,42.315
scf7180000002605_nd:9200-709700,327512,5,44.106
scf7180000002651_nd:100-511100,326731,5,45.598
scf7180000002651_nd:100-511100,414413,5,46.191
scf7180000002651_nd:100-511100,452214,5,46.479
scf7180000002651_nd:100-511100,504223,5,46.478
scf7180000003209_nd:149300-717474,188274,5,46.477
scf7180000003209_nd:149300-717474,190547,5,46.48
scf7180000003209_nd:149300-717474,428321,5,46.477
scf7180000003209_nd:149300-717474,550135,5,47.057
scf7180000002870_nd:4383100-4740341,57765,5,47.654
scf7180000002870_nd:4254400-4382800,51585,5,47.654
scf7180000002870_nd:1915300-3929200,1598700,5,47.925
scf7180000002870_nd:3943800-4248700,40945,5,47.68
scf7180000002798_nd:0-392700,61664,5,50.006
scf7180000002597_nd:0-9462900,137183,5,50.124
scf7180000002597_nd:0-9462900,1168224,5,50.006
scf7180000002597_nd:0-9462900,1229792,5,50.006
scf7180000003580_nd:200-668100,331669,5,49.713
scf7180000003580_nd:670900-5059300,267816,5,51.961
scf7180000002579_nd:10616700-21372200,9618026,5,51.981
scf7180000002579_nd:10616700-21372200,9158317,5,52.03
scf7180000002579_nd:10616700-21372200,8907487,5,52.03
scf7180000002579_nd:10616700-21372200,8000670,5,51.216
scf7180000002579_nd:10616700-21372200,7850456,5,51.211
scf7180000002579_nd:10616700-21372200,5537627,5,50.009
scf7180000002579_nd:10616700-21372200,5394368,5,50.015
scf7180000002579_nd:10616700-21372200,5348139,5,50.015
scf7180000002579_nd:10616700-21372200,5294377,5,50.008
scf7180000002833_nd:199200-682200,447561,5,50.009
scf7180000002591_nd:3726700-7695900,1985864,9,21.38
scf7180000002604_nd:2389300-2890300,312275,5,62.49
scf7180000002604_nd:2389300-2890300,318548,5,62.636
scf7180000003580_nd:670900-5059300,604829,5,52.292
scf7180000003580_nd:670900-5059300,797749,5,53.273
scf7180000003580_nd:670900-5059300,861226,5,54.665
scf7180000003580_nd:670900-5059300,2448060,5,57.391
scf7180000003580_nd:670900-5059300,2474372,5,57.401
scf7180000003580_nd:670900-5059300,3180766,5,59.247
scf7180000003580_nd:670900-5059300,4217547,5,59.208
scf7180000003124_nd:300-2782300,692236,3,37.509
scf7180000003124_nd:300-2782300,573955,3,37.509
scf7180000003124_nd:300-2782300,679544,3,37.492
scf7180000003124_nd:300-2782300,603360,3,37.535
scf7180000003124_nd:300-2782300,493825,3,36.69
scf7180000003124_nd:300-2782300,404926,3,36.397
scf7180000003124_nd:300-2782300,250278,3,36.103
scf7180000003598_nd:4200-558996,321820,5,62.2
scf7180000003553_nd:640400-3154600,1746093,5,62.433
scf7180000003553_nd:640400-3154600,1725217,5,62.492
scf7180000003598_nd:4200-558996,12569,5,62.54
scf7180000003583_nd:15178500-20706000,4656966,5,62.212
scf7180000003565_nd:215600-1242200,354120,5,61.888
scf7180000003026_nd:0-892784,764959,5,61.888
scf7180000003026_nd:0-892784,201958,5,60.082
scf7180000002585_nd:926600-2820400,958738,5,59.229
scf7180000002596_nd:11100-2101000,495549,5,72.687
scf7180000002596_nd:11100-2101000,596931,5,72.38
scf7180000002596_nd:11100-2101000,732920,5,71.478
scf7180000002596_nd:11100-2101000,968273,5,70.878
scf7180000002596_nd:11100-2101000,1143003,5,70.576
scf7180000002596_nd:11100-2101000,1643472,5,68.086
scf7180000002596_nd:11100-2101000,1889255,5,67.887
scf7180000002596_nd:11100-2101000,2047172,5,67.872
scf7180000002648_nd:1100-463200,82211,5,66.985
scf7180000002648_nd:1100-463200,111986,5,66.395
scf7180000002648_nd:1100-463200,118303,5,66.395
scf7180000002845_nd:2400-778290,714579,5,64.608
scf7180000003574_nd:2200-39400,21146,5,64.719
scf7180000002845_nd:2400-778290,320361,5,63.401
scf7180000002845_nd:2400-778290,308006,5,63.401
scf7180000002604_nd:5354800-6807300,1407920,5,63.108
scf7180000002604_nd:5354800-6807300,1258151,5,62.807
scf7180000002604_nd:5354800-6807300,868986,5,62.559
scf7180000002580_nd:765800-3195300,2087121,5,62.528
scf7180000002604_nd:2389300-2890300,304829,5,62.587
scf7180000002596_nd:11100-2101000,123347,5,72.986
scf7180000002579_nd:22429500-23347800,838099,5,72.969
scf7180000002579_nd:22429500-23347800,621004,5,73.861
scf7180000002579_nd:22429500-23347800,223223,5,74.718
scf7180000002579_nd:22429500-23347800,208071,5,74.743
scf7180000002622_nd:977200-1783400,65971,6,2.038
scf7180000002876_nd:200-170600,174,6,0
scf7180000003551_nd:3365500-4017171,419417,3,86.64
scf7180000003551_nd:3365500-4017171,539881,3,86.335
scf7180000002622_nd:5900-977100,537223,6,2.628
scf7180000002622_nd:5900-977100,641664,6,2.017
scf7180000002622_nd:5900-977100,686827,6,1.997
scf7180000002877_nd:2000-83100,46156,6,2.034
scf7180000002601_nd:11300-1541800,1398119,6,8.634
scf7180000002601_nd:11300-1541800,1040233,6,8.332
scf7180000002601_nd:11300-1541800,884644,6,8.031
scf7180000002601_nd:11300-1541800,624497,6,6.835
scf7180000002622_nd:5900-977100,66840,6,5.31
scf7180000003549_nd:28400-1579200,1506525,6,8.737
scf7180000002928_nd:0-319700,244177,6,13.989
scf7180000003549_nd:28400-1579200,225241,6,11.082
scf7180000002759_nd:399800-2241100,1731969,6,11.069
scf7180000002759_nd:399800-2241100,1730279,6,11.069
scf7180000002759_nd:399800-2241100,1677502,6,11.071
scf7180000002759_nd:399800-2241100,1637634,6,11.138
scf7180000002759_nd:399800-2241100,1613411,6,11.058
scf7180000002759_nd:399800-2241100,1051669,6,11.372
scf7180000002759_nd:399800-2241100,1039383,6,11.676
scf7180000002759_nd:399800-2241100,1019836,6,12.024
scf7180000002759_nd:399800-2241100,864941,6,11.98
scf7180000002759_nd:399800-2241100,554745,6,13.691
scf7180000002759_nd:399800-2241100,539912,6,14.111
scf7180000002579_nd:8956900-10597900,362941,6,13.979
scf7180000002579_nd:8956900-10597900,1050386,6,16.396
scf7180000002579_nd:8956900-10597900,857466,6,18.23
scf7180000002579_nd:8956900-10597900,609094,6,18.516
scf7180000002579_nd:8956900-10597900,252471,6,19.239
scf7180000002579_nd:8956900-10597900,237950,6,19.241
scf7180000002579_nd:8956900-10597900,209845,6,19.686
scf7180000002579_nd:8956900-10597900,71595,6,19.686
scf7180000002579_nd:7679800-8956700,1216959,6,19.594
scf7180000002579_nd:7679800-8956700,1039304,6,20.263
scf7180000002579_nd:7679800-8956700,981999,6,21.14
scf7180000002579_nd:7679800-8956700,792421,6,22.919
scf7180000002579_nd:7679800-8956700,608678,6,22.919
scf7180000002966_nd:18500-2796411,1372251,6,23.051
scf7180000002579_nd:7679800-8956700,480247,6,20.648
scf7180000002579_nd:7679800-8956700,418814,6,23.251
scf7180000002580_nd:224300-763100,54020,6,23.164
scf7180000002580_nd:765800-3195300,53429,6,24.753
scf7180000002580_nd:765800-3195300,533470,6,27.123
scf7180000002580_nd:765800-3195300,840544,6,27.011
scf7180000002580_nd:765800-3195300,1207407,6,27.123
scf7180000002580_nd:765800-3195300,1237615,6,27.365
scf7180000002580_nd:765800-3195300,1279494,6,27.61
scf7180000002580_nd:765800-3195300,1728256,6,29.12
scf7180000002580_nd:765800-3195300,1802508,6,29.729
scf7180000002580_nd:765800-3195300,1936447,6,29.96
scf7180000002580_nd:765800-3195300,2279117,6,30.565
scf7180000002580_nd:765800-3195300,2306922,6,31.452
scf7180000002580_nd:765800-3195300,2325487,6,32.264
scf7180000002580_nd:765800-3195300,2329388,6,32.264
scf7180000002580_nd:3195600-3883300,174994,6,32.553
scf7180000002580_nd:3195600-3883300,387067,6,32.553
scf7180000002580_nd:3195600-3883300,592812,6,32.549
scf7180000002580_nd:3884900-4785500,185955,6,32.851
scf7180000003576_nd:1900-1107700,40319,6,33.315
scf7180000003576_nd:1900-1107700,231226,6,33.466
scf7180000003576_nd:1900-1107700,391246,6,33.771
scf7180000003576_nd:1900-1107700,617337,6,33.774
scf7180000003576_nd:1900-1107700,879369,6,33.774
scf7180000003576_nd:1900-1107700,973053,6,34.676
scf7180000003576_nd:1900-1107700,977127,2,19.006
scf7180000003576_nd:1900-1107700,1007950,6,34.973
scf7180000002813_nd:999300-2483500,1077831,6,39.802
scf7180000002813_nd:999300-2483500,733778,6,40.107
scf7180000003576_nd:1900-1107700,1098766,6,34.972
scf7180000002669_nd:986700-1289700,23181,6,35.863
scf7180000002669_nd:1400-986300,683309,6,37.681
scf7180000002590_nd:1596300-1711100,70048,6,38.451
scf7180000002590_nd:1596300-1711100,53904,6,38.451
scf7180000002590_nd:830100-1595800,652628,6,38.934
scf7180000002590_nd:830100-1595800,617758,6,38.936
scf7180000002609_nd:2000-2495700,2408309,6,46.041
scf7180000002625_nd:0-1033000,958544,6,44.733
scf7180000002625_nd:0-1033000,942259,6,44.732
scf7180000002625_nd:0-1033000,908685,6,44.745
scf7180000002625_nd:0-1033000,886158,6,44.734
scf7180000002625_nd:0-1033000,491547,6,43.556
scf7180000002625_nd:0-1033000,376455,6,43.557
scf7180000002677_nd:300-3172600,58496,6,43.557
scf7180000002677_nd:300-3172600,182762,6,42.966
scf7180000002677_nd:300-3172600,1118178,6,42.678
scf7180000002677_nd:300-3172600,1281264,6,42.087
scf7180000002677_nd:300-3172600,1595887,6,41.864
scf7180000002677_nd:300-3172600,1677670,6,41.505
scf7180000002677_nd:300-3172600,1719649,6,41.566
scf7180000002677_nd:300-3172600,1863657,6,41.581
scf7180000002677_nd:300-3172600,2070210,6,41.566
scf7180000002677_nd:300-3172600,2240402,6,41.234
scf7180000002677_nd:300-3172600,2338453,6,40.982
scf7180000002677_nd:300-3172600,2402735,6,40.694
scf7180000002677_nd:300-3172600,2515896,6,40.4
scf7180000002677_nd:300-3172600,2537748,6,40.388
scf7180000002677_nd:300-3172600,2635622,6,40.351
scf7180000002677_nd:300-3172600,2753101,6,40.4
scf7180000002677_nd:300-3172600,3011836,6,40.103
scf7180000002609_nd:2000-2495700,534090,6,48.311
scf7180000002609_nd:2000-2495700,583461,6,48.176
scf7180000002609_nd:2000-2495700,989873,6,49.214
scf7180000002609_nd:2000-2495700,994891,6,49.265
scf7180000002609_nd:2000-2495700,996340,6,49.21
scf7180000002970_nd:0-1303300,655516,6,49.818
scf7180000002609_nd:2000-2495700,1269712,6,49.818
scf7180000002609_nd:2000-2495700,1451257,6,50.072
scf7180000002609_nd:2000-2495700,1577034,6,50.109
scf7180000002609_nd:2000-2495700,1724160,6,50.416
scf7180000002609_nd:2000-2495700,1780576,6,50.423
scf7180000002609_nd:2000-2495700,1825102,6,50.416
scf7180000003124_nd:2783300-4407800,1557884,6,51.027
scf7180000003124_nd:2783300-4407800,1060412,6,52.56
scf7180000003124_nd:2783300-4407800,757268,6,52.602
scf7180000003124_nd:2783300-4407800,641950,6,52.56
scf7180000003124_nd:2783300-4407800,538925,6,53.172
scf7180000003124_nd:2783300-4407800,518453,6,53.483
scf7180000003124_nd:2783300-4407800,451820,6,54.705
scf7180000002607_nd:660200-12628500,11701759,6,56.573
scf7180000002607_nd:660200-12628500,11699777,6,56.45
scf7180000002607_nd:660200-12628500,11441177,6,56.754
scf7180000002607_nd:660200-12628500,11251501,6,56.754
scf7180000002607_nd:660200-12628500,11020612,6,57.367
scf7180000002607_nd:660200-12628500,10998978,6,57.664
scf7180000002607_nd:660200-12628500,10758703,6,58.563
scf7180000002607_nd:660200-12628500,10667077,6,58.865
scf7180000002607_nd:660200-12628500,10409890,6,59.769
scf7180000002607_nd:660200-12628500,10390577,6,60.071
scf7180000002607_nd:660200-12628500,10357721,6,60.375
scf7180000002607_nd:660200-12628500,9751292,6,60.973
scf7180000002607_nd:660200-12628500,9510064,6,61.575
scf7180000002607_nd:660200-12628500,9464849,6,62.282
scf7180000002607_nd:660200-12628500,9316528,6,62.174
scf7180000002607_nd:660200-12628500,9255177,6,62.492
scf7180000002607_nd:660200-12628500,9145879,6,63.398
scf7180000002607_nd:660200-12628500,8973409,6,64.313
scf7180000002607_nd:660200-12628500,8720210,6,65.692
scf7180000002607_nd:660200-12628500,8366511,6,68.404
scf7180000002607_nd:660200-12628500,8339257,6,68.722
scf7180000002607_nd:660200-12628500,8338672,6,68.701
scf7180000002607_nd:660200-12628500,8269432,6,68.73
scf7180000002607_nd:660200-12628500,8212442,6,68.722
scf7180000002607_nd:660200-12628500,8174703,6,69.648
scf7180000002607_nd:660200-12628500,8099852,6,70.245
scf7180000002607_nd:660200-12628500,7970403,6,70.866
scf7180000002607_nd:660200-12628500,7926084,6,70.866
scf7180000002607_nd:660200-12628500,7895475,6,71.483
scf7180000002607_nd:660200-12628500,7636613,6,72.751
scf7180000002607_nd:660200-12628500,7557496,6,72.705
scf7180000002607_nd:660200-12628500,7489684,6,72.705
scf7180000002607_nd:660200-12628500,7290491,6,73.719
scf7180000002607_nd:660200-12628500,7267595,6,73.635
scf7180000002607_nd:660200-12628500,7216950,6,73.988
scf7180000002607_nd:660200-12628500,7190980,6,74.601
scf7180000002607_nd:660200-12628500,7113636,6,75.826
scf7180000002607_nd:660200-12628500,7075888,6,75.824
scf7180000002607_nd:660200-12628500,7069306,6,75.892
scf7180000002607_nd:660200-12628500,6832635,6,76.443
scf7180000002607_nd:660200-12628500,6386192,6,76.744
scf7180000002607_nd:660200-12628500,6373899,6,77.052
scf7180000002607_nd:660200-12628500,5963670,6,77.656
scf7180000002607_nd:660200-12628500,5748309,6,77.963
scf7180000002607_nd:660200-12628500,5717067,6,77.961
scf7180000002607_nd:660200-12628500,5590880,6,77.964
scf7180000002607_nd:660200-12628500,5570155,6,78.26
scf7180000002607_nd:660200-12628500,5549365,6,78.256
scf7180000002607_nd:660200-12628500,5447876,6,78.87
scf7180000002607_nd:660200-12628500,5417070,6,79.177
scf7180000002607_nd:660200-12628500,4754428,6,81.312
scf7180000002607_nd:660200-12628500,4718106,6,81.317
scf7180000002607_nd:660200-12628500,4703349,6,81.313
scf7180000002607_nd:660200-12628500,4645636,6,81.322
scf7180000002607_nd:660200-12628500,4366872,6,83.151
scf7180000002607_nd:660200-12628500,4282323,6,83.461
scf7180000002607_nd:660200-12628500,4271507,6,83.457
scf7180000002607_nd:660200-12628500,3782845,6,84.993
scf7180000002607_nd:660200-12628500,3678131,6,85.348
scf7180000002607_nd:660200-12628500,3675363,6,85.286
scf7180000002607_nd:660200-12628500,3613245,6,86.205
scf7180000002607_nd:660200-12628500,3469177,6,86.9
scf7180000002607_nd:660200-12628500,3022297,6,88.918
scf7180000002607_nd:660200-12628500,3021011,6,88.918
scf7180000002607_nd:660200-12628500,2959838,6,88.869
scf7180000002607_nd:660200-12628500,2805624,6,89.518
scf7180000002607_nd:660200-12628500,2647996,6,89.948
scf7180000002607_nd:660200-12628500,2478743,6,90.127
scf7180000002607_nd:660200-12628500,2198347,6,92.835
scf7180000002607_nd:660200-12628500,1996840,10,57.01
scf7180000002607_nd:660200-12628500,1861063,6,93.08
scf7180000002607_nd:660200-12628500,1623568,6,93.908
scf7180000002607_nd:660200-12628500,1554058,6,94.911
scf7180000002607_nd:660200-12628500,1518509,6,94.911
scf7180000002607_nd:660200-12628500,1512174,6,94.918
scf7180000002607_nd:660200-12628500,1374598,6,95.51
scf7180000002607_nd:660200-12628500,981803,6,97.582
scf7180000002751_nd:0-82300,80757,6,97.567
scf7180000002607_nd:660200-12628500,782549,6,97.878
scf7180000002607_nd:660200-12628500,650656,6,98.174
scf7180000002607_nd:660200-12628500,563381,6,98.181
scf7180000002646_nd:5100-2161224,21077,6,99.365
scf7180000002646_nd:5100-2161224,186835,6,99.564
scf7180000002646_nd:5100-2161224,249961,6,99.651
scf7180000002646_nd:5100-2161224,557299,6,99.651
scf7180000002646_nd:5100-2161224,712272,6,99.649
scf7180000002646_nd:5100-2161224,1030907,6,99.66
scf7180000002646_nd:5100-2161224,1375207,6,99.727
scf7180000002716_nd:0-2616000,1198938,6,99.946
scf7180000002716_nd:0-2616000,1274355,6,100.535
scf7180000002716_nd:0-2616000,1337420,6,100.83
scf7180000002716_nd:0-2616000,1532857,6,101.696
scf7180000002716_nd:0-2616000,1557403,6,101.685
scf7180000002716_nd:0-2616000,2078838,6,102.262
scf7180000002716_nd:0-2616000,2333511,6,102.219
scf7180000002716_nd:0-2616000,2337680,6,102.096
scf7180000002716_nd:0-2616000,2338593,6,102.274
scf7180000002812_nd:800-247924,68970,6,102.567
scf7180000002812_nd:800-247924,183401,6,102.84
scf7180000002812_nd:800-247924,207605,6,102.856
scf7180000002732_nd:4066100-4871748,701962,7,0.005
scf7180000002732_nd:4066100-4871748,519606,7,0
scf7180000002732_nd:2437700-4065900,1602302,7,0.298
scf7180000002732_nd:2437700-4065900,585435,7,0.269
scf7180000002732_nd:2437700-4065900,1262413,7,0.276
scf7180000002732_nd:2437700-4065900,52398,7,0.221
scf7180000003002_nd:500-315569,18619,7,0.269
scf7180000002776_nd:16900-649500,47614,7,0.547
scf7180000003002_nd:500-315569,189145,7,0.271
scf7180000003583_nd:0-1086400,468784,7,0.345
scf7180000003583_nd:0-1086400,391997,7,0.198
scf7180000002626_nd:0-3432369,2801113,7,0.864
scf7180000003212_nd:0-10900,1694,7,2.017
scf7180000002602_nd:3689200-6409465,2384834,7,2.606
scf7180000003522_nd:0-463900,236450,7,3.19
scf7180000003573_nd:13115200-14681300,790958,7,11.022
scf7180000003573_nd:13115200-14681300,902966,7,10.439
scf7180000003591_nd:3381600-4092693,572490,7,10.144
scf7180000003591_nd:3381600-4092693,518052,7,10.144
scf7180000002662_nd:2300-1237300,150926,7,4.073
scf7180000002756_nd:1700-1453288,1278153,7,5.34
scf7180000002756_nd:1700-1453288,957822,7,5.086
scf7180000002756_nd:1700-1453288,867808,7,5.197
scf7180000002756_nd:1700-1453288,391891,7,5.197
scf7180000002756_nd:1700-1453288,391373,7,5.203
scf7180000002756_nd:1700-1453288,206787,7,5.258
scf7180000003583_nd:5207300-10260500,4823123,7,5.229
scf7180000003583_nd:5207300-10260500,4819253,7,5.267
scf7180000003583_nd:5207300-10260500,3229089,7,5.197
scf7180000003583_nd:5207300-10260500,2597182,7,5.155
scf7180000003583_nd:5207300-10260500,2579054,7,5.292
scf7180000003583_nd:5207300-10260500,1126425,7,5.198
scf7180000003583_nd:5207300-10260500,626231,7,5.756
scf7180000003583_nd:5207300-10260500,588866,7,6.054
scf7180000003583_nd:5207300-10260500,382868,7,6.621
scf7180000002594_nd:2083300-4409000,1864553,2,26.18
scf7180000002619_nd:1077500-2390800,830242,7,6.638
scf7180000002619_nd:1077500-2390800,466542,7,6.931
scf7180000002619_nd:1077500-2390800,451901,7,6.889
scf7180000002619_nd:1077500-2390800,198781,7,7.117
scf7180000002619_nd:100-930600,693761,7,7.514
scf7180000002619_nd:100-930600,208438,7,7.516
scf7180000002619_nd:100-930600,122670,7,7.509
scf7180000003542_nd:700-163400,101938,7,7.506
scf7180000003542_nd:163900-733600,30493,7,7.473
scf7180000003542_nd:734000-1515300,413551,7,8.69
scf7180000003542_nd:734000-1515300,774275,7,8.965
scf7180000002810_nd:10200-1217500,266776,7,9.259
scf7180000003591_nd:1538000-3381300,113952,7,9.23
scf7180000003591_nd:1538000-3381300,119887,7,9.257
scf7180000003563_nd:600-960541,106566,7,19.885
scf7180000003573_nd:9620400-13114900,2700205,7,11.281
scf7180000003573_nd:9620400-13114900,3329221,7,11.282
scf7180000003573_nd:9620400-13114900,1077464,7,11.575
scf7180000003573_nd:9620400-13114900,942260,7,11.558
scf7180000003573_nd:9620400-13114900,749790,7,11.87
scf7180000003573_nd:9620400-13114900,625812,7,12.174
scf7180000003573_nd:9620400-13114900,466828,7,12.164
scf7180000003573_nd:9620400-13114900,464723,7,12.164
scf7180000003573_nd:9620400-13114900,450631,7,12.218
scf7180000003573_nd:9620400-13114900,405867,7,12.458
scf7180000003573_nd:9620400-13114900,207442,7,12.753
scf7180000003573_nd:9153300-9619600,33088,7,13.048
scf7180000003573_nd:7068900-9152900,1919115,7,13.048
scf7180000003573_nd:7068900-9152900,1723933,7,13.051
scf7180000003573_nd:7068900-9152900,464303,7,14.517
scf7180000003573_nd:7068900-9152900,352396,7,14.647
scf7180000003573_nd:7068900-9152900,290015,7,14.812
scf7180000003573_nd:7068900-9152900,235634,7,15.074
scf7180000003600_nd:12100-2147715,398424,7,15.672
scf7180000002863_nd:9500-124100,78019,7,16.845
scf7180000002863_nd:127100-1267617,281714,7,18.627
scf7180000002863_nd:127100-1267617,400248,7,18.59
scf7180000002863_nd:127100-1267617,621543,7,18.611
scf7180000002863_nd:127100-1267617,657053,7,18.624
scf7180000003563_nd:600-960541,790197,7,18.913
scf7180000003563_nd:600-960541,540182,7,19.071
scf7180000003563_nd:600-960541,151445,7,19.796
scf7180000003563_nd:600-960541,74824,7,19.796
scf7180000002594_nd:4451500-5077300,442896,7,20.704
scf7180000002594_nd:4451500-5077300,248820,7,22.217
scf7180000002594_nd:2083300-4409000,1514895,7,23.324
scf7180000002594_nd:2083300-4409000,1456900,7,23.312
scf7180000003522_nd:470200-2304200,175569,7,24.58
scf7180000002594_nd:2083300-4409000,451087,7,25.128
scf7180000002594_nd:2083300-4409000,272555,7,27.61
scf7180000002970_nd:0-1303300,314048,7,29.177
scf7180000002970_nd:0-1303300,345745,7,29.177
scf7180000002970_nd:0-1303300,498227,7,31.687
scf7180000002970_nd:0-1303300,719099,7,32.931
scf7180000002970_nd:0-1303300,719486,7,32.974
scf7180000002970_nd:0-1303300,796386,7,33.592
scf7180000002970_nd:0-1303300,810397,7,33.562
scf7180000002970_nd:0-1303300,852611,7,33.656
scf7180000002970_nd:0-1303300,861807,7,34.076
scf7180000002970_nd:0-1303300,975304,7,35.638
scf7180000002970_nd:0-1303300,986797,7,35.638
scf7180000003068_nd:900-1071000,86636,7,36.259
scf7180000003068_nd:900-1071000,220529,7,37.187
scf7180000003068_nd:900-1071000,275651,7,37.83
scf7180000003068_nd:900-1071000,475088,7,40.107
scf7180000003068_nd:900-1071000,743465,7,39.975
scf7180000003068_nd:900-1071000,789232,7,40.107
scf7180000003068_nd:900-1071000,895602,7,40.421
scf7180000003111_nd:3600-203000,33427,7,40.417
scf7180000003111_nd:3600-203000,86541,7,40.588
scf7180000002681_nd:16300-369000,73249,7,40.924
scf7180000003557_nd:2400-2318698,2219594,7,49.125
scf7180000003557_nd:2400-2318698,2277441,7,49.106
scf7180000002671_nd:1915100-4510434,719561,7,48.52
scf7180000002671_nd:1915100-4510434,750657,7,48.52
scf7180000002671_nd:1915100-4510434,756005,7,48.525
scf7180000003035_nd:2300-858700,164376,7,47.844
scf7180000003035_nd:2300-858700,182483,7,47.769
scf7180000003035_nd:2300-858700,278307,7,47.178
scf7180000003035_nd:2300-858700,403790,7,45.988
scf7180000003035_nd:2300-858700,476603,7,45.988
scf7180000003279_nd:100-14800,8677,7,45.934
scf7180000003035_nd:2300-858700,706331,7,45.931
scf7180000003557_nd:2400-2318698,2227211,7,49.127
scf7180000003557_nd:2400-2318698,1935465,7,50.573
scf7180000003557_nd:2400-2318698,1877054,7,50.585
scf7180000003557_nd:2400-2318698,1628990,7,50.628
scf7180000003557_nd:2400-2318698,1339225,7,51.755
scf7180000003557_nd:2400-2318698,936693,7,52.052
scf7180000003557_nd:2400-2318698,426356,7,51.909
scf7180000003557_nd:2400-2318698,91002,7,53.504
scf7180000003557_nd:2400-2318698,25914,8,41.111
scf7180000002619_nd:1077500-2390800,490708,7,56.444
scf7180000003555_nd:2000-1552500,843948,7,56.536
scf7180000003555_nd:2000-1552500,608987,7,57.653
scf7180000003555_nd:2000-1552500,302973,7,58.242
scf7180000003555_nd:2000-1552500,298241,7,58.242
scf7180000003555_nd:2000-1552500,185051,7,59.708
scf7180000003555_nd:2000-1552500,115642,7,59.708
scf7180000002597_nd:0-9462900,8530617,7,59.713
scf7180000002597_nd:0-9462900,8443161,7,59.647
scf7180000002597_nd:0-9462900,8155072,7,60.002
scf7180000002597_nd:0-9462900,8038864,7,60.033
scf7180000002597_nd:0-9462900,7406174,7,61.25
scf7180000002597_nd:0-9462900,7157829,7,61.276
scf7180000003546_nd:779300-2315500,1274736,8,5.173
scf7180000003546_nd:779300-2315500,1268024,8,5.203
scf7180000003546_nd:779300-2315500,1228825,8,0
scf7180000003546_nd:779300-2315500,1176769,8,6.065
scf7180000003546_nd:779300-2315500,879846,2,12.495
scf7180000003546_nd:779300-2315500,800806,8,8.413
scf7180000003546_nd:779300-2315500,733075,8,8.69
scf7180000003546_nd:779300-2315500,668236,8,8.836
scf7180000003546_nd:779300-2315500,460101,8,9.236
scf7180000003546_nd:779300-2315500,175305,8,12.278
scf7180000003546_nd:318500-779200,338291,8,12.879
scf7180000003546_nd:318500-779200,328356,8,12.879
scf7180000003546_nd:318500-779200,205101,8,12.921
scf7180000003591_nd:170000-1533400,1292000,8,13.262
scf7180000002672_nd:15800-1756600,1101553,8,4.41
scf7180000002672_nd:15800-1756600,1030473,8,4.41
scf7180000002672_nd:15800-1756600,608370,10,56.952
scf7180000002672_nd:15800-1756600,606407,10,56.976
scf7180000003591_nd:1800-169900,64536,8,13.178
scf7180000003591_nd:170000-1533400,173829,8,13.176
scf7180000002593_nd:1910100-3945100,1568804,8,17.708
scf7180000002593_nd:1910100-3945100,1508251,8,19.205
scf7180000002593_nd:1910100-3945100,1284328,8,19.8
scf7180000002593_nd:1910100-3945100,721209,8,20.412
scf7180000002593_nd:79000-1910000,1075262,8,23.163
scf7180000002593_nd:79000-1910000,1037000,8,23.469
scf7180000002593_nd:79000-1910000,973469,8,23.32
scf7180000002593_nd:79000-1910000,710455,8,24.302
scf7180000002593_nd:79000-1910000,418099,8,25.905
scf7180000002593_nd:79000-1910000,309898,8,25.905
scf7180000003549_nd:28400-1579200,1051461,6,10.163
scf7180000003549_nd:28400-1579200,896828,6,10.118
scf7180000002593_nd:79000-1910000,89208,8,26.825
scf7180000002593_nd:79000-1910000,47654,8,27.13
scf7180000003577_nd:200-6298400,6169680,8,28.364
scf7180000003577_nd:200-6298400,6028975,8,28.699
scf7180000003577_nd:200-6298400,5991501,8,28.364
scf7180000003577_nd:200-6298400,4742911,8,33.577
scf7180000003577_nd:200-6298400,4558497,8,33.943
scf7180000003577_nd:200-6298400,4361739,8,34.45
scf7180000003577_nd:200-6298400,4361536,8,34.481
scf7180000003577_nd:200-6298400,4340053,8,34.673
scf7180000003577_nd:200-6298400,4312625,8,34.472
scf7180000003577_nd:200-6298400,4250473,8,34.481
scf7180000003577_nd:200-6298400,4004576,8,34.779
scf7180000003521_nd:612300-4910400,525936,8,47.172
scf7180000003521_nd:612300-4910400,211603,8,46.622
scf7180000003521_nd:612300-4910400,182782,8,44.453
scf7180000003521_nd:612300-4910400,105465,8,44.446
scf7180000003521_nd:612300-4910400,100878,8,44.453
scf7180000003521_nd:4600-611800,562745,8,42.913
scf7180000003521_nd:4600-611800,547730,8,42.922
scf7180000003577_nd:200-6298400,607830,8,41.422
scf7180000003577_nd:200-6298400,1874521,8,39.607
scf7180000003577_nd:200-6298400,1933772,8,38.678
scf7180000003577_nd:200-6298400,1955797,8,38.372
scf7180000003577_nd:200-6298400,2038997,8,37.446
scf7180000003577_nd:200-6298400,2049821,8,37.13
scf7180000003577_nd:200-6298400,2773225,8,35.163
scf7180000003577_nd:200-6298400,3321447,8,35.085
scf7180000003577_nd:200-6298400,3470566,8,35.186
scf7180000003577_nd:200-6298400,3555762,8,34.863
scf7180000003577_nd:200-6298400,3564412,8,34.796
scf7180000003521_nd:612300-4910400,2679365,8,49.717
scf7180000003521_nd:612300-4910400,2876526,8,49.839
scf7180000003597_nd:2434400-5524000,335511,1,4.4
scf7180000003597_nd:2434400-5524000,598101,1,4.387
scf7180000003521_nd:612300-4910400,857772,8,48.091
scf7180000003521_nd:612300-4910400,1168687,8,48.326
scf7180000003521_nd:612300-4910400,1355353,8,48.618
scf7180000003521_nd:612300-4910400,1402766,8,48.79
scf7180000003521_nd:612300-4910400,1415486,8,48.618
scf7180000003521_nd:612300-4910400,1817211,8,49.71
scf7180000003521_nd:612300-4910400,1871274,8,49.769
scf7180000003521_nd:612300-4910400,1928024,8,49.756
scf7180000003521_nd:612300-4910400,1934872,8,49.762
scf7180000003584_nd:0-3513100,3268286,8,51.245
scf7180000003584_nd:0-3513100,2812203,8,51.448
scf7180000003584_nd:0-3513100,2783871,8,51.489
scf7180000002679_nd:120000-3576800,982152,8,51.768
scf7180000002679_nd:120000-3576800,1197199,8,52.068
scf7180000002679_nd:120000-3576800,1485184,8,52.365
scf7180000002679_nd:120000-3576800,1544599,8,52.663
scf7180000002679_nd:3577000-4160117,47290,8,53.613
scf7180000002679_nd:3577000-4160117,62535,8,54.157
scf7180000002679_nd:3577000-4160117,169396,8,54.374
scf7180000002596_nd:3048100-4888200,978794,8,56.927
scf7180000002596_nd:3048100-4888200,502201,8,58.088
scf7180000002596_nd:2107400-3047900,494652,8,58.399
scf7180000002596_nd:2107400-3047900,484021,8,58.51
scf7180000002596_nd:2107400-3047900,329430,8,58.357
scf7180000002596_nd:2107400-3047900,118022,8,58.402
scf7180000002596_nd:2107400-3047900,100241,8,58.399
scf7180000003003_nd:299800-412336,12369,8,58.402
scf7180000003003_nd:299800-412336,12388,8,58.397
scf7180000002749_nd:0-362954,78009,8,58.452
scf7180000002808_nd:63000-610200,21531,8,58.986
scf7180000002622_nd:9088600-10204713,336581,8,59.277
scf7180000002622_nd:9088600-10204713,161494,8,59.52
scf7180000002622_nd:8037600-9088400,635557,8,80.225
scf7180000002622_nd:7371800-8037200,632822,8,59.572
scf7180000002622_nd:7371800-8037200,31986,8,60.577
scf7180000002622_nd:3425500-7370500,3816256,8,60.445
scf7180000002622_nd:3425500-7370500,3781573,8,60.448
scf7180000002622_nd:3425500-7370500,3633789,8,60.445
scf7180000002622_nd:3425500-7370500,3524894,8,61.029
scf7180000002622_nd:3425500-7370500,3189206,8,61.029
scf7180000002622_nd:3425500-7370500,3160506,8,61.075
scf7180000002622_nd:3425500-7370500,2559871,8,60.979
scf7180000002622_nd:3425500-7370500,2223448,8,61.321
scf7180000002622_nd:3425500-7370500,1985759,8,62.248
scf7180000002622_nd:3425500-7370500,1777198,8,62.21
scf7180000002622_nd:3425500-7370500,1427797,8,62.191
scf7180000002622_nd:3425500-7370500,1426998,8,62.286
scf7180000002622_nd:3425500-7370500,1362360,8,62.079
scf7180000002622_nd:3425500-7370500,690035,8,62.429
scf7180000002622_nd:3425500-7370500,407501,8,63.313
scf7180000002622_nd:3425500-7370500,233958,8,63.373
scf7180000002622_nd:3425500-7370500,228771,8,63.316
scf7180000002962_nd:200-630300,93449,8,63.37
scf7180000002962_nd:200-630300,356715,8,63.878
scf7180000002739_nd:1700-2563400,73772,8,91.658
scf7180000002739_nd:1700-2563400,100914,8,91.554
scf7180000002739_nd:1700-2563400,282417,8,92.69
scf7180000002739_nd:1700-2563400,287551,8,92.783
scf7180000002739_nd:1700-2563400,563002,8,94.009
scf7180000002739_nd:1700-2563400,567782,8,94.26
scf7180000002739_nd:1700-2563400,743472,8,94.025
scf7180000002739_nd:1700-2563400,859046,8,94.667
scf7180000002739_nd:1700-2563400,1107759,8,97.111
scf7180000003583_nd:10318900-11733000,425797,8,65.05
scf7180000003583_nd:10318900-11733000,610794,8,65.483
scf7180000003583_nd:11735900-12526000,337562,8,67.45
scf7180000003583_nd:11735900-12526000,487975,8,67.471
scf7180000003583_nd:12526800-13228900,526521,8,67.45
scf7180000003583_nd:13234800-13356000,75607,8,67.766
scf7180000003583_nd:13357900-15159800,756008,8,69.282
scf7180000003583_nd:13357900-15159800,836410,8,69.436
scf7180000003583_nd:13357900-15159800,1267208,8,70.196
scf7180000003072_nd:0-200100,130262,8,71.399
scf7180000003573_nd:137900-3816600,2858235,7,7.236
scf7180000003074_nd:600-402210,142066,8,71.419
scf7180000003074_nd:600-402210,379511,8,71.419
scf7180000003037_nd:20500-813700,619132,8,71.683
scf7180000003037_nd:20500-813700,397795,8,72.611
scf7180000003037_nd:20500-813700,390774,8,72.611
scf7180000003037_nd:20500-813700,270623,8,72.616
scf7180000003037_nd:20500-813700,198857,8,72.619
scf7180000002600_nd:6658200-7340953,219161,8,74.444
scf7180000002600_nd:5366900-6657600,820868,8,76.561
scf7180000002600_nd:5366900-6657600,813604,8,76.569
scf7180000002600_nd:5366900-6657600,642655,8,77.789
scf7180000002600_nd:5366900-6657600,251199,8,78.734
scf7180000002600_nd:5366900-6657600,133318,8,78.484
scf7180000002600_nd:5366900-6657600,87494,8,78.668
scf7180000002600_nd:5366900-6657600,34380,8,78.712
scf7180000002600_nd:3327000-5366700,2001844,8,79.334
scf7180000002600_nd:3327000-5366700,1991992,8,79.634
scf7180000002600_nd:3327000-5366700,1926020,8,79.92
scf7180000002600_nd:3327000-5366700,1710325,8,80.567
scf7180000002600_nd:3327000-5366700,1705347,8,80.586
scf7180000002600_nd:3327000-5366700,799322,8,80.842
scf7180000002600_nd:3327000-5366700,736600,8,80.903
scf7180000002600_nd:3327000-5366700,149628,8,81.46
scf7180000002600_nd:3327000-5366700,145157,8,81.448
scf7180000002870_nd:0-1712200,1528592,8,81.382
scf7180000002600_nd:3327000-5366700,74497,8,81.572
scf7180000002600_nd:300-3326600,2535613,8,82.987
scf7180000002600_nd:300-3326600,1856156,8,85.092
scf7180000002600_nd:300-3326600,1805147,8,85.398
scf7180000002600_nd:300-3326600,1186930,8,90.984
scf7180000003549_nd:28400-1579200,396330,8,91.608
scf7180000002600_nd:300-3326600,894346,8,91.562
scf7180000002600_nd:300-3326600,883411,8,91.399
scf7180000002616_nd:58500-600500,518880,8,91.557
scf7180000002616_nd:58500-600500,525105,8,91.554
scf7180000002739_nd:1700-2563400,1621525,8,100.484
scf7180000002739_nd:1700-2563400,1866188,8,101.398
scf7180000002739_nd:1700-2563400,1980521,8,102.007
scf7180000002739_nd:1700-2563400,2131083,8,102.837
scf7180000003603_nd:865500-2628800,1078301,8,104.408
scf7180000003553_nd:7200-639700,172032,8,104.705
scf7180000003553_nd:640400-3154600,228461,8,107.096
scf7180000003553_nd:640400-3154600,233939,8,107.103
scf7180000003553_nd:640400-3154600,1174686,8,107.994
scf7180000003553_nd:640400-3154600,1189210,8,107.968
scf7180000003553_nd:640400-3154600,1205658,8,107.968
scf7180000003553_nd:640400-3154600,1246108,8,108.264
scf7180000003553_nd:640400-3154600,1428287,8,108.283
scf7180000003555_nd:1559500-3834300,2122655,8,108.264
scf7180000003555_nd:1559500-3834300,1648074,8,108.852
scf7180000003573_nd:7068900-9152900,1139589,7,13.641
scf7180000002943_nd:400-813800,273975,8,110.918
scf7180000003555_nd:1559500-3834300,311349,8,109.437
scf7180000003555_nd:1559500-3834300,812943,8,109.15
scf7180000003567_nd:21500-762900,573886,9,0.048
scf7180000003567_nd:21500-762900,583820,9,0.048
scf7180000003567_nd:21500-762900,614836,9,0
scf7180000002794_nd:46300-1142500,640927,9,1.169
scf7180000002580_nd:5110100-7757000,691301,9,1.516
scf7180000002580_nd:5110100-7757000,722273,9,1.481
scf7180000002580_nd:5110100-7757000,1482452,9,2.15
scf7180000002580_nd:5110100-7757000,1503507,9,2.14
scf7180000002580_nd:5110100-7757000,1811198,9,2.15
scf7180000002580_nd:5110100-7757000,2092787,9,2.426
scf7180000002580_nd:5110100-7757000,2146134,9,2.4
scf7180000002580_nd:5110100-7757000,2394002,9,2.047
scf7180000002595_nd:1300-2732500,644409,9,2.426
scf7180000002595_nd:1300-2732500,869409,9,2.418
scf7180000002595_nd:1300-2732500,2469073,9,5.02
scf7180000002595_nd:1300-2732500,2537644,9,5.024
scf7180000002595_nd:1300-2732500,2557452,9,5.021
scf7180000003589_nd:100-2936500,302557,9,5.012
scf7180000003589_nd:100-2936500,437875,9,5.024
scf7180000002608_nd:4909100-5609707,555244,9,5.021
scf7180000002608_nd:4909100-5609707,404459,9,5.632
scf7180000002608_nd:4909100-5609707,396501,9,5.664
scf7180000002716_nd:0-2616000,122733,9,6.191
scf7180000002716_nd:0-2616000,219450,9,6.193
scf7180000002838_nd:0-1371900,603564,9,7.599
scf7180000003198_ld:20900-24395,314,9,7.067
scf7180000002838_nd:0-1371900,916544,9,7.052
scf7180000002838_nd:0-1371900,853841,9,7.638
scf7180000002838_nd:0-1371900,420948,9,7.931
scf7180000002838_nd:0-1371900,77285,9,8.809
scf7180000002608_nd:4909100-5609707,667034,9,8.721
scf7180000002604_nd:2890500-5354700,1335927,9,9.496
scf7180000002604_nd:2890500-5354700,260622,9,10.88
scf7180000002604_nd:2890500-5354700,158093,9,10.88
scf7180000002604_nd:2890500-5354700,156445,9,10.892
scf7180000003581_nd:1200-1480300,123885,9,11.466
scf7180000003581_nd:1200-1480300,164203,9,11.493
scf7180000003581_nd:1200-1480300,327508,9,11.466
scf7180000003572_nd:33100-2229360,2096111,9,11.75
scf7180000003572_nd:33100-2229360,1832689,9,12.044
scf7180000003572_nd:33100-2229360,1460193,9,12.383
scf7180000003572_nd:33100-2229360,1227784,9,13.234
scf7180000003572_nd:33100-2229360,1088796,9,13.225
scf7180000002591_nd:3726700-7695900,3337035,9,14.433
scf7180000002591_nd:3726700-7695900,2646519,9,14.481
scf7180000002591_nd:3726700-7695900,2136330,9,20.754
scf7180000002591_nd:3726700-7695900,1586960,9,22.635
scf7180000002591_nd:3726700-7695900,1580046,9,22.624
scf7180000002591_nd:3726700-7695900,1222673,9,26.521
scf7180000002591_nd:3726700-7695900,1193760,9,26.502
scf7180000002591_nd:3726700-7695900,1179213,9,26.573
scf7180000002591_nd:968400-3726500,2616392,9,35.733
scf7180000002591_nd:968400-3726500,2413049,9,36.314
scf7180000002591_nd:968400-3726500,2246985,9,37.573
scf7180000002603_nd:662100-5016900,3375779,9,43.339
scf7180000002603_nd:662100-5016900,3217475,9,43.703
scf7180000002603_nd:662100-5016900,3142104,9,43.649
scf7180000002603_nd:662100-5016900,3049988,9,45.766
scf7180000002603_nd:662100-5016900,3029632,9,45.902
scf7180000002603_nd:662100-5016900,2813741,9,47.321
scf7180000002603_nd:662100-5016900,2383300,9,48.448
scf7180000002603_nd:662100-5016900,2379290,9,48.486
scf7180000002603_nd:662100-5016900,2377272,9,48.448
scf7180000002603_nd:662100-5016900,1787746,9,50.128
scf7180000002603_nd:662100-5016900,1764045,9,50.128
scf7180000002603_nd:662100-5016900,1435195,9,50.711
scf7180000002603_nd:662100-5016900,1412059,9,50.711
scf7180000002603_nd:662100-5016900,1374975,9,51.004
scf7180000002603_nd:662100-5016900,917485,9,55.323
scf7180000002603_nd:150400-662000,442783,9,56.492
scf7180000002603_nd:150400-662000,349184,9,57.614
scf7180000002603_nd:150400-662000,298613,9,57.614
scf7180000002603_nd:150400-662000,194089,9,58.345
scf7180000002770_nd:1900-2305400,227290,9,58.49
scf7180000002770_nd:1900-2305400,247276,9,58.492
scf7180000002770_nd:1900-2305400,362789,9,58.781
scf7180000002770_nd:1900-2305400,401199,9,58.781
scf7180000002770_nd:1900-2305400,555618,9,59.072
scf7180000002770_nd:1900-2305400,1130513,9,59.931
scf7180000002770_nd:1900-2305400,1305730,9,60.739
scf7180000002770_nd:1900-2305400,1333141,9,60.743
scf7180000002770_nd:1900-2305400,1717517,9,61.037
scf7180000002770_nd:1900-2305400,1751696,9,61.32
scf7180000002770_nd:1900-2305400,1879911,9,61.32
scf7180000002770_nd:2306200-2997000,342635,9,62.788
scf7180000002770_nd:2306200-2997000,377112,9,62.56
scf7180000002671_nd:1915100-4510434,997348,9,63.971
scf7180000002671_nd:1915100-4510434,1521414,9,65.714
scf7180000002671_nd:1915100-4510434,1579260,9,65.733
scf7180000002671_nd:1915100-4510434,1657502,9,66.031
scf7180000002671_nd:1915100-4510434,2113031,9,68.084
scf7180000002732_nd:4066100-4871748,739776,9,68.397
scf7180000002607_nd:660200-12628500,2107358,9,68.675
scf7180000003566_nd:0-640400,371652,10,0.002
scf7180000003566_nd:0-640400,384930,10,0
scf7180000003566_nd:0-640400,385073,10,0.016
scf7180000003566_nd:0-640400,475774,10,0.31
scf7180000002641_nd:25300-3512537,183946,10,0.602
scf7180000002641_nd:25300-3512537,240887,10,0.632
scf7180000002641_nd:25300-3512537,328514,10,0.602
scf7180000002641_nd:25300-3512537,948945,10,1.193
scf7180000002641_nd:25300-3512537,1060669,10,1.894
scf7180000002641_nd:25300-3512537,1183577,10,2.286
scf7180000002641_nd:25300-3512537,1224360,10,2.592
scf7180000002641_nd:25300-3512537,1296017,10,2.603
scf7180000002641_nd:25300-3512537,1413981,10,3.326
scf7180000002641_nd:25300-3512537,1489322,10,3.374
scf7180000002641_nd:25300-3512537,1529183,10,4.198
scf7180000002641_nd:25300-3512537,1742878,10,5.36
scf7180000002641_nd:25300-3512537,1785189,10,5.651
scf7180000002641_nd:25300-3512537,1835469,10,5.651
scf7180000002641_nd:25300-3512537,2212714,10,5.943
scf7180000002641_nd:25300-3512537,2261830,10,5.943
scf7180000002641_nd:25300-3512537,2295747,10,5.997
scf7180000002641_nd:25300-3512537,2328530,10,6.301
scf7180000002641_nd:25300-3512537,2563879,10,6.821
scf7180000002641_nd:25300-3512537,2825992,10,7.408
scf7180000002641_nd:25300-3512537,2886059,10,8.452
scf7180000002641_nd:25300-3512537,3091172,10,9.101
scf7180000002641_nd:25300-3512537,3091233,10,8.95
scf7180000002920_nd:0-1120800,968,10,8.928
scf7180000002920_nd:0-1120800,301504,10,9.332
scf7180000002920_nd:0-1120800,714535,10,9.948
scf7180000003175_nd:0-502500,260175,10,11.674
scf7180000003175_nd:0-502500,291370,10,11.854
scf7180000002671_nd:1915100-4510434,137268,10,12.798
scf7180000002597_nd:0-9462900,9415229,10,14.016
scf7180000002597_nd:0-9462900,8671935,10,15.373
scf7180000002597_nd:0-9462900,6636253,10,18.422
scf7180000002597_nd:0-9462900,6496928,10,19.546
scf7180000002597_nd:0-9462900,6367240,10,20.021
scf7180000002597_nd:0-9462900,6250077,10,20.92
scf7180000002597_nd:0-9462900,6222050,10,20.915
scf7180000002597_nd:0-9462900,6124695,10,20.926
scf7180000002597_nd:0-9462900,6081036,10,21.18
scf7180000002597_nd:0-9462900,6028022,10,21.273
scf7180000002597_nd:0-9462900,5883004,10,21.18
scf7180000002597_nd:0-9462900,5783809,10,21.427
scf7180000002597_nd:0-9462900,5780381,10,21.793
scf7180000002597_nd:0-9462900,5258471,10,22.324
scf7180000002597_nd:0-9462900,5224279,10,39.042
scf7180000002597_nd:0-9462900,4721652,10,23.432
scf7180000002597_nd:0-9462900,4264462,10,24.34
scf7180000002597_nd:0-9462900,4050650,10,24.744
scf7180000002597_nd:0-9462900,3842331,10,25.756
scf7180000002597_nd:0-9462900,3696513,10,26.836
scf7180000002597_nd:0-9462900,3209119,10,28.025
scf7180000002597_nd:0-9462900,2706435,10,28.935
scf7180000002597_nd:0-9462900,2624506,10,29.239
scf7180000002597_nd:0-9462900,2595829,10,29.152
scf7180000002597_nd:0-9462900,2384580,10,29.844
scf7180000002597_nd:0-9462900,2082519,10,31.819
scf7180000002597_nd:0-9462900,1949291,10,32.745
scf7180000002680_nd:700-530539,522564,10,33.635
scf7180000002680_nd:700-530539,243041,10,33.635
scf7180000002585_nd:5617800-9219300,94463,10,36.357
scf7180000002585_nd:5617800-9219300,1538811,10,38.442
scf7180000002585_nd:5617800-9219300,1375345,10,38.429
scf7180000002585_nd:5617800-9219300,1046053,10,38.446
scf7180000002585_nd:5617800-9219300,978987,10,38.446
scf7180000002585_nd:5617800-9219300,843247,10,37.26
scf7180000003555_nd:1559500-3834300,1409745,8,109.084
scf7180000002603_nd:662100-5016900,272353,8,109.164
scf7180000002585_nd:5617800-9219300,2581341,10,38.501
scf7180000003564_nd:8200-1348491,367659,10,38.392
scf7180000003603_nd:0-865400,320901,10,39.64
scf7180000003603_nd:0-865400,366895,10,40.407
scf7180000003603_nd:0-865400,369377,10,40.499
scf7180000003603_nd:0-865400,454441,10,41.107
scf7180000003603_nd:0-865400,514019,10,41.693
scf7180000003603_nd:0-865400,622275,10,41.993
scf7180000003603_nd:0-865400,706972,10,42.286
scf7180000003603_nd:865500-2628800,386531,10,42.289
scf7180000003603_nd:865500-2628800,442837,10,42.289
scf7180000003603_nd:865500-2628800,538905,10,42.586
scf7180000003603_nd:865500-2628800,538946,10,42.62
scf7180000003603_nd:865500-2628800,851521,10,43.178
scf7180000003603_nd:865500-2628800,1307510,10,43.477
scf7180000003603_nd:865500-2628800,1326956,10,43.478
scf7180000003603_nd:865500-2628800,1364118,10,43.477
scf7180000003603_nd:865500-2628800,1500278,10,43.523
scf7180000003603_nd:865500-2628800,1723162,10,43.48
scf7180000003578_nd:127900-2627400,697655,10,43.441
scf7180000003578_nd:127900-2627400,1035175,10,44.076
scf7180000002688_nd:41000-2328062,2205778,10,47.057
scf7180000002688_nd:41000-2328062,1913911,10,47.614
scf7180000002688_nd:41000-2328062,1712002,10,48.81
scf7180000002688_nd:41000-2328062,1710346,10,48.65
scf7180000003044_ld:43800-52409,6334,10,49.099
scf7180000002688_nd:41000-2328062,680525,10,51.847
scf7180000002688_nd:41000-2328062,665947,10,52.095
scf7180000002702_nd:10700-901000,10659,10,55.48
scf7180000002702_nd:10700-901000,428717,10,55.787
scf7180000002702_nd:10700-901000,474028,10,56.398
scf7180000002702_nd:10700-901000,666258,10,57.01
scf7180000002684_nd:7200-2111300,1935545,10,56.932
scf7180000002684_nd:7200-2111300,1895847,10,59.758
scf7180000003039_nd:0-2747700,237858,10,62.218
scf7180000003039_nd:0-2747700,946224,10,65.839
scf7180000003039_nd:0-2747700,964200,10,65.848
scf7180000003039_nd:0-2747700,1678376,10,65.839
scf7180000003039_nd:0-2747700,1738627,10,66.119
scf7180000003039_nd:0-2747700,1748390,10,66.112
scf7180000003039_nd:0-2747700,1924765,10,66.138
scf7180000003039_nd:0-2747700,1984353,10,66.096
scf7180000003039_nd:0-2747700,2134837,10,67.334
scf7180000003039_nd:0-2747700,2399745,10,67.229
scf7180000002864_nd:2845000-6523800,25645,10,68.838
scf7180000002864_nd:2845000-6523800,305635,10,69.386
scf7180000002864_nd:2845000-6523800,3051024,10,74.857
scf7180000002864_nd:2845000-6523800,3092265,10,74.857
scf7180000002618_nd:932700-1265500,9594,10,77.246
scf7180000002618_nd:142200-932400,626698,10,77.546
scf7180000002618_nd:142200-932400,124946,10,78.464
scf7180000003163_nd:300-97400,48262,10,78.74
scf7180000003588_nd:1103700-2455600,870400,11,13.965
scf7180000003588_nd:1103700-2455600,992015,11,14.427
scf7180000002598_nd:0-2529200,284425,11,0
scf7180000002598_nd:0-2529200,522861,11,1.765
scf7180000002598_nd:0-2529200,869813,11,2.975
scf7180000002598_nd:0-2529200,1700823,11,7.173
scf7180000002598_nd:0-2529200,2165382,11,9.396
scf7180000002598_nd:0-2529200,2236315,11,9.231
scf7180000002598_nd:0-2529200,2431858,11,10.952
scf7180000002598_nd:0-2529200,2461682,11,11.298
scf7180000003588_nd:36300-1103200,64409,11,11.19
scf7180000003588_nd:36300-1103200,68632,11,11.243
scf7180000003588_nd:36300-1103200,121285,11,11.593
scf7180000003588_nd:36300-1103200,544929,11,11.86
scf7180000003588_nd:36300-1103200,808995,11,12.68
scf7180000003588_nd:36300-1103200,847815,11,12.981
scf7180000003588_nd:36300-1103200,992321,11,13.828
scf7180000003588_nd:1103700-2455600,1194985,11,14.426
scf7180000003588_nd:2455800-5794391,835612,11,14.426
scf7180000003588_nd:2455800-5794391,850782,11,14.396
scf7180000003588_nd:2455800-5794391,291448,11,14.787
scf7180000003588_nd:2455800-5794391,2881633,11,14.733
scf7180000002585_nd:926600-2820400,1184276,11,15.875
scf7180000002585_nd:926600-2820400,912553,11,16.474
scf7180000002585_nd:0-925800,790595,11,17.07
scf7180000002585_nd:0-925800,435937,11,17.336
scf7180000002585_nd:0-925800,196214,11,18.002
scf7180000002674_nd:1300-1478900,147064,11,20.343
scf7180000002674_nd:1300-1478900,236553,11,20.346
scf7180000002674_nd:1300-1478900,239477,11,20.647
scf7180000003550_nd:1600-5499400,4203122,11,20.98
scf7180000002674_nd:1300-1478900,478698,11,21.246
scf7180000002674_nd:1300-1478900,723950,11,21.244
scf7180000002674_nd:1300-1478900,725180,11,21.268
scf7180000002674_nd:1300-1478900,1048188,11,21.549
scf7180000002674_nd:1300-1478900,1198478,11,22.146
scf7180000002674_nd:1300-1478900,1201152,11,22.123
scf7180000002674_nd:1300-1478900,1306186,11,22.453
scf7180000003562_nd:1700-642189,105660,11,22.453
scf7180000003562_nd:1700-642189,448538,11,27.11
scf7180000003584_nd:0-3513100,2386289,11,29.62
scf7180000003584_nd:0-3513100,2260221,11,29.94
scf7180000003584_nd:0-3513100,1743172,11,34.28
scf7180000003584_nd:0-3513100,1714434,11,34.208
scf7180000003584_nd:0-3513100,1610488,11,34.266
scf7180000003584_nd:0-3513100,1268060,11,35.819
scf7180000003584_nd:0-3513100,844506,11,36.138
scf7180000003584_nd:0-3513100,833116,11,36.138
scf7180000003584_nd:0-3513100,564271,11,36.756
scf7180000003584_nd:0-3513100,253348,11,37.373
scf7180000003584_nd:0-3513100,181864,11,37.987
scf7180000003584_nd:0-3513100,172496,11,37.987
scf7180000003584_nd:0-3513100,30090,11,39.176
scf7180000003552_nd:1614800-1839400,146284,11,43.408
scf7180000003552_nd:0-1614600,1277089,11,42.493
scf7180000003552_nd:0-1614600,1276709,11,42.386
scf7180000003552_nd:0-1614600,1275176,11,42.498
scf7180000003552_nd:0-1614600,898325,11,42.197
scf7180000003552_nd:0-1614600,549952,11,39.773
scf7180000003552_nd:0-1614600,114408,11,39.17
scf7180000003569_nd:0-711700,585956,11,43.389
scf7180000003599_nd:0-310500,280928,11,43.393
scf7180000003569_nd:0-711700,617580,11,43.389
scf7180000003569_nd:0-711700,370532,11,43.696
scf7180000003569_nd:0-711700,270739,11,44.883
scf7180000003569_nd:0-711700,261700,11,44.88
scf7180000003569_nd:0-711700,254225,11,44.88
scf7180000003569_nd:0-711700,156159,11,45.764
scf7180000002799_nd:0-1844800,960562,11,46.059
scf7180000002799_nd:0-1844800,560408,11,46.352
scf7180000002799_nd:0-1844800,472667,11,46.344
scf7180000002870_nd:0-1712200,958868,5,49.42
scf7180000002870_nd:0-1712200,1500345,5,48.828
scf7180000003599_nd:0-310500,1145,11,43.305
scf7180000003599_nd:0-310500,2249,11,43.393
scf7180000003583_nd:15178500-20706000,589479,11,48.002
scf7180000003550_nd:5499500-5800800,156255,11,48.298
scf7180000003550_nd:5499500-5800800,155295,11,48.297
scf7180000003550_nd:5499500-5800800,153254,11,48.295
scf7180000003550_nd:5499500-5800800,29503,11,48.297
scf7180000003550_nd:1600-5499400,73413,11,49.172
scf7180000003550_nd:1600-5499400,442766,11,50.594
scf7180000003550_nd:1600-5499400,491006,11,50.63
scf7180000003550_nd:1600-5499400,697073,11,52.726
scf7180000003550_nd:1600-5499400,843051,11,53.006
scf7180000003550_nd:1600-5499400,1066199,11,53.425
scf7180000003550_nd:1600-5499400,1255941,11,54.335
scf7180000003550_nd:1600-5499400,1270226,11,54.64
scf7180000003550_nd:1600-5499400,1314069,11,54.937
scf7180000003550_nd:1600-5499400,1671854,11,56.445
scf7180000003550_nd:1600-5499400,1713360,11,56.369
scf7180000003550_nd:1600-5499400,2233963,11,56.75
scf7180000003550_nd:1600-5499400,2272216,11,56.75
scf7180000003550_nd:1600-5499400,2618758,11,57.305
scf7180000003550_nd:1600-5499400,2664735,11,57.607
scf7180000003550_nd:1600-5499400,2742657,11,58.5
scf7180000003550_nd:1600-5499400,3213981,11,61.226
scf7180000003583_nd:15178500-20706000,2106587,11,47.806
scf7180000003583_nd:15178500-20706000,2674941,11,48.002
scf7180000003583_nd:15178500-20706000,2709297,11,48.047
scf7180000002799_nd:0-1844800,84168,11,47.557
scf7180000003550_nd:1600-5499400,3517865,11,62.745
scf7180000003550_nd:1600-5499400,3520012,11,62.745
scf7180000003550_nd:1600-5499400,3616100,11,62.883
scf7180000003550_nd:1600-5499400,4225467,11,63.055
scf7180000003550_nd:1600-5499400,4226028,11,63.05
scf7180000003550_nd:1600-5499400,4294172,11,63.05
scf7180000003550_nd:1600-5499400,4294202,11,63.057
scf7180000003550_nd:1600-5499400,4468196,11,64.564
scf7180000003550_nd:1600-5499400,4590873,11,65.48
scf7180000002695_nd:1224300-1936435,426542,11,66.999
scf7180000002695_nd:1224300-1936435,78270,11,67.609
scf7180000002695_nd:1224300-1936435,32652,11,67.498
scf7180000002695_nd:600-1223300,908477,11,69.716
scf7180000002695_nd:600-1223300,620828,11,70.931
scf7180000002695_nd:600-1223300,566308,11,70.936
scf7180000002590_nd:1714500-3074900,415524,11,73.238
scf7180000002590_nd:1714500-3074900,553281,11,73.539
scf7180000002590_nd:1714500-3074900,668969,11,74.424
scf7180000002590_nd:1714500-3074900,1208070,11,74.989
scf7180000002590_nd:3075600-8599700,145567,11,74.989
scf7180000002590_nd:3075600-8599700,465527,11,75.292
scf7180000002590_nd:3075600-8599700,571968,11,75.212
scf7180000002590_nd:3075600-8599700,584521,11,75.292
scf7180000002590_nd:3075600-8599700,595078,11,75.594
scf7180000002590_nd:3075600-8599700,666990,11,75.602
scf7180000002590_nd:3075600-8599700,777987,11,75.871
scf7180000002590_nd:3075600-8599700,907856,11,75.871
scf7180000002904_nd:700-128700,57334,11,76.774
scf7180000002590_nd:3075600-8599700,1114868,11,76.794
scf7180000002590_nd:3075600-8599700,1361421,11,77.682
scf7180000002590_nd:3075600-8599700,2027053,11,78.6
scf7180000002590_nd:3075600-8599700,2214571,11,78.589
scf7180000002590_nd:3075600-8599700,2875799,11,79.193
scf7180000002590_nd:3075600-8599700,3119884,11,80.994
scf7180000002590_nd:3075600-8599700,3135776,11,81.295
scf7180000002590_nd:3075600-8599700,3439625,11,82.565
scf7180000002590_nd:3075600-8599700,3545239,11,84
scf7180000002590_nd:3075600-8599700,3605648,11,84.062
scf7180000002590_nd:3075600-8599700,3693317,11,83.697
scf7180000002590_nd:3075600-8599700,4556201,11,87.589
scf7180000002590_nd:3075600-8599700,4633454,11,87.584
scf7180000002590_nd:3075600-8599700,4701457,11,87.872
scf7180000002590_nd:3075600-8599700,4932828,11,88.169
scf7180000002590_nd:3075600-8599700,5051838,11,88.169
scf7180000003135_nd:46200-683152,197703,11,89.064
scf7180000003135_nd:46200-683152,385405,11,89.084
