[
    {
        "id":1,
        "type":1,
        "name":"Renault ZOE ZE50",
        "efficiency" : 17,
        "Charging" : 50,
        "Range" : 135 ,
        "features":" 5 seats, 5 doors, front, 140 mph, Titanium Grey",
        "Available_from" : "18/12/2020 ",
        "price":450
},
{
    "id":2,
    "type":1,
    "name":"Renault ZOE ZE50",
    "efficiency": 17,
    "Charging" : 50,
    "Range" : 135 ,
    "features":" 5 seats, 5 doors, front, 140 mph, Titanium Grey",
    "Available_from" : "19/12/2020 ",
    "price":450
},
{    
    "id":3,
    "type":2,
    "name":"2020 MG ZS EV (Excite)",
    "efficiency" : 19,
     "Charging":76,
     "Range": 135 ,
     "features": "5 seats, 5 doors, front, 87 mph, Black Pearl",
      "Available_from" : "22/12/2020",
      "price":480
    },
    {    
        "id":4,
        "type":3,
        "name":"2020 MG ZS EV ",
        "efficiency" : 19,
         "Charging":76,
         "Range": 135 ,
         "features": "5 seats, 5 doors, front, 87 mph, Black Pearl",
          "Available_from" : "22/12/2020",
          "price": 510
        }
        ,
        {"id":5,
            "type":4,
            "name":" Renault ZOE ",
            "efficiency" :  27,
             "Charging":85,
             "Range": 100,
             "features": "5 seats, 5 doors, front, 140 mph, Titanium Grey",
              "Available_from" : "15/12/2020 ",
              "price": 550}
      

 
]