{
	"development": {
		"username": "root",
		"password": null,
		"database": "temporal",
		"host": "localhost",
		"dialect": "mysql",
		"PUBLIC_VAPID_KEY": "BMpcBZlyDHWND3afHEyNZZ6AFmSEUu0qZ1v7jQraBudMeqPt8W7lu14BOOUSxu_KJlK-VAhZmKy77zunay-XOzY",
		"PRIVATE_VAPID_KEY": "87IwAjwqeCRtclFlDFKGaVAGL-WuSFXRllR2bGRPTwE"
	},
	"test": {
		"username": "root",
		"password": null,
		"database": "database_test",
		"host": "localhost",
		"dialect": "mysql",
		"PUBLIC_VAPID_KEY": "BMpcBZlyDHWND3afHEyNZZ6AFmSEUu0qZ1v7jQraBudMeqPt8W7lu14BOOUSxu_KJlK-VAhZmKy77zunay-XOzY",
		"PRIVATE_VAPID_KEY": "87IwAjwqeCRtclFlDFKGaVAGL-WuSFXRllR2bGRPTwE"
	},
	"production": {
		"username": "root",
		"password": null,
		"database": "temporal",
		"host": "localhost",
		"dialect": "mysql",
		"PUBLIC_VAPID_KEY": "BMpcBZlyDHWND3afHEyNZZ6AFmSEUu0qZ1v7jQraBudMeqPt8W7lu14BOOUSxu_KJlK-VAhZmKy77zunay-XOzY",
		"PRIVATE_VAPID_KEY": "87IwAjwqeCRtclFlDFKGaVAGL-WuSFXRllR2bGRPTwE"
	}
}
