﻿id,reg_id,name,email,mobile,status_code,lang_code,last_login_method,is_active,cr_by,cr_dtimes
110001,5402120055,Hortense Dauenhauer,hortense.dauenhauer@xyz.com,975366148,ACT,eng,PWD,TRUE,superadmin,now()
110002,7314004469,Leonia Bermeo,leonia.bermeo@xyz.com,795281431,ACT,eng,PWD,TRUE,superadmin,now()
110003,7896109326,Bong Bragan,bong.bragan@xyz.com,739704695,ACT,eng,PWD,TRUE,superadmin,now()
110004,2870381373,Homer Molinar,homer.molinar@xyz.com,725028706,ACT,eng,PWD,TRUE,superadmin,now()
110005,7234451333,Antony Hughes,antony.hughes@xyz.com,804319687,ACT,eng,PWD,TRUE,superadmin,now()
110006,3563474484,Audra Amezquita,audra.amezquita@xyz.com,791830986,ACT,eng,PWD,TRUE,superadmin,now()
110007,5804057178,Leia White,leia.white@xyz.com,899884346,ACT,eng,PWD,TRUE,superadmin,now()
110008,1823955503,Idella Houge,idella.houge@xyz.com,946624002,ACT,eng,PWD,TRUE,superadmin,now()
110009,6028049229,Shay Vitagliano,shay.vitagliano@xyz.com,716591396,ACT,eng,PWD,TRUE,superadmin,now()
110010,2685259089,Mazie Negley,mazie.negley@xyz.com,718961429,ACT,eng,PWD,TRUE,superadmin,now()
110011,3834346151,Magda Godoy,magda.godoy@xyz.com,938380935,ACT,eng,PWD,TRUE,superadmin,now()
110012,3493338361,Anya Adorno,anya.adorno@xyz.com,911713143,ACT,eng,PWD,TRUE,superadmin,now()
110013,5145284955,Darby Self,darby.self@xyz.com,859668671,ACT,eng,PWD,TRUE,superadmin,now()
110014,4285838622,Crissy Flor,crissy.flor@xyz.com,971384902,ACT,eng,PWD,TRUE,superadmin,now()
110015,3740463764,Bettina Goering,bettina.goering@xyz.com,876997632,ACT,eng,PWD,TRUE,superadmin,now()
110016,6431857131,Hilary Dunklin,hilary.dunklin@xyz.com,853451517,ACT,eng,PWD,TRUE,superadmin,now()
110017,2638207977,Kris Rahm,kris.rahm@xyz.com,723337142,ACT,eng,PWD,TRUE,superadmin,now()
110018,6893364288,Ferne Hang,ferne.hang@xyz.com,733802681,ACT,eng,PWD,TRUE,superadmin,now()
110019,5251539502,Leilani Heavener,leilani.heavener@xyz.com,942983448,ACT,eng,PWD,TRUE,superadmin,now()
110020,7724013062,Irwin Norwood,irwin.norwood@xyz.com,9663175928,ACT,eng,PWD,TRUE,superadmin,now()
