{
  "file_generated_by": "FlutterFire CLI",
  "purpose": "FirebaseAppID & ProjectID for this Firebase app in this directory",
  "GOOGLE_APP_ID": "1:591837347040:ios:eab016969c6c3da1bae485",
  "FIREBASE_PROJECT_ID": "newproject-8b4a8",
  "GCM_SENDER_ID": "591837347040"
}