{
  "project_info": {
    "project_number": "689094306544",
    "project_id": "astha-de3e8",
    "storage_bucket": "astha-de3e8.appspot.com"
  },
  "client": [
    {
      "client_info": {
        "mobilesdk_app_id": "1:689094306544:android:ecd6fed8e3d82f1f5ff035",
        "android_client_info": {
          "package_name": "com.example.imobilepay"
        }
      },
      "oauth_client": [
        {
          "client_id": "689094306544-jsra0647obj25g9hgfgapbmhhisojr0d.apps.googleusercontent.com",
          "client_type": 3
        }
      ],
      "api_key": [
        {
          "current_key": "AIzaSyBkK72kpmDDBumGJdO-vaY1Fh-Zl0Z3ulU"
        }
      ],
      "services": {
        "appinvite_service": {
          "other_platform_oauth_client": [
            {
              "client_id": "689094306544-jsra0647obj25g9hgfgapbmhhisojr0d.apps.googleusercontent.com",
              "client_type": 3
            }
          ]
        }
      }
    }
  ],
  "configuration_version": "1"
}