{
	"info": {
		"_postman_id": "1032bfef-3e42-4e47-9ca4-33a732c1a442",
		"name": "Appform_apis",
		"schema": "https://schema.getpostman.com/json/collection/v2.1.0/collection.json"
	},
	"item": [
		{
			"name": "localhost:8087/appForm/v1/fetchBasicAppFormDetails/C457462084",
			"protocolProfileBehavior": {
				"disableBodyPruning": true
			},
			"request": {
				"method": "GET",
				"header": [
					{
						"key": "Content-Type",
						"value": "application/json",
						"type": "text"
					}
				],
				"body": {
					"mode": "raw",
					"raw": ""
				},
				"url": {
					"raw": "localhost:8087/appForm/v1/fetchBasicAppFormDetails/C457462084",
					"host": [
						"localhost"
					],
					"port": "8087",
					"path": [
						"appForm",
						"v1",
						"fetchBasicAppFormDetails",
						"C457462084"
					]
				}
			},
			"response": []
		},
		{
			"name": "http://localhost:8087/appForm/v1/saveBasicAppFormDetails",
			"request": {
				"method": "POST",
				"header": [],
				"body": {
					"mode": "raw",
					"raw": "{\"insuredList\":\r\n            {\r\n                \"id\": \"37B82A9D-9B77-4C31-9F36-A77CB5373931\",\r\n                \"policy_No\":\"C457462084\",\r\n                    \"family_details\": [{\r\n                            \"first_name\": \"firstTest2\",\r\n                            \"middle_name\": \"middleTest2\",\r\n                            \"last_name\": \"lastTest2\",\r\n                            \"dob\": null,\r\n                            \"occupation\": null,\r\n                            \"gender\": null,\r\n                            \"annual_income\": null,\r\n                            \"total_insurance_cover\": null,\r\n                            \"relationship\": \"Child2\",\r\n                            \"creation_date\": null,\r\n                            \"modified_date\": null\r\n                        }]\r\n                    \r\n            }\r\n}",
					"options": {
						"raw": {
							"language": "json"
						}
					}
				},
				"url": {
					"raw": "http://localhost:8087/appForm/v1/saveBasicAppFormDetails",
					"protocol": "http",
					"host": [
						"localhost"
					],
					"port": "8087",
					"path": [
						"appForm",
						"v1",
						"saveBasicAppFormDetails"
					]
				}
			},
			"response": []
		},
		{
			"name": "localhost:8087/appForm/v1/appFormResponse/C457392552",
			"request": {
				"method": "GET",
				"header": [],
				"url": {
					"raw": "localhost:8087/appForm/v1/appFormResponse/C457392552",
					"host": [
						"localhost"
					],
					"port": "8087",
					"path": [
						"appForm",
						"v1",
						"appFormResponse",
						"C457392552"
					]
				}
			},
			"response": []
		},
		{
			"name": "http://localhost:8087/appForm/v1/getNatureOfWorkQuestionnaire/C457431578/1442",
			"request": {
				"method": "POST",
				"header": [
					{
						"key": "Content-Type",
						"value": "application/json",
						"type": "text"
					}
				],
				"body": {
					"mode": "raw",
					"raw": ""
				},
				"url": {
					"raw": "http://localhost:8087/appForm/v1/getNatureOfWorkQuestionnaire/C457431578/1442",
					"protocol": "http",
					"host": [
						"localhost"
					],
					"port": "8087",
					"path": [
						"appForm",
						"v1",
						"getNatureOfWorkQuestionnaire",
						"C457431578",
						"1442"
					]
				}
			},
			"response": []
		},
		{
			"name": "http://localhost:8087/appForm/v1/declarationDetails/C457392552",
			"protocolProfileBehavior": {
				"disableBodyPruning": true
			},
			"request": {
				"method": "GET",
				"header": [
					{
						"key": "Content-Type",
						"value": "application/json",
						"type": "text"
					}
				],
				"body": {
					"mode": "raw",
					"raw": "",
					"options": {
						"raw": {
							"language": "json"
						}
					}
				},
				"url": {
					"raw": "http://localhost:8087/appForm/v1/declarationDetails/C457392552",
					"protocol": "http",
					"host": [
						"localhost"
					],
					"port": "8087",
					"path": [
						"appForm",
						"v1",
						"declarationDetails",
						"C457392552"
					]
				}
			},
			"response": []
		},
		{
			"name": "localhost:8087/appform/review/v1/fetchReviewFormPDF/C457415015",
			"request": {
				"method": "GET",
				"header": [
					{
						"key": "Content-Type",
						"value": "application/json",
						"type": "text"
					}
				],
				"url": {
					"raw": "localhost:8087/appform/review/v1/fetchReviewFormPDF/C457415015",
					"host": [
						"localhost"
					],
					"port": "8087",
					"path": [
						"appform",
						"review",
						"v1",
						"fetchReviewFormPDF",
						"C457415015"
					]
				}
			},
			"response": []
		},
		{
			"name": "localhost:8087/appForm/v1/fetchQuestionnaireList/C457392552",
			"request": {
				"method": "POST",
				"header": [
					{
						"key": "Content-Type",
						"value": "application/json",
						"type": "text"
					}
				],
				"url": {
					"raw": "localhost:8087/appForm/v1/fetchQuestionnaireList/C457392552",
					"host": [
						"localhost"
					],
					"port": "8087",
					"path": [
						"appForm",
						"v1",
						"fetchQuestionnaireList",
						"C457392552"
					]
				}
			},
			"response": []
		},
		{
			"name": "localhost:8087/policySubmission/v1/app-form-submission/C453445115",
			"protocolProfileBehavior": {
				"disableBodyPruning": true
			},
			"request": {
				"method": "GET",
				"header": [],
				"body": {
					"mode": "raw",
					"raw": "",
					"options": {
						"raw": {
							"language": "json"
						}
					}
				},
				"url": {
					"raw": "localhost:8087/policySubmission/v1/app-form-submission/C453445115",
					"host": [
						"localhost"
					],
					"port": "8087",
					"path": [
						"policySubmission",
						"v1",
						"app-form-submission",
						"C453445115"
					]
				}
			},
			"response": []
		},
		{
			"name": "http://localhost:8087/appForm/v1/masterTables",
			"request": {
				"method": "GET",
				"header": [],
				"url": {
					"raw": "http://localhost:8087/appForm/v1/masterTables",
					"protocol": "http",
					"host": [
						"localhost"
					],
					"port": "8087",
					"path": [
						"appForm",
						"v1",
						"masterTables"
					]
				}
			},
			"response": []
		},
		{
			"name": "localhost:8087/appForm/v1/fetchDocumentsList/C999091609",
			"request": {
				"method": "POST",
				"header": [
					{
						"key": "Content-Type",
						"value": "application/json",
						"type": "text"
					}
				],
				"body": {
					"mode": "raw",
					"raw": "",
					"options": {
						"raw": {
							"language": "json"
						}
					}
				},
				"url": {
					"raw": "localhost:8087/appForm/v1/fetchDocumentsList/C999091609",
					"host": [
						"localhost"
					],
					"port": "8087",
					"path": [
						"appForm",
						"v1",
						"fetchDocumentsList",
						"C999091609"
					]
				}
			},
			"response": []
		},
		{
			"name": "localhost:8087/appForm/v1/saveHealthAndOtherDetails",
			"request": {
				"method": "POST",
				"header": [
					{
						"key": "Content-Type",
						"value": "application/json",
						"type": "text"
					}
				],
				"body": {
					"mode": "raw",
					"raw": "[{\"policy_No\":\"C457392552\",\r\n\"question_id\":\"61\",\r\n\"option_id\":\"2\",\r\n\"insured_Id\":\"test\"},{\"policy_No\":\"C457392552\",\r\n\"question_id\":\"62\",\r\n\"option_id\":\"1\",\r\n\"insured_Id\":\"test1\"}\r\n]",
					"options": {
						"raw": {
							"language": "json"
						}
					}
				},
				"url": {
					"raw": "localhost:8087/appForm/v1/saveHealthAndOtherDetails",
					"host": [
						"localhost"
					],
					"port": "8087",
					"path": [
						"appForm",
						"v1",
						"saveHealthAndOtherDetails"
					]
				}
			},
			"response": []
		},
		{
			"name": "http://localhost:8087/appForm/v1/financialWaiverCheck/C998694777",
			"request": {
				"method": "POST",
				"header": [
					{
						"key": "Content-Type",
						"value": "application/json",
						"type": "text"
					}
				],
				"body": {
					"mode": "raw",
					"raw": "",
					"options": {
						"raw": {
							"language": "json"
						}
					}
				},
				"url": {
					"raw": "http://localhost:8087/appForm/v1/financialWaiverCheck/C998694777",
					"protocol": "http",
					"host": [
						"localhost"
					],
					"port": "8087",
					"path": [
						"appForm",
						"v1",
						"financialWaiverCheck",
						"C998694777"
					]
				}
			},
			"response": []
		},
		{
			"name": "172.23.25.48:8087/appForm/v1/nmlCheck/C453439752",
			"request": {
				"method": "POST",
				"header": [
					{
						"key": "Content-Type",
						"value": "application/json",
						"type": "text"
					}
				],
				"url": {
					"raw": "172.23.25.48:8087/appForm/v1/nmlCheck/C453439752",
					"host": [
						"172",
						"23",
						"25",
						"48"
					],
					"port": "8087",
					"path": [
						"appForm",
						"v1",
						"nmlCheck",
						"C453439752"
					]
				}
			},
			"response": []
		},
		{
			"name": "localhost:8087/appForm/v1/getAgentInfo/4101911",
			"protocolProfileBehavior": {
				"disableBodyPruning": true
			},
			"request": {
				"method": "GET",
				"header": [
					{
						"key": "Content-Type",
						"value": "application/json",
						"type": "text"
					}
				],
				"body": {
					"mode": "raw",
					"raw": "{\"ACN\":\"OCR\",\"PLN\":\"7215022349858\",\"APPID\":\"GoodConnect\",\r\n\"Requestobject\":[{\"ImageBase64\":\"\",\"transaction_Id\":\"7215022349858\",\r\n\"File_Type\":\".jpeg\",\"document_Id\":\"1018010082\",\"UserName\":\"MaxTrAIBI\",\r\n\"Password\":\"Pass@#01AI0CR\",\"Category\":\"KYC\"\r\n}]}"
				},
				"url": {
					"raw": "localhost:8087/appForm/v1/getAgentInfo/4101911",
					"host": [
						"localhost"
					],
					"port": "8087",
					"path": [
						"appForm",
						"v1",
						"getAgentInfo",
						"4101911"
					]
				}
			},
			"response": []
		},
		{
			"name": "localhost:8087/appform/review/v1/fetchReviewFormPDF/C998694777",
			"request": {
				"method": "GET",
				"header": [],
				"url": {
					"raw": "localhost:8087/appform/review/v1/fetchReviewFormPDF/C998694777",
					"host": [
						"localhost"
					],
					"port": "8087",
					"path": [
						"appform",
						"review",
						"v1",
						"fetchReviewFormPDF",
						"C998694777"
					]
				}
			},
			"response": []
		},
		{
			"name": "http://localhost:8087/policy/document/v1/fetchMasterDetails/C457462084",
			"protocolProfileBehavior": {
				"disableBodyPruning": true
			},
			"request": {
				"method": "GET",
				"header": [
					{
						"key": "Content-Type",
						"value": "application/json",
						"type": "text"
					}
				],
				"body": {
					"mode": "raw",
					"raw": ""
				},
				"url": {
					"raw": "http://localhost:8087/policy/document/v1/fetchMasterDetails/C457462084",
					"protocol": "http",
					"host": [
						"localhost"
					],
					"port": "8087",
					"path": [
						"policy",
						"document",
						"v1",
						"fetchMasterDetails",
						"C457462084"
					]
				}
			},
			"response": []
		},
		{
			"name": "localhost:8087/appForm/v1/saveDeclarationDetails/C457462084",
			"request": {
				"method": "POST",
				"header": [
					{
						"key": "Content-Type",
						"value": "application/json",
						"type": "text"
					}
				],
				"body": {
					"mode": "raw",
					"raw": "{\r\n    \r\n    \"ckyc_number\": null,\r\n        \"kyc_status\": null,\r\n        \"eia_number\" :\"432561890\",\r\n        \"whatsapp_communication\": null\r\n}"
				},
				"url": {
					"raw": "localhost:8087/appForm/v1/saveDeclarationDetails/C457462084",
					"host": [
						"localhost"
					],
					"port": "8087",
					"path": [
						"appForm",
						"v1",
						"saveDeclarationDetails",
						"C457462084"
					]
				}
			},
			"response": [
				{
					"name": "localhost:8087/appForm/v1/saveDeclarationDetails/C457462084",
					"originalRequest": {
						"method": "POST",
						"header": [
							{
								"key": "Content-Type",
								"value": "application/json",
								"type": "text"
							}
						],
						"body": {
							"mode": "raw",
							"raw": "{\r\n    \r\n    \"ckyc_number\": null,\r\n        \"kyc_status\": null,\r\n        \"eia_number\" :\"432561890\",\r\n        \"whatsapp_communication\": null\r\n}"
						},
						"url": {
							"raw": "localhost:8087/appForm/v1/saveDeclarationDetails/C457462084",
							"host": [
								"localhost"
							],
							"port": "8087",
							"path": [
								"appForm",
								"v1",
								"saveDeclarationDetails",
								"C457462084"
							]
						}
					},
					"status": "OK",
					"code": 200,
					"_postman_previewlanguage": "json",
					"header": [
						{
							"key": "Vary",
							"value": "Origin"
						},
						{
							"key": "Vary",
							"value": "Access-Control-Request-Method"
						},
						{
							"key": "Vary",
							"value": "Access-Control-Request-Headers"
						},
						{
							"key": "Content-Type",
							"value": "application/json"
						},
						{
							"key": "Transfer-Encoding",
							"value": "chunked"
						},
						{
							"key": "Date",
							"value": "Thu, 07 Oct 2021 06:05:03 GMT"
						},
						{
							"key": "Keep-Alive",
							"value": "timeout=60"
						},
						{
							"key": "Connection",
							"value": "keep-alive"
						}
					],
					"cookie": [],
					"body": "{\n    \"data\": \"Success\",\n    \"errors\": null\n}"
				}
			]
		}
	]
}