52.508251,4.49875125,0.0
52.508251,4.53346975,0.0
52.508251,4.56818825,2775.3888
52.508251,4.60290675,2775.3888
52.508251,4.63762525,2775.3888
52.508251,4.6723437500000005,0.0
52.508251,4.70706225,0.0
52.508251,4.74178075,0.0
52.48645500000001,4.49875125,0.0
52.48645500000001,4.53346975,0.0
52.48645500000001,4.56818825,2775.3888
52.48645500000001,4.60290675,3172.3059999999996
52.48645500000001,4.63762525,3172.3059999999996
52.48645500000001,4.6723437500000005,3172.3059999999996
52.48645500000001,4.70706225,0.0
52.48645500000001,4.74178075,0.0
52.464659,4.49875125,0.0
52.464659,4.53346975,0.0
52.464659,4.56818825,0.0
52.464659,4.60290675,3172.3059999999996
52.464659,4.63762525,3172.3059999999996
52.464659,4.6723437500000005,3172.3059999999996
52.464659,4.70706225,0.0
52.464659,4.74178075,0.0
52.442863,4.49875125,0.0
52.442863,4.53346975,0.0
52.442863,4.56818825,0.0
52.442863,4.60290675,3172.3059999999996
52.442863,4.63762525,3172.3059999999996
52.442863,4.6723437500000005,2963.5236
52.442863,4.70706225,3024.3887
52.442863,4.74178075,3024.3887
52.421067,4.49875125,2918.6205999999997
52.421067,4.53346975,2918.6205999999997
52.421067,4.56818825,2918.6205999999997
52.421067,4.60290675,2963.5236
52.421067,4.63762525,2963.5236
52.421067,4.6723437500000005,2963.5236
52.421067,4.70706225,2963.5236
52.421067,4.74178075,3024.3887
52.399271,4.49875125,0.0
52.399271,4.53346975,2918.6205999999997
52.399271,4.56818825,2918.6205999999997
52.399271,4.60290675,2918.6205999999997
52.399271,4.63762525,2963.5236
52.399271,4.6723437500000005,2963.5236
52.399271,4.70706225,2919.753
52.399271,4.74178075,0.0
