latitude,longitude,value
52.49892840473542,4.550142288208009,0.03481418
52.49892840473542,4.614171981811523,0.030685792000000003
52.49892840473542,4.67820167541504,0.03175871
52.49892840473542,4.7422313690185565,0.03175871
52.45880953866191,4.550142288208009,0.030685792000000003
52.45880953866191,4.614171981811523,0.030685792000000003
52.45880953866191,4.67820167541504,0.031285834
52.45880953866191,4.7422313690185565,0.031285834
52.4186906725884,4.550142288208009,0.031797484
52.4186906725884,4.614171981811523,0.03189038
52.4186906725884,4.67820167541504,0.03189038
52.4186906725884,4.7422313690185565,0.03270025
