latitude,longitude,value
52.49892840473542,4.550142288208009,0.028167183
52.49892840473542,4.614171981811523,0.028167183
52.49892840473542,4.67820167541504,0.032476902
52.49892840473542,4.7422313690185565,0.032476902
52.45880953866191,4.550142288208009,0.028616041000000002
52.45880953866191,4.614171981811523,0.028616041000000002
52.45880953866191,4.67820167541504,0.031425714
52.45880953866191,4.7422313690185565,0.031425714
52.4186906725884,4.550142288208009,0.03149755
52.4186906725884,4.614171981811523,0.03149755
52.4186906725884,4.67820167541504,0.03232714
52.4186906725884,4.7422313690185565,0.03232714
