52.508251,4.49875125,0.0
52.508251,4.53346975,0.0
52.508251,4.56818825,3023.0844
52.508251,4.60290675,3023.0844
52.508251,4.63762525,3023.0844
52.508251,4.6723437500000005,3006.4462
52.508251,4.70706225,2994.8162
52.508251,4.74178075,2994.8162
52.48645500000001,4.49875125,0.0
52.48645500000001,4.53346975,0.0
52.48645500000001,4.56818825,3223.7614999999996
52.48645500000001,4.60290675,3223.7614999999996
52.48645500000001,4.63762525,3223.7614999999996
52.48645500000001,4.6723437500000005,3223.7614999999996
52.48645500000001,4.70706225,2994.8162
52.48645500000001,4.74178075,2994.8162
52.464659,4.49875125,0.0
52.464659,4.53346975,0.0
52.464659,4.56818825,0.0
52.464659,4.60290675,3223.7614999999996
52.464659,4.63762525,3223.7614999999996
52.464659,4.6723437500000005,3223.7614999999996
52.464659,4.70706225,2994.8162
52.464659,4.74178075,2994.8162
52.442863,4.49875125,0.0
52.442863,4.53346975,0.0
52.442863,4.56818825,0.0
52.442863,4.60290675,3294.727
52.442863,4.63762525,3294.727
52.442863,4.6723437500000005,3294.727
52.442863,4.70706225,3118.9937
52.442863,4.74178075,3118.9937
52.421067,4.49875125,2998.4692
52.421067,4.53346975,2998.4692
52.421067,4.56818825,2998.4692
52.421067,4.60290675,3294.727
52.421067,4.63762525,3294.727
52.421067,4.6723437500000005,3294.727
52.421067,4.70706225,3118.9937
52.421067,4.74178075,3118.9937
52.399271,4.49875125,0.0
52.399271,4.53346975,2998.4692
52.399271,4.56818825,2998.4692
52.399271,4.60290675,3294.727
52.399271,4.63762525,3294.727
52.399271,4.6723437500000005,3082.1096
52.399271,4.70706225,3082.1096
52.399271,4.74178075,0.0
