52.508251,4.49875125,0.0
52.508251,4.53346975,3682.8566
52.508251,4.56818825,3682.8566
52.508251,4.60290675,3682.8566
52.508251,4.63762525,3141.2397
52.508251,4.6723437500000005,3141.2397
52.508251,4.70706225,3141.2397
52.508251,4.74178075,3504.7475
52.48645500000001,4.49875125,3283.358
52.48645500000001,4.53346975,3682.8566
52.48645500000001,4.56818825,3682.8566
52.48645500000001,4.60290675,3682.8566
52.48645500000001,4.63762525,3682.8566
52.48645500000001,4.6723437500000005,3504.7475
52.48645500000001,4.70706225,3504.7475
52.48645500000001,4.74178075,3504.7475
52.464659,4.49875125,3283.358
52.464659,4.53346975,3283.358
52.464659,4.56818825,3780.1865
52.464659,4.60290675,3780.1865
52.464659,4.63762525,3780.1865
52.464659,4.6723437500000005,3504.7475
52.464659,4.70706225,3504.7475
52.464659,4.74178075,3504.7475
52.442863,4.49875125,3201.2206
52.442863,4.53346975,3201.2206
52.442863,4.56818825,3780.1865
52.442863,4.60290675,3780.1865
52.442863,4.63762525,3780.1865
52.442863,4.6723437500000005,3504.7475
52.442863,4.70706225,3510.5012000000006
52.442863,4.74178075,3510.5012000000006
52.421067,4.49875125,3201.2206
52.421067,4.53346975,3201.2206
52.421067,4.56818825,3780.1865
52.421067,4.60290675,3780.1865
52.421067,4.63762525,3659.1277
52.421067,4.6723437500000005,3659.1277
52.421067,4.70706225,3510.5012000000006
52.421067,4.74178075,3510.5012000000006
52.399271,4.49875125,0.0
52.399271,4.53346975,3541.6428
52.399271,4.56818825,3541.6428
52.399271,4.60290675,3659.1277
52.399271,4.63762525,3659.1277
52.399271,4.6723437500000005,3659.1277
52.399271,4.70706225,3510.5012000000006
52.399271,4.74178075,0.0
