date,latitude,longitude,value
2020-06-01,52.421067,4.49875125,0.0
2020-06-02,52.421067,4.49875125,0.0
2020-06-03,52.421067,4.49875125,0.0
2020-06-04,52.421067,4.49875125,0.0
2020-06-05,52.421067,4.49875125,0.0
2020-06-06,52.421067,4.49875125,0.030366208
2020-06-07,52.421067,4.49875125,0.0
2020-06-08,52.421067,4.49875125,0.031876028
2020-06-09,52.421067,4.49875125,0.031351954
2020-06-10,52.421067,4.49875125,0.0
2020-06-11,52.421067,4.49875125,0.0
2020-06-12,52.421067,4.49875125,0.031562213
2020-06-13,52.421067,4.49875125,0.029984692
2020-06-14,52.421067,4.49875125,0.0
2020-06-15,52.421067,4.49875125,0.0
2020-06-16,52.421067,4.49875125,0.0
2020-06-17,52.421067,4.49875125,0.030633062000000006
2020-06-18,52.421067,4.49875125,0.030873356
2020-06-19,52.421067,4.49875125,0.0
2020-06-20,52.421067,4.49875125,0.02588413
2020-06-21,52.421067,4.49875125,0.0
2020-06-22,52.421067,4.49875125,0.03149755
2020-06-23,52.421067,4.49875125,0.0
2020-06-24,52.421067,4.49875125,0.029186206
2020-06-25,52.421067,4.49875125,0.030524855
2020-06-26,52.421067,4.49875125,0.0
2020-06-27,52.421067,4.49875125,0.026208688
2020-06-28,52.421067,4.49875125,0.024269098
2020-06-29,52.421067,4.49875125,0.0
2020-06-30,52.421067,4.49875125,0.0
2020-07-01,52.421067,4.49875125,0.03029552
2020-07-02,52.421067,4.49875125,0.022644695
2020-07-03,52.421067,4.49875125,0.02932329
2020-07-04,52.421067,4.49875125,0.028614005
2020-07-05,52.421067,4.49875125,0.026628386
2020-07-06,52.421067,4.49875125,0.0
2020-07-07,52.421067,4.49875125,0.0
2020-07-08,52.421067,4.49875125,0.0
2020-07-09,52.421067,4.49875125,0.025114343
2020-07-10,52.421067,4.49875125,0.02445549
2020-07-11,52.421067,4.49875125,0.027539752
2020-07-12,52.421067,4.49875125,0.0
2020-07-13,52.421067,4.49875125,0.0
2020-07-14,52.421067,4.49875125,0.0
2020-07-15,52.421067,4.49875125,0.0
2020-07-16,52.421067,4.49875125,0.033310506000000004
2020-07-17,52.421067,4.49875125,0.030405112
2020-07-18,52.421067,4.49875125,0.027216855
2020-07-19,52.421067,4.49875125,0.0
2020-07-20,52.421067,4.49875125,0.0
2020-07-21,52.421067,4.49875125,0.028013559
2020-07-22,52.421067,4.49875125,0.0
2020-07-23,52.421067,4.49875125,0.0
2020-07-24,52.421067,4.49875125,0.031827975
2020-07-25,52.421067,4.49875125,0.0
2020-07-26,52.421067,4.49875125,0.025589606
2020-07-27,52.421067,4.49875125,0.0
2020-07-28,52.421067,4.49875125,0.023602225
2020-07-29,52.421067,4.49875125,0.035306957
2020-07-30,52.421067,4.49875125,0.0
2020-07-31,52.421067,4.49875125,0.025411487000000003
2020-08-02,52.421067,4.49875125,0.03695634
2020-08-03,52.421067,4.49875125,0.0317654
2020-08-04,52.421067,4.49875125,0.0
2020-08-05,52.421067,4.49875125,0.024199286
2020-08-06,52.421067,4.49875125,0.030940767
2020-08-07,52.421067,4.49875125,0.0
2020-08-08,52.421067,4.49875125,0.0
2020-08-09,52.421067,4.49875125,0.0
2020-08-10,52.421067,4.49875125,0.0
2020-08-11,52.421067,4.49875125,0.0
2020-08-12,52.421067,4.49875125,0.0
2020-08-13,52.421067,4.49875125,0.0
2020-08-14,52.421067,4.49875125,0.0
2020-08-15,52.421067,4.49875125,0.030284438
2020-08-16,52.421067,4.49875125,0.025797848
2020-08-17,52.421067,4.49875125,0.028322414
2020-08-18,52.421067,4.49875125,0.026681207
2020-08-19,52.421067,4.49875125,0.0
2020-08-20,52.421067,4.49875125,0.0
2020-08-21,52.421067,4.49875125,0.0
2020-08-22,52.421067,4.49875125,0.028989814
2020-08-23,52.421067,4.49875125,0.028836174
2020-08-24,52.421067,4.49875125,0.02801198
2020-08-25,52.421067,4.49875125,0.03070344
2020-08-26,52.421067,4.49875125,0.0
2020-08-27,52.421067,4.49875125,0.0
2020-08-28,52.421067,4.49875125,0.0
2020-08-29,52.421067,4.49875125,0.029210947
2020-08-30,52.421067,4.49875125,0.0
2020-08-31,52.421067,4.49875125,0.03162768
2020-09-01,52.421067,4.49875125,0.03129939
2020-09-02,52.421067,4.49875125,0.03573906
2020-09-03,52.421067,4.49875125,0.028108396
2020-09-04,52.421067,4.49875125,0.03239886
2020-09-05,52.421067,4.49875125,0.0
2020-09-06,52.421067,4.49875125,0.0
2020-09-07,52.421067,4.49875125,0.0
2020-09-08,52.421067,4.49875125,0.033234645
2020-09-09,52.421067,4.49875125,0.026902061
2020-09-10,52.421067,4.49875125,0.0
2020-09-11,52.421067,4.49875125,0.04666166
2020-09-12,52.421067,4.49875125,0.0
2020-09-13,52.421067,4.49875125,0.0
2020-09-15,52.421067,4.49875125,0.038728725
2020-09-16,52.421067,4.49875125,0.03278623
2020-09-17,52.421067,4.49875125,0.0
2020-09-18,52.421067,4.49875125,0.03507666
2020-09-19,52.421067,4.49875125,0.0
2020-09-20,52.421067,4.49875125,0.03362348
2020-09-21,52.421067,4.49875125,0.027911885
2020-09-22,52.421067,4.49875125,0.0
2020-09-23,52.421067,4.49875125,0.029495144
2020-09-24,52.421067,4.49875125,0.05070454
2020-09-25,52.421067,4.49875125,0.0
2020-09-26,52.421067,4.49875125,0.0
2020-09-27,52.421067,4.49875125,0.03509907
2020-09-28,52.421067,4.49875125,0.0
2020-09-29,52.421067,4.49875125,0.032012206
2020-09-30,52.421067,4.49875125,0.0
2020-10-01,52.421067,4.49875125,0.0
2020-10-02,52.421067,4.49875125,0.0
2020-10-03,52.421067,4.49875125,0.0
2020-10-04,52.421067,4.49875125,0.031644937000000005
2020-10-05,52.421067,4.49875125,0.03205923
2020-10-06,52.421067,4.49875125,0.03388498
2020-10-07,52.421067,4.49875125,0.032648254
2020-10-08,52.421067,4.49875125,0.030269865
