date,latitude,longitude,value
2020-06-01,52.508251,4.74178075,0.0
2020-06-02,52.508251,4.74178075,0.032049
2020-06-03,52.508251,4.74178075,0.0
2020-06-04,52.508251,4.74178075,0.026681837000000003
2020-06-05,52.508251,4.74178075,0.0
2020-06-06,52.508251,4.74178075,0.0
2020-06-07,52.508251,4.74178075,0.0
2020-06-08,52.508251,4.74178075,0.033557914
2020-06-09,52.508251,4.74178075,0.028345944
2020-06-10,52.508251,4.74178075,0.0
2020-06-11,52.508251,4.74178075,0.030429486
2020-06-12,52.508251,4.74178075,0.0331001
2020-06-13,52.508251,4.74178075,0.029948162
2020-06-14,52.508251,4.74178075,0.0
2020-06-15,52.508251,4.74178075,0.0
2020-06-16,52.508251,4.74178075,0.0
2020-06-17,52.508251,4.74178075,0.03151536
2020-06-18,52.508251,4.74178075,0.025419688
2020-06-19,52.508251,4.74178075,0.029065019
2020-06-20,52.508251,4.74178075,0.02696147
2020-06-21,52.508251,4.74178075,0.0
2020-06-22,52.508251,4.74178075,0.032476902
2020-06-23,52.508251,4.74178075,0.031285528
2020-06-24,52.508251,4.74178075,0.0
2020-06-25,52.508251,4.74178075,0.02757314
2020-06-26,52.508251,4.74178075,0.0
2020-06-27,52.508251,4.74178075,0.031146334
2020-06-28,52.508251,4.74178075,0.028286228
2020-06-29,52.508251,4.74178075,0.0
2020-06-30,52.508251,4.74178075,0.0
2020-07-01,52.508251,4.74178075,0.029202892
2020-07-02,52.508251,4.74178075,0.025928348
2020-07-03,52.508251,4.74178075,0.02922301
2020-07-04,52.508251,4.74178075,0.0
2020-07-05,52.508251,4.74178075,0.028941294
2020-07-06,52.508251,4.74178075,0.0
2020-07-07,52.508251,4.74178075,0.0
2020-07-08,52.508251,4.74178075,0.028303154
2020-07-09,52.508251,4.74178075,0.028840566
2020-07-10,52.508251,4.74178075,0.025972515
2020-07-11,52.508251,4.74178075,0.026311196
2020-07-12,52.508251,4.74178075,0.031994846
2020-07-13,52.508251,4.74178075,0.03282359
2020-07-14,52.508251,4.74178075,0.0
2020-07-15,52.508251,4.74178075,0.030854804
2020-07-16,52.508251,4.74178075,0.030782651
2020-07-17,52.508251,4.74178075,0.028173767
2020-07-18,52.508251,4.74178075,0.0
2020-07-19,52.508251,4.74178075,0.0
2020-07-20,52.508251,4.74178075,0.026233992
2020-07-21,52.508251,4.74178075,0.028203351
2020-07-22,52.508251,4.74178075,0.0
2020-07-23,52.508251,4.74178075,0.0
2020-07-24,52.508251,4.74178075,0.0
2020-07-25,52.508251,4.74178075,0.0
2020-07-26,52.508251,4.74178075,0.03049781
2020-07-27,52.508251,4.74178075,0.0
2020-07-28,52.508251,4.74178075,0.029541641
2020-07-29,52.508251,4.74178075,0.030026315
2020-07-30,52.508251,4.74178075,0.030443482
2020-07-31,52.508251,4.74178075,0.03134391
2020-08-02,52.508251,4.74178075,0.0
2020-08-03,52.508251,4.74178075,0.0
2020-08-04,52.508251,4.74178075,0.03017184
2020-08-05,52.508251,4.74178075,0.02509981
2020-08-06,52.508251,4.74178075,0.02991398
2020-08-07,52.508251,4.74178075,0.026163436
2020-08-08,52.508251,4.74178075,0.0
2020-08-09,52.508251,4.74178075,0.032410762999999995
2020-08-10,52.508251,4.74178075,0.031192083
2020-08-11,52.508251,4.74178075,0.031946175
2020-08-12,52.508251,4.74178075,0.026851278
2020-08-13,52.508251,4.74178075,0.0
2020-08-14,52.508251,4.74178075,0.0
2020-08-15,52.508251,4.74178075,0.033673435
2020-08-16,52.508251,4.74178075,0.033502374
2020-08-17,52.508251,4.74178075,0.0
2020-08-18,52.508251,4.74178075,0.03217579
2020-08-19,52.508251,4.74178075,0.029538713
2020-08-20,52.508251,4.74178075,0.0
2020-08-21,52.508251,4.74178075,0.030222587
2020-08-22,52.508251,4.74178075,0.029289803
2020-08-23,52.508251,4.74178075,0.030033363
2020-08-24,52.508251,4.74178075,0.026925886
2020-08-25,52.508251,4.74178075,0.028759463
2020-08-26,52.508251,4.74178075,0.029510714
2020-08-27,52.508251,4.74178075,0.029489784
2020-08-28,52.508251,4.74178075,0.0
2020-08-29,52.508251,4.74178075,0.029793877000000007
2020-08-30,52.508251,4.74178075,0.0
2020-08-31,52.508251,4.74178075,0.0
2020-09-01,52.508251,4.74178075,0.031109134
2020-09-02,52.508251,4.74178075,0.031253155
2020-09-03,52.508251,4.74178075,0.0
2020-09-04,52.508251,4.74178075,0.030081999
2020-09-05,52.508251,4.74178075,0.0
2020-09-06,52.508251,4.74178075,0.03406208
2020-09-07,52.508251,4.74178075,0.03214582
2020-09-08,52.508251,4.74178075,0.028970238
2020-09-09,52.508251,4.74178075,0.027266998
2020-09-10,52.508251,4.74178075,0.035818199999999994
2020-09-11,52.508251,4.74178075,0.04607521
2020-09-12,52.508251,4.74178075,0.03400997
2020-09-13,52.508251,4.74178075,0.03175871
2020-09-15,52.508251,4.74178075,0.037424635
2020-09-16,52.508251,4.74178075,0.0
2020-09-17,52.508251,4.74178075,0.0
2020-09-18,52.508251,4.74178075,0.033581786
2020-09-19,52.508251,4.74178075,0.0
2020-09-20,52.508251,4.74178075,0.03135767
2020-09-21,52.508251,4.74178075,0.031907238
2020-09-22,52.508251,4.74178075,0.033413064
2020-09-23,52.508251,4.74178075,0.032016635
2020-09-24,52.508251,4.74178075,0.0
2020-09-25,52.508251,4.74178075,0.0
2020-09-26,52.508251,4.74178075,0.0
2020-09-27,52.508251,4.74178075,0.0
2020-09-28,52.508251,4.74178075,0.0
2020-09-29,52.508251,4.74178075,0.035047475
2020-09-30,52.508251,4.74178075,0.0
2020-10-01,52.508251,4.74178075,0.0
2020-10-02,52.508251,4.74178075,0.0
2020-10-03,52.508251,4.74178075,0.0
2020-10-04,52.508251,4.74178075,0.03272996
2020-10-05,52.508251,4.74178075,0.0
2020-10-06,52.508251,4.74178075,0.033145156
2020-10-07,52.508251,4.74178075,0.031370226
2020-10-08,52.508251,4.74178075,0.032804105
