latitude,longitude,value
52.49892840473542,4.550142288208009,0.0
52.49892840473542,4.614171981811523,0.026933257000000002
52.49892840473542,4.67820167541504,0.026933257000000002
52.49892840473542,4.7422313690185565,0.025419688
52.45880953866191,4.550142288208009,0.032526605
52.45880953866191,4.614171981811523,0.027380007999999997
52.45880953866191,4.67820167541504,0.027380007999999997
52.45880953866191,4.7422313690185565,0.023994092
52.4186906725884,4.550142288208009,0.030873356
52.4186906725884,4.614171981811523,0.027816696000000002
52.4186906725884,4.67820167541504,0.027816696000000002
52.4186906725884,4.7422313690185565,0.02561089
