52.508251,4.49875125,2466.9573
52.508251,4.53346975,2978.1675
52.508251,4.56818825,2978.1675
52.508251,4.60290675,2978.1675
52.508251,4.63762525,2978.1675
52.508251,4.6723437500000005,3049.781
52.508251,4.70706225,3049.781
52.508251,4.74178075,3049.781
52.48645500000001,4.49875125,2671.5279
52.48645500000001,4.53346975,2671.5279
52.48645500000001,4.56818825,3032.3563
52.48645500000001,4.60290675,3032.3563
52.48645500000001,4.63762525,3032.3563
52.48645500000001,4.6723437500000005,3049.781
52.48645500000001,4.70706225,3049.781
52.48645500000001,4.74178075,3049.781
52.464659,4.49875125,2671.5279
52.464659,4.53346975,2671.5279
52.464659,4.56818825,3032.3563
52.464659,4.60290675,3032.3563
52.464659,4.63762525,3032.3563
52.464659,4.6723437500000005,3049.781
52.464659,4.70706225,3077.4666000000007
52.464659,4.74178075,3077.4666000000007
52.442863,4.49875125,2671.5279
52.442863,4.53346975,2671.5279
52.442863,4.56818825,3097.8726
52.442863,4.60290675,3097.8726
52.442863,4.63762525,3097.8726
52.442863,4.6723437500000005,3077.4666000000007
52.442863,4.70706225,3077.4666000000007
52.442863,4.74178075,3077.4666000000007
52.421067,4.49875125,2558.9606
52.421067,4.53346975,2558.9606
52.421067,4.56818825,3097.8726
52.421067,4.60290675,3097.8726
52.421067,4.63762525,3097.8726
52.421067,4.6723437500000005,3097.8726
52.421067,4.70706225,3077.4666000000007
52.421067,4.74178075,3077.4666000000007
52.399271,4.49875125,0.0
52.399271,4.53346975,2558.9606
52.399271,4.56818825,2558.9606
52.399271,4.60290675,3097.8726
52.399271,4.63762525,3029.714700000001
52.399271,4.6723437500000005,3029.714700000001
52.399271,4.70706225,0.0
52.399271,4.74178075,0.0
