latitude,longitude,value
52.508251,4.49875125,0.028350255
52.508251,4.53346975,0.028350255
52.508251,4.56818825,0.028350255
52.508251,4.60290675,0.0325103
52.508251,4.63762525,0.0325103
52.508251,4.6723437500000005,0.0325103
52.508251,4.70706225,0.032090682999999995
52.508251,4.74178075,0.033502374
52.48645500000001,4.49875125,0.028350255
52.48645500000001,4.53346975,0.030988012000000002
52.48645500000001,4.56818825,0.030988012000000002
52.48645500000001,4.60290675,0.030988012000000002
52.48645500000001,4.63762525,0.032090682999999995
52.48645500000001,4.6723437500000005,0.032090682999999995
52.48645500000001,4.70706225,0.032090682999999995
52.48645500000001,4.74178075,0.033502374
52.464659,4.49875125,0.0
52.464659,4.53346975,0.030988012000000002
52.464659,4.56818825,0.030988012000000002
52.464659,4.60290675,0.030988012000000002
52.464659,4.63762525,0.032090682999999995
52.464659,4.6723437500000005,0.032090682999999995
52.464659,4.70706225,0.032090682999999995
52.464659,4.74178075,0.033235006
52.442863,4.49875125,0.0
52.442863,4.53346975,0.030988012000000002
52.442863,4.56818825,0.028913462999999997
52.442863,4.60290675,0.028913462999999997
52.442863,4.63762525,0.02923092
52.442863,4.6723437500000005,0.02923092
52.442863,4.70706225,0.02923092
52.442863,4.74178075,0.02923092
52.421067,4.49875125,0.025797847999999998
52.421067,4.53346975,0.028913462999999997
52.421067,4.56818825,0.028913462999999997
52.421067,4.60290675,0.028913462999999997
52.421067,4.63762525,0.028913462999999997
52.421067,4.6723437500000005,0.02923092
52.421067,4.70706225,0.02923092
52.421067,4.74178075,0.02923092
52.399271,4.49875125,0.0
52.399271,4.53346975,0.028913462999999997
52.399271,4.56818825,0.028913462999999997
52.399271,4.60290675,0.028913462999999997
52.399271,4.63762525,0.030471072999999998
52.399271,4.6723437500000005,0.03361305
52.399271,4.70706225,0.03361305
52.399271,4.74178075,0.0
