date,latitude,longitude,value
2020-06-01,52.442863,4.70706225,0.0
2020-06-02,52.442863,4.70706225,0.03318668
2020-06-03,52.442863,4.70706225,0.0
2020-06-04,52.442863,4.70706225,0.02561854
2020-06-05,52.442863,4.70706225,0.0
2020-06-06,52.442863,4.70706225,0.026721647
2020-06-07,52.442863,4.70706225,0.0
2020-06-08,52.442863,4.70706225,0.0
2020-06-09,52.442863,4.70706225,0.0
2020-06-10,52.442863,4.70706225,0.0
2020-06-11,52.442863,4.70706225,0.0
2020-06-12,52.442863,4.70706225,0.029409353
2020-06-13,52.442863,4.70706225,0.031189937
2020-06-14,52.442863,4.70706225,0.0
2020-06-15,52.442863,4.70706225,0.0
2020-06-16,52.442863,4.70706225,0.0
2020-06-17,52.442863,4.70706225,0.03134407
2020-06-18,52.442863,4.70706225,0.027816696
2020-06-19,52.442863,4.70706225,0.03100736
2020-06-20,52.442863,4.70706225,0.024754876
2020-06-21,52.442863,4.70706225,0.0
2020-06-22,52.442863,4.70706225,0.03232714
2020-06-23,52.442863,4.70706225,0.031455528
2020-06-24,52.442863,4.70706225,0.030243887
2020-06-25,52.442863,4.70706225,0.029612036
2020-06-26,52.442863,4.70706225,0.0
2020-06-27,52.442863,4.70706225,0.028204566
2020-06-28,52.442863,4.70706225,0.027499039
2020-06-29,52.442863,4.70706225,0.0
2020-06-30,52.442863,4.70706225,0.028100494
2020-07-01,52.442863,4.70706225,0.029468426
2020-07-02,52.442863,4.70706225,0.026139569
2020-07-03,52.442863,4.70706225,0.026587563
2020-07-04,52.442863,4.70706225,0.0
2020-07-05,52.442863,4.70706225,0.029271537
2020-07-06,52.442863,4.70706225,0.0
2020-07-07,52.442863,4.70706225,0.027058948
2020-07-08,52.442863,4.70706225,0.0
2020-07-09,52.442863,4.70706225,0.0
2020-07-10,52.442863,4.70706225,0.027199475
2020-07-11,52.442863,4.70706225,0.026424639
2020-07-12,52.442863,4.70706225,0.030854592
2020-07-13,52.442863,4.70706225,0.031758003
2020-07-14,52.442863,4.70706225,0.02956546
2020-07-15,52.442863,4.70706225,0.031632967000000005
2020-07-16,52.442863,4.70706225,0.030119114
2020-07-17,52.442863,4.70706225,0.030435007000000007
2020-07-18,52.442863,4.70706225,0.0
2020-07-19,52.442863,4.70706225,0.0
2020-07-20,52.442863,4.70706225,0.02491781
2020-07-21,52.442863,4.70706225,0.030027844
2020-07-22,52.442863,4.70706225,0.0
2020-07-23,52.442863,4.70706225,0.0
2020-07-24,52.442863,4.70706225,0.02613773
2020-07-25,52.442863,4.70706225,0.0
2020-07-26,52.442863,4.70706225,0.030774666000000006
2020-07-27,52.442863,4.70706225,0.0
2020-07-28,52.442863,4.70706225,0.02792981
2020-07-29,52.442863,4.70706225,0.032046452
2020-07-30,52.442863,4.70706225,0.030025162
2020-07-31,52.442863,4.70706225,0.030775767
2020-08-02,52.442863,4.70706225,0.03695634
2020-08-03,52.442863,4.70706225,0.0
2020-08-04,52.442863,4.70706225,0.031500667
2020-08-05,52.442863,4.70706225,0.026598902
2020-08-06,52.442863,4.70706225,0.031096505
2020-08-07,52.442863,4.70706225,0.02377165
2020-08-08,52.442863,4.70706225,0.0
2020-08-09,52.442863,4.70706225,0.033062395
2020-08-10,52.442863,4.70706225,0.03349605
2020-08-11,52.442863,4.70706225,0.03570881
2020-08-12,52.442863,4.70706225,0.034543466
2020-08-13,52.442863,4.70706225,0.0
2020-08-14,52.442863,4.70706225,0.033285294
2020-08-15,52.442863,4.70706225,0.031801384
2020-08-16,52.442863,4.70706225,0.02923092
2020-08-17,52.442863,4.70706225,0.0
2020-08-18,52.442863,4.70706225,0.0
2020-08-19,52.442863,4.70706225,0.0
2020-08-20,52.442863,4.70706225,0.0
2020-08-21,52.442863,4.70706225,0.029618837
2020-08-22,52.442863,4.70706225,0.029640475
2020-08-23,52.442863,4.70706225,0.028841572000000006
2020-08-24,52.442863,4.70706225,0.027326051
2020-08-25,52.442863,4.70706225,0.027329361
2020-08-26,52.442863,4.70706225,0.031474143
2020-08-27,52.442863,4.70706225,0.0
2020-08-28,52.442863,4.70706225,0.0
2020-08-29,52.442863,4.70706225,0.028311249
2020-08-30,52.442863,4.70706225,0.0
2020-08-31,52.442863,4.70706225,0.0
2020-09-01,52.442863,4.70706225,0.031827234
2020-09-02,52.442863,4.70706225,0.029535282000000006
2020-09-03,52.442863,4.70706225,0.030155612
2020-09-04,52.442863,4.70706225,0.028890343
2020-09-05,52.442863,4.70706225,0.0
2020-09-06,52.442863,4.70706225,0.03262373
2020-09-07,52.442863,4.70706225,0.0315369
2020-09-08,52.442863,4.70706225,0.029410109
2020-09-09,52.442863,4.70706225,0.02680844
2020-09-10,52.442863,4.70706225,0.0
2020-09-11,52.442863,4.70706225,0.04670117
2020-09-12,52.442863,4.70706225,0.032355946000000003
2020-09-13,52.442863,4.70706225,0.031285834
2020-09-15,52.442863,4.70706225,0.038012773
2020-09-16,52.442863,4.70706225,0.0
2020-09-17,52.442863,4.70706225,0.0
2020-09-18,52.442863,4.70706225,0.033599444
2020-09-19,52.442863,4.70706225,0.0
2020-09-20,52.442863,4.70706225,0.03362348
2020-09-21,52.442863,4.70706225,0.03332672
2020-09-22,52.442863,4.70706225,0.032125033
2020-09-23,52.442863,4.70706225,0.031446382
2020-09-24,52.442863,4.70706225,0.047243614
2020-09-25,52.442863,4.70706225,0.0
2020-09-26,52.442863,4.70706225,0.0
2020-09-27,52.442863,4.70706225,0.0
2020-09-28,52.442863,4.70706225,0.0
2020-09-29,52.442863,4.70706225,0.035105012000000005
2020-09-30,52.442863,4.70706225,0.0
2020-10-01,52.442863,4.70706225,0.0
2020-10-02,52.442863,4.70706225,0.0
2020-10-03,52.442863,4.70706225,0.0
2020-10-04,52.442863,4.70706225,0.030881468
2020-10-05,52.442863,4.70706225,0.0
2020-10-06,52.442863,4.70706225,0.03520709
2020-10-07,52.442863,4.70706225,0.03236502
2020-10-08,52.442863,4.70706225,0.0
