latitude,longitude,value
52.508251,4.49875125,0.0
52.508251,4.53346975,0.03630007
52.508251,4.56818825,0.03630007
52.508251,4.60290675,0.03630007
52.508251,4.63762525,0.03630007
52.508251,4.6723437500000005,0.0
52.508251,4.70706225,0.0
52.508251,4.74178075,0.0
52.48645500000001,4.49875125,0.03478262
52.48645500000001,4.53346975,0.03646863
52.48645500000001,4.56818825,0.03646863
52.48645500000001,4.60290675,0.03646863
52.48645500000001,4.63762525,0.03646863
52.48645500000001,4.6723437500000005,0.037092827
52.48645500000001,4.70706225,0.037092827
52.48645500000001,4.74178075,0.037092827
52.464659,4.49875125,0.03478262
52.464659,4.53346975,0.03646863
52.464659,4.56818825,0.03646863
52.464659,4.60290675,0.03646863
52.464659,4.63762525,0.03646863
52.464659,4.6723437500000005,0.03646863
52.464659,4.70706225,0.037092827
52.464659,4.74178075,0.037092827
52.442863,4.49875125,0.03478262
52.442863,4.53346975,0.03478262
52.442863,4.56818825,0.03646863
52.442863,4.60290675,0.035847377
52.442863,4.63762525,0.035847377
52.442863,4.6723437500000005,0.035847377
52.442863,4.70706225,0.0
52.442863,4.74178075,0.0
52.421067,4.49875125,0.03509907
52.421067,4.53346975,0.03509907
52.421067,4.56818825,0.035847377
52.421067,4.60290675,0.035847377
52.421067,4.63762525,0.035847377
52.421067,4.6723437500000005,0.035847377
52.421067,4.70706225,0.0
52.421067,4.74178075,0.0
52.399271,4.49875125,0.0
52.399271,4.53346975,0.03509907
52.399271,4.56818825,0.035847377
52.399271,4.60290675,0.035847377
52.399271,4.63762525,0.035847377
52.399271,4.6723437500000005,0.0
52.399271,4.70706225,0.0
52.399271,4.74178075,0.0
