latitude,longitude,value
52.49892840473542,4.550142288208009,0.024945036
52.49892840473542,4.614171981811523,0.0
52.49892840473542,4.67820167541504,0.0
52.49892840473542,4.7422313690185565,0.026132086000000002
52.45880953866191,4.550142288208009,0.028911673
52.45880953866191,4.614171981811523,0.028911673
52.45880953866191,4.67820167541504,0.0
52.45880953866191,4.7422313690185565,0.026132086000000002
52.4186906725884,4.550142288208009,0.027017423999999998
52.4186906725884,4.614171981811523,0.027017423999999998
52.4186906725884,4.67820167541504,0.027199475
52.4186906725884,4.7422313690185565,0.027199475
