latitude,longitude,value
52.508251,4.49875125,0.0
52.508251,4.53346975,0.028049905
52.508251,4.56818825,0.028049905
52.508251,4.60290675,0.028049905
52.508251,4.63762525,0.028049905
52.508251,4.6723437500000005,0.026233992
52.508251,4.70706225,0.026233992
52.508251,4.74178075,0.026233992
52.48645500000001,4.49875125,0.0
52.48645500000001,4.53346975,0.0
52.48645500000001,4.56818825,0.028049905
52.48645500000001,4.60290675,0.028049905
52.48645500000001,4.63762525,0.028049905
52.48645500000001,4.6723437500000005,0.026233992
52.48645500000001,4.70706225,0.026233992
52.48645500000001,4.74178075,0.026233992
52.464659,4.49875125,0.0
52.464659,4.53346975,0.0
52.464659,4.56818825,0.028049905
52.464659,4.60290675,0.03175038
52.464659,4.63762525,0.03175038
52.464659,4.6723437500000005,0.02491781
52.464659,4.70706225,0.02491781
52.464659,4.74178075,0.02491781
52.442863,4.49875125,0.0
52.442863,4.53346975,0.0
52.442863,4.56818825,0.03175038
52.442863,4.60290675,0.03175038
52.442863,4.63762525,0.03175038
52.442863,4.6723437500000005,0.03175038
52.442863,4.70706225,0.02491781
52.442863,4.74178075,0.02491781
52.421067,4.49875125,0.0
52.421067,4.53346975,0.0
52.421067,4.56818825,0.03175038
52.421067,4.60290675,0.03175038
52.421067,4.63762525,0.03175038
52.421067,4.6723437500000005,0.030654467999999997
52.421067,4.70706225,0.025365627999999998
52.421067,4.74178075,0.025365627999999998
52.399271,4.49875125,0.0
52.399271,4.53346975,0.02881555
52.399271,4.56818825,0.030654467999999997
52.399271,4.60290675,0.030654467999999997
52.399271,4.63762525,0.030654467999999997
52.399271,4.6723437500000005,0.030654467999999997
52.399271,4.70706225,0.025365627999999998
52.399271,4.74178075,0.0
