52.508251,4.49875125,3055.7424
52.508251,4.53346975,3254.1769999999997
52.508251,4.56818825,3254.1769999999997
52.508251,4.60290675,3254.1769999999997
52.508251,4.63762525,3355.7914
52.508251,4.6723437500000005,3355.7914
52.508251,4.70706225,3355.7914
52.508251,4.74178075,3355.7914
52.48645500000001,4.49875125,3055.7424
52.48645500000001,4.53346975,3254.1769999999997
52.48645500000001,4.56818825,3254.1769999999997
52.48645500000001,4.60290675,3254.1769999999997
52.48645500000001,4.63762525,3228.1342999999997
52.48645500000001,4.6723437500000005,0.0
52.48645500000001,4.70706225,0.0
52.48645500000001,4.74178075,0.0
52.464659,4.49875125,3187.6028
52.464659,4.53346975,3187.6028
52.464659,4.56818825,3228.1342999999997
52.464659,4.60290675,3228.1342999999997
52.464659,4.63762525,3228.1342999999997
52.464659,4.6723437500000005,0.0
52.464659,4.70706225,0.0
52.464659,4.74178075,0.0
52.442863,4.49875125,3187.6028
52.442863,4.53346975,3187.6028
52.442863,4.56818825,3228.1342999999997
52.442863,4.60290675,3228.1342999999997
52.442863,4.63762525,3228.1342999999997
52.442863,4.6723437500000005,0.0
52.442863,4.70706225,0.0
52.442863,4.74178075,0.0
52.421067,4.49875125,3187.6028
52.421067,4.53346975,3187.6028
52.421067,4.56818825,3198.655
52.421067,4.60290675,3198.655
52.421067,4.63762525,3198.655
52.421067,4.6723437500000005,0.0
52.421067,4.70706225,0.0
52.421067,4.74178075,0.0
52.399271,4.49875125,0.0
52.399271,4.53346975,3222.6805
52.399271,4.56818825,3222.6805
52.399271,4.60290675,3198.655
52.399271,4.63762525,3198.655
52.399271,4.6723437500000005,3198.655
52.399271,4.70706225,0.0
52.399271,4.74178075,0.0
