52.508251,4.49875125,0.0
52.508251,4.53346975,0.0
52.508251,4.56818825,3282.359
52.508251,4.60290675,3282.359
52.508251,4.63762525,3282.359
52.508251,4.6723437500000005,3282.359
52.508251,4.70706225,3282.359
52.508251,4.74178075,3282.359
52.48645500000001,4.49875125,0.0
52.48645500000001,4.53346975,0.0
52.48645500000001,4.56818825,3432.4855000000002
52.48645500000001,4.60290675,3432.4855000000002
52.48645500000001,4.63762525,3432.4855000000002
52.48645500000001,4.6723437500000005,3432.4855000000002
52.48645500000001,4.70706225,3432.4855000000002
52.48645500000001,4.74178075,3432.4855000000002
52.464659,4.49875125,0.0
52.464659,4.53346975,0.0
52.464659,4.56818825,3432.4855000000002
52.464659,4.60290675,3432.4855000000002
52.464659,4.63762525,3432.4855000000002
52.464659,4.6723437500000005,3432.4855000000002
52.464659,4.70706225,3432.4855000000002
52.464659,4.74178075,3432.4855000000002
52.442863,4.49875125,0.0
52.442863,4.53346975,0.0
52.442863,4.56818825,3175.8003
52.442863,4.60290675,3175.8003
52.442863,4.63762525,3175.8003
52.442863,4.6723437500000005,3175.8003
52.442863,4.70706225,3175.8003
52.442863,4.74178075,3175.8003
52.421067,4.49875125,0.0
52.421067,4.53346975,0.0
52.421067,4.56818825,3175.8003
52.421067,4.60290675,3175.8003
52.421067,4.63762525,3175.8003
52.421067,4.6723437500000005,3175.8003
52.421067,4.70706225,3175.8003
52.421067,4.74178075,3175.8003
52.399271,4.49875125,0.0
52.399271,4.53346975,0.0
52.399271,4.56818825,3284.2614
52.399271,4.60290675,3284.2614
52.399271,4.63762525,3284.2614
52.399271,4.6723437500000005,3284.2614
52.399271,4.70706225,3284.2614
52.399271,4.74178075,0.0
