latitude,longitude,value
52.49892840473542,4.550142288208009,0.028613677
52.49892840473542,4.614171981811523,0.028613677
52.49892840473542,4.67820167541504,0.031694482999999996
52.49892840473542,4.7422313690185565,0.029289803
52.45880953866191,4.550142288208009,0.028989814
52.45880953866191,4.614171981811523,0.028983342999999998
52.45880953866191,4.67820167541504,0.029289803
52.45880953866191,4.7422313690185565,0.029289803
52.4186906725884,4.550142288208009,0.030321362999999997
52.4186906725884,4.614171981811523,0.026836334
52.4186906725884,4.67820167541504,0.026836334
52.4186906725884,4.7422313690185565,0.029640475
