latitude,longitude,value
52.49892840473542,4.550142288208009,0.04942116
52.49892840473542,4.614171981811523,0.04942116
52.49892840473542,4.67820167541504,0.04607521
52.49892840473542,4.7422313690185565,0.04607521
52.45880953866191,4.550142288208009,0.046097837
52.45880953866191,4.614171981811523,0.046097837
52.45880953866191,4.67820167541504,0.04670117
52.45880953866191,4.7422313690185565,0.04670117
52.4186906725884,4.550142288208009,0.0
52.4186906725884,4.614171981811523,0.0
52.4186906725884,4.67820167541504,0.0
52.4186906725884,4.7422313690185565,0.0
