latitude,longitude,value
52.49892840473542,4.550142288208009,0.029961487000000002
52.49892840473542,4.614171981811523,0.031277344
52.49892840473542,4.67820167541504,0.03214582
52.49892840473542,4.7422313690185565,0.03214582
52.45880953866191,4.550142288208009,0.027273827999999996
52.45880953866191,4.614171981811523,0.031277344
52.45880953866191,4.67820167541504,0.0315369
52.45880953866191,4.7422313690185565,0.0315369
52.4186906725884,4.550142288208009,0.0
52.4186906725884,4.614171981811523,0.026990443
52.4186906725884,4.67820167541504,0.026990443
52.4186906725884,4.7422313690185565,0.031185526
