value,value-30,value-29,value-28,value-27,value-26,value-25,value-24,value-23,value-22,value-21,value-20,value-19,value-18,value-17,value-16,value-15,value-14,value-13,value-12,value-11,value-10,value-9,value-8,value-7,value-6,value-5,value-4,value-3,value-2,value-1,Prediction+1,Prediction+2,Prediction+3
0.029468426000000002,0.0,0.03318668,0.0,0.02561854,0.0,0.026721647,0.0,0.0,0.0,0.0,0.030219205,0.029409353,0.031189937,0.0,0.0,0.0,0.03134407,0.02561089,0.029300151,0.024754876000000002,0.0,0.03232714,0.031455527999999996,0.030243887,0.028335997999999998,0.0,0.028204566,0.027499039,0.0,0.0,0.026139568999999998,0.026587562999999998,0.0
0.026139568999999998,0.03318668,0.0,0.02561854,0.0,0.026721647,0.0,0.0,0.0,0.0,0.030219205,0.029409353,0.031189937,0.0,0.0,0.0,0.03134407,0.02561089,0.029300151,0.024754876000000002,0.0,0.03232714,0.031455527999999996,0.030243887,0.028335997999999998,0.0,0.028204566,0.027499039,0.0,0.0,0.029468426000000002,0.026587562999999998,0.0,0.029271537
0.026587562999999998,0.0,0.02561854,0.0,0.026721647,0.0,0.0,0.0,0.0,0.030219205,0.029409353,0.031189937,0.0,0.0,0.0,0.03134407,0.02561089,0.029300151,0.024754876000000002,0.0,0.03232714,0.031455527999999996,0.030243887,0.028335997999999998,0.0,0.028204566,0.027499039,0.0,0.0,0.029468426000000002,0.026139568999999998,0.0,0.029271537,0.0
0.0,0.02561854,0.0,0.026721647,0.0,0.0,0.0,0.0,0.030219205,0.029409353,0.031189937,0.0,0.0,0.0,0.03134407,0.02561089,0.029300151,0.024754876000000002,0.0,0.03232714,0.031455527999999996,0.030243887,0.028335997999999998,0.0,0.028204566,0.027499039,0.0,0.0,0.029468426000000002,0.026139568999999998,0.026587562999999998,0.029271537,0.0,0.027058948
0.029271537,0.0,0.026721647,0.0,0.0,0.0,0.0,0.030219205,0.029409353,0.031189937,0.0,0.0,0.0,0.03134407,0.02561089,0.029300151,0.024754876000000002,0.0,0.03232714,0.031455527999999996,0.030243887,0.028335997999999998,0.0,0.028204566,0.027499039,0.0,0.0,0.029468426000000002,0.026139568999999998,0.026587562999999998,0.0,0.0,0.027058948,0.0
0.0,0.026721647,0.0,0.0,0.0,0.0,0.030219205,0.029409353,0.031189937,0.0,0.0,0.0,0.03134407,0.02561089,0.029300151,0.024754876000000002,0.0,0.03232714,0.031455527999999996,0.030243887,0.028335997999999998,0.0,0.028204566,0.027499039,0.0,0.0,0.029468426000000002,0.026139568999999998,0.026587562999999998,0.0,0.029271537,0.027058948,0.0,0.0
0.027058948,0.0,0.0,0.0,0.0,0.030219205,0.029409353,0.031189937,0.0,0.0,0.0,0.03134407,0.02561089,0.029300151,0.024754876000000002,0.0,0.03232714,0.031455527999999996,0.030243887,0.028335997999999998,0.0,0.028204566,0.027499039,0.0,0.0,0.029468426000000002,0.026139568999999998,0.026587562999999998,0.0,0.029271537,0.0,0.0,0.0,0.028019073999999998
0.0,0.0,0.0,0.0,0.030219205,0.029409353,0.031189937,0.0,0.0,0.0,0.03134407,0.02561089,0.029300151,0.024754876000000002,0.0,0.03232714,0.031455527999999996,0.030243887,0.028335997999999998,0.0,0.028204566,0.027499039,0.0,0.0,0.029468426000000002,0.026139568999999998,0.026587562999999998,0.0,0.029271537,0.0,0.027058948,0.0,0.028019073999999998,0.026424639
0.0,0.0,0.0,0.030219205,0.029409353,0.031189937,0.0,0.0,0.0,0.03134407,0.02561089,0.029300151,0.024754876000000002,0.0,0.03232714,0.031455527999999996,0.030243887,0.028335997999999998,0.0,0.028204566,0.027499039,0.0,0.0,0.029468426000000002,0.026139568999999998,0.026587562999999998,0.0,0.029271537,0.0,0.027058948,0.0,0.028019073999999998,0.026424639,0.030854592
0.028019073999999998,0.0,0.030219205,0.029409353,0.031189937,0.0,0.0,0.0,0.03134407,0.02561089,0.029300151,0.024754876000000002,0.0,0.03232714,0.031455527999999996,0.030243887,0.028335997999999998,0.0,0.028204566,0.027499039,0.0,0.0,0.029468426000000002,0.026139568999999998,0.026587562999999998,0.0,0.029271537,0.0,0.027058948,0.0,0.0,0.026424639,0.030854592,0.031758003
0.026424639,0.030219205,0.029409353,0.031189937,0.0,0.0,0.0,0.03134407,0.02561089,0.029300151,0.024754876000000002,0.0,0.03232714,0.031455527999999996,0.030243887,0.028335997999999998,0.0,0.028204566,0.027499039,0.0,0.0,0.029468426000000002,0.026139568999999998,0.026587562999999998,0.0,0.029271537,0.0,0.027058948,0.0,0.0,0.028019073999999998,0.030854592,0.031758003,0.02956546
0.030854592,0.029409353,0.031189937,0.0,0.0,0.0,0.03134407,0.02561089,0.029300151,0.024754876000000002,0.0,0.03232714,0.031455527999999996,0.030243887,0.028335997999999998,0.0,0.028204566,0.027499039,0.0,0.0,0.029468426000000002,0.026139568999999998,0.026587562999999998,0.0,0.029271537,0.0,0.027058948,0.0,0.0,0.028019073999999998,0.026424639,0.031758003,0.02956546,0.031632967000000005
0.031758003,0.031189937,0.0,0.0,0.0,0.03134407,0.02561089,0.029300151,0.024754876000000002,0.0,0.03232714,0.031455527999999996,0.030243887,0.028335997999999998,0.0,0.028204566,0.027499039,0.0,0.0,0.029468426000000002,0.026139568999999998,0.026587562999999998,0.0,0.029271537,0.0,0.027058948,0.0,0.0,0.028019073999999998,0.026424639,0.030854592,0.02956546,0.031632967000000005,0.0
0.02956546,0.0,0.0,0.0,0.03134407,0.02561089,0.029300151,0.024754876000000002,0.0,0.03232714,0.031455527999999996,0.030243887,0.028335997999999998,0.0,0.028204566,0.027499039,0.0,0.0,0.029468426000000002,0.026139568999999998,0.026587562999999998,0.0,0.029271537,0.0,0.027058948,0.0,0.0,0.028019073999999998,0.026424639,0.030854592,0.031758003,0.031632967000000005,0.0,0.030435007000000007
0.031632967000000005,0.0,0.0,0.03134407,0.02561089,0.029300151,0.024754876000000002,0.0,0.03232714,0.031455527999999996,0.030243887,0.028335997999999998,0.0,0.028204566,0.027499039,0.0,0.0,0.029468426000000002,0.026139568999999998,0.026587562999999998,0.0,0.029271537,0.0,0.027058948,0.0,0.0,0.028019073999999998,0.026424639,0.030854592,0.031758003,0.02956546,0.0,0.030435007000000007,0.0
0.0,0.0,0.03134407,0.02561089,0.029300151,0.024754876000000002,0.0,0.03232714,0.031455527999999996,0.030243887,0.028335997999999998,0.0,0.028204566,0.027499039,0.0,0.0,0.029468426000000002,0.026139568999999998,0.026587562999999998,0.0,0.029271537,0.0,0.027058948,0.0,0.0,0.028019073999999998,0.026424639,0.030854592,0.031758003,0.02956546,0.031632967000000005,0.030435007000000007,0.0,0.0
0.030435007000000007,0.03134407,0.02561089,0.029300151,0.024754876000000002,0.0,0.03232714,0.031455527999999996,0.030243887,0.028335997999999998,0.0,0.028204566,0.027499039,0.0,0.0,0.029468426000000002,0.026139568999999998,0.026587562999999998,0.0,0.029271537,0.0,0.027058948,0.0,0.0,0.028019073999999998,0.026424639,0.030854592,0.031758003,0.02956546,0.031632967000000005,0.0,0.0,0.0,0.02491781
0.0,0.02561089,0.029300151,0.024754876000000002,0.0,0.03232714,0.031455527999999996,0.030243887,0.028335997999999998,0.0,0.028204566,0.027499039,0.0,0.0,0.029468426000000002,0.026139568999999998,0.026587562999999998,0.0,0.029271537,0.0,0.027058948,0.0,0.0,0.028019073999999998,0.026424639,0.030854592,0.031758003,0.02956546,0.031632967000000005,0.0,0.030435007000000007,0.0,0.02491781,0.030027843999999998
0.0,0.029300151,0.024754876000000002,0.0,0.03232714,0.031455527999999996,0.030243887,0.028335997999999998,0.0,0.028204566,0.027499039,0.0,0.0,0.029468426000000002,0.026139568999999998,0.026587562999999998,0.0,0.029271537,0.0,0.027058948,0.0,0.0,0.028019073999999998,0.026424639,0.030854592,0.031758003,0.02956546,0.031632967000000005,0.0,0.030435007000000007,0.0,0.02491781,0.030027843999999998,0.0
0.02491781,0.024754876000000002,0.0,0.03232714,0.031455527999999996,0.030243887,0.028335997999999998,0.0,0.028204566,0.027499039,0.0,0.0,0.029468426000000002,0.026139568999999998,0.026587562999999998,0.0,0.029271537,0.0,0.027058948,0.0,0.0,0.028019073999999998,0.026424639,0.030854592,0.031758003,0.02956546,0.031632967000000005,0.0,0.030435007000000007,0.0,0.0,0.030027843999999998,0.0,0.026571183999999998
0.030027843999999998,0.0,0.03232714,0.031455527999999996,0.030243887,0.028335997999999998,0.0,0.028204566,0.027499039,0.0,0.0,0.029468426000000002,0.026139568999999998,0.026587562999999998,0.0,0.029271537,0.0,0.027058948,0.0,0.0,0.028019073999999998,0.026424639,0.030854592,0.031758003,0.02956546,0.031632967000000005,0.0,0.030435007000000007,0.0,0.0,0.02491781,0.0,0.026571183999999998,0.0
0.0,0.03232714,0.031455527999999996,0.030243887,0.028335997999999998,0.0,0.028204566,0.027499039,0.0,0.0,0.029468426000000002,0.026139568999999998,0.026587562999999998,0.0,0.029271537,0.0,0.027058948,0.0,0.0,0.028019073999999998,0.026424639,0.030854592,0.031758003,0.02956546,0.031632967000000005,0.0,0.030435007000000007,0.0,0.0,0.02491781,0.030027843999999998,0.026571183999999998,0.0,0.0
0.026571183999999998,0.031455527999999996,0.030243887,0.028335997999999998,0.0,0.028204566,0.027499039,0.0,0.0,0.029468426000000002,0.026139568999999998,0.026587562999999998,0.0,0.029271537,0.0,0.027058948,0.0,0.0,0.028019073999999998,0.026424639,0.030854592,0.031758003,0.02956546,0.031632967000000005,0.0,0.030435007000000007,0.0,0.0,0.02491781,0.030027843999999998,0.0,0.0,0.0,0.030774666000000006
0.0,0.030243887,0.028335997999999998,0.0,0.028204566,0.027499039,0.0,0.0,0.029468426000000002,0.026139568999999998,0.026587562999999998,0.0,0.029271537,0.0,0.027058948,0.0,0.0,0.028019073999999998,0.026424639,0.030854592,0.031758003,0.02956546,0.031632967000000005,0.0,0.030435007000000007,0.0,0.0,0.02491781,0.030027843999999998,0.0,0.026571183999999998,0.0,0.030774666000000006,0.0
0.0,0.028335997999999998,0.0,0.028204566,0.027499039,0.0,0.0,0.029468426000000002,0.026139568999999998,0.026587562999999998,0.0,0.029271537,0.0,0.027058948,0.0,0.0,0.028019073999999998,0.026424639,0.030854592,0.031758003,0.02956546,0.031632967000000005,0.0,0.030435007000000007,0.0,0.0,0.02491781,0.030027843999999998,0.0,0.026571183999999998,0.0,0.030774666000000006,0.0,0.02792981
0.030774666000000006,0.0,0.028204566,0.027499039,0.0,0.0,0.029468426000000002,0.026139568999999998,0.026587562999999998,0.0,0.029271537,0.0,0.027058948,0.0,0.0,0.028019073999999998,0.026424639,0.030854592,0.031758003,0.02956546,0.031632967000000005,0.0,0.030435007000000007,0.0,0.0,0.02491781,0.030027843999999998,0.0,0.026571183999999998,0.0,0.0,0.0,0.02792981,0.032046452
0.0,0.028204566,0.027499039,0.0,0.0,0.029468426000000002,0.026139568999999998,0.026587562999999998,0.0,0.029271537,0.0,0.027058948,0.0,0.0,0.028019073999999998,0.026424639,0.030854592,0.031758003,0.02956546,0.031632967000000005,0.0,0.030435007000000007,0.0,0.0,0.02491781,0.030027843999999998,0.0,0.026571183999999998,0.0,0.0,0.030774666000000006,0.02792981,0.032046452,0.030025162
0.02792981,0.027499039,0.0,0.0,0.029468426000000002,0.026139568999999998,0.026587562999999998,0.0,0.029271537,0.0,0.027058948,0.0,0.0,0.028019073999999998,0.026424639,0.030854592,0.031758003,0.02956546,0.031632967000000005,0.0,0.030435007000000007,0.0,0.0,0.02491781,0.030027843999999998,0.0,0.026571183999999998,0.0,0.0,0.030774666000000006,0.0,0.032046452,0.030025162,0.030775767000000002
0.032046452,0.0,0.0,0.029468426000000002,0.026139568999999998,0.026587562999999998,0.0,0.029271537,0.0,0.027058948,0.0,0.0,0.028019073999999998,0.026424639,0.030854592,0.031758003,0.02956546,0.031632967000000005,0.0,0.030435007000000007,0.0,0.0,0.02491781,0.030027843999999998,0.0,0.026571183999999998,0.0,0.0,0.030774666000000006,0.0,0.02792981,0.030025162,0.030775767000000002,0.03683098
0.030025162,0.0,0.029468426000000002,0.026139568999999998,0.026587562999999998,0.0,0.029271537,0.0,0.027058948,0.0,0.0,0.028019073999999998,0.026424639,0.030854592,0.031758003,0.02956546,0.031632967000000005,0.0,0.030435007000000007,0.0,0.0,0.02491781,0.030027843999999998,0.0,0.026571183999999998,0.0,0.0,0.030774666000000006,0.0,0.02792981,0.032046452,0.030775767000000002,0.03683098,0.0
0.030775767000000002,0.029468426000000002,0.026139568999999998,0.026587562999999998,0.0,0.029271537,0.0,0.027058948,0.0,0.0,0.028019073999999998,0.026424639,0.030854592,0.031758003,0.02956546,0.031632967000000005,0.0,0.030435007000000007,0.0,0.0,0.02491781,0.030027843999999998,0.0,0.026571183999999998,0.0,0.0,0.030774666000000006,0.0,0.02792981,0.032046452,0.030025162,0.03683098,0.0,0.027673487000000004
0.03683098,0.026139568999999998,0.026587562999999998,0.0,0.029271537,0.0,0.027058948,0.0,0.0,0.028019073999999998,0.026424639,0.030854592,0.031758003,0.02956546,0.031632967000000005,0.0,0.030435007000000007,0.0,0.0,0.02491781,0.030027843999999998,0.0,0.026571183999999998,0.0,0.0,0.030774666000000006,0.0,0.02792981,0.032046452,0.030025162,0.030775767000000002,0.0,0.027673487000000004,0.023236196
0.0,0.026587562999999998,0.0,0.029271537,0.0,0.027058948,0.0,0.0,0.028019073999999998,0.026424639,0.030854592,0.031758003,0.02956546,0.031632967000000005,0.0,0.030435007000000007,0.0,0.0,0.02491781,0.030027843999999998,0.0,0.026571183999999998,0.0,0.0,0.030774666000000006,0.0,0.02792981,0.032046452,0.030025162,0.030775767000000002,0.03683098,0.027673487000000004,0.023236196,0.02974544
0.027673487000000004,0.0,0.029271537,0.0,0.027058948,0.0,0.0,0.028019073999999998,0.026424639,0.030854592,0.031758003,0.02956546,0.031632967000000005,0.0,0.030435007000000007,0.0,0.0,0.02491781,0.030027843999999998,0.0,0.026571183999999998,0.0,0.0,0.030774666000000006,0.0,0.02792981,0.032046452,0.030025162,0.030775767000000002,0.03683098,0.0,0.023236196,0.02974544,0.02377165
0.023236196,0.029271537,0.0,0.027058948,0.0,0.0,0.028019073999999998,0.026424639,0.030854592,0.031758003,0.02956546,0.031632967000000005,0.0,0.030435007000000007,0.0,0.0,0.02491781,0.030027843999999998,0.0,0.026571183999999998,0.0,0.0,0.030774666000000006,0.0,0.02792981,0.032046452,0.030025162,0.030775767000000002,0.03683098,0.0,0.027673487000000004,0.02974544,0.02377165,0.0
0.02974544,0.0,0.027058948,0.0,0.0,0.028019073999999998,0.026424639,0.030854592,0.031758003,0.02956546,0.031632967000000005,0.0,0.030435007000000007,0.0,0.0,0.02491781,0.030027843999999998,0.0,0.026571183999999998,0.0,0.0,0.030774666000000006,0.0,0.02792981,0.032046452,0.030025162,0.030775767000000002,0.03683098,0.0,0.027673487000000004,0.023236196,0.02377165,0.0,0.033062395
0.02377165,0.027058948,0.0,0.0,0.028019073999999998,0.026424639,0.030854592,0.031758003,0.02956546,0.031632967000000005,0.0,0.030435007000000007,0.0,0.0,0.02491781,0.030027843999999998,0.0,0.026571183999999998,0.0,0.0,0.030774666000000006,0.0,0.02792981,0.032046452,0.030025162,0.030775767000000002,0.03683098,0.0,0.027673487000000004,0.023236196,0.02974544,0.0,0.033062395,0.03349605
0.0,0.0,0.0,0.028019073999999998,0.026424639,0.030854592,0.031758003,0.02956546,0.031632967000000005,0.0,0.030435007000000007,0.0,0.0,0.02491781,0.030027843999999998,0.0,0.026571183999999998,0.0,0.0,0.030774666000000006,0.0,0.02792981,0.032046452,0.030025162,0.030775767000000002,0.03683098,0.0,0.027673487000000004,0.023236196,0.02974544,0.02377165,0.033062395,0.03349605,0.033182178
0.033062395,0.0,0.028019073999999998,0.026424639,0.030854592,0.031758003,0.02956546,0.031632967000000005,0.0,0.030435007000000007,0.0,0.0,0.02491781,0.030027843999999998,0.0,0.026571183999999998,0.0,0.0,0.030774666000000006,0.0,0.02792981,0.032046452,0.030025162,0.030775767000000002,0.03683098,0.0,0.027673487000000004,0.023236196,0.02974544,0.02377165,0.0,0.03349605,0.033182178,0.034543466
0.03349605,0.028019073999999998,0.026424639,0.030854592,0.031758003,0.02956546,0.031632967000000005,0.0,0.030435007000000007,0.0,0.0,0.02491781,0.030027843999999998,0.0,0.026571183999999998,0.0,0.0,0.030774666000000006,0.0,0.02792981,0.032046452,0.030025162,0.030775767000000002,0.03683098,0.0,0.027673487000000004,0.023236196,0.02974544,0.02377165,0.0,0.033062395,0.033182178,0.034543466,0.0
0.033182178,0.026424639,0.030854592,0.031758003,0.02956546,0.031632967000000005,0.0,0.030435007000000007,0.0,0.0,0.02491781,0.030027843999999998,0.0,0.026571183999999998,0.0,0.0,0.030774666000000006,0.0,0.02792981,0.032046452,0.030025162,0.030775767000000002,0.03683098,0.0,0.027673487000000004,0.023236196,0.02974544,0.02377165,0.0,0.033062395,0.03349605,0.034543466,0.0,0.033285294
0.034543466,0.030854592,0.031758003,0.02956546,0.031632967000000005,0.0,0.030435007000000007,0.0,0.0,0.02491781,0.030027843999999998,0.0,0.026571183999999998,0.0,0.0,0.030774666000000006,0.0,0.02792981,0.032046452,0.030025162,0.030775767000000002,0.03683098,0.0,0.027673487000000004,0.023236196,0.02974544,0.02377165,0.0,0.033062395,0.03349605,0.033182178,0.0,0.033285294,0.031801384
0.0,0.031758003,0.02956546,0.031632967000000005,0.0,0.030435007000000007,0.0,0.0,0.02491781,0.030027843999999998,0.0,0.026571183999999998,0.0,0.0,0.030774666000000006,0.0,0.02792981,0.032046452,0.030025162,0.030775767000000002,0.03683098,0.0,0.027673487000000004,0.023236196,0.02974544,0.02377165,0.0,0.033062395,0.03349605,0.033182178,0.034543466,0.033285294,0.031801384,0.02923092
0.033285294,0.02956546,0.031632967000000005,0.0,0.030435007000000007,0.0,0.0,0.02491781,0.030027843999999998,0.0,0.026571183999999998,0.0,0.0,0.030774666000000006,0.0,0.02792981,0.032046452,0.030025162,0.030775767000000002,0.03683098,0.0,0.027673487000000004,0.023236196,0.02974544,0.02377165,0.0,0.033062395,0.03349605,0.033182178,0.034543466,0.0,0.031801384,0.02923092,0.0
0.031801384,0.031632967000000005,0.0,0.030435007000000007,0.0,0.0,0.02491781,0.030027843999999998,0.0,0.026571183999999998,0.0,0.0,0.030774666000000006,0.0,0.02792981,0.032046452,0.030025162,0.030775767000000002,0.03683098,0.0,0.027673487000000004,0.023236196,0.02974544,0.02377165,0.0,0.033062395,0.03349605,0.033182178,0.034543466,0.0,0.033285294,0.02923092,0.0,0.0
0.02923092,0.0,0.030435007000000007,0.0,0.0,0.02491781,0.030027843999999998,0.0,0.026571183999999998,0.0,0.0,0.030774666000000006,0.0,0.02792981,0.032046452,0.030025162,0.030775767000000002,0.03683098,0.0,0.027673487000000004,0.023236196,0.02974544,0.02377165,0.0,0.033062395,0.03349605,0.033182178,0.034543466,0.0,0.033285294,0.031801384,0.0,0.0,0.028873455
0.0,0.030435007000000007,0.0,0.0,0.02491781,0.030027843999999998,0.0,0.026571183999999998,0.0,0.0,0.030774666000000006,0.0,0.02792981,0.032046452,0.030025162,0.030775767000000002,0.03683098,0.0,0.027673487000000004,0.023236196,0.02974544,0.02377165,0.0,0.033062395,0.03349605,0.033182178,0.034543466,0.0,0.033285294,0.031801384,0.02923092,0.0,0.028873455,0.0
0.0,0.0,0.0,0.02491781,0.030027843999999998,0.0,0.026571183999999998,0.0,0.0,0.030774666000000006,0.0,0.02792981,0.032046452,0.030025162,0.030775767000000002,0.03683098,0.0,0.027673487000000004,0.023236196,0.02974544,0.02377165,0.0,0.033062395,0.03349605,0.033182178,0.034543466,0.0,0.033285294,0.031801384,0.02923092,0.0,0.028873455,0.0,0.029618837000000002
0.028873455,0.0,0.02491781,0.030027843999999998,0.0,0.026571183999999998,0.0,0.0,0.030774666000000006,0.0,0.02792981,0.032046452,0.030025162,0.030775767000000002,0.03683098,0.0,0.027673487000000004,0.023236196,0.02974544,0.02377165,0.0,0.033062395,0.03349605,0.033182178,0.034543466,0.0,0.033285294,0.031801384,0.02923092,0.0,0.0,0.0,0.029618837000000002,0.029640475
0.0,0.02491781,0.030027843999999998,0.0,0.026571183999999998,0.0,0.0,0.030774666000000006,0.0,0.02792981,0.032046452,0.030025162,0.030775767000000002,0.03683098,0.0,0.027673487000000004,0.023236196,0.02974544,0.02377165,0.0,0.033062395,0.03349605,0.033182178,0.034543466,0.0,0.033285294,0.031801384,0.02923092,0.0,0.0,0.028873455,0.029618837000000002,0.029640475,0.027240657999999997
0.029618837000000002,0.030027843999999998,0.0,0.026571183999999998,0.0,0.0,0.030774666000000006,0.0,0.02792981,0.032046452,0.030025162,0.030775767000000002,0.03683098,0.0,0.027673487000000004,0.023236196,0.02974544,0.02377165,0.0,0.033062395,0.03349605,0.033182178,0.034543466,0.0,0.033285294,0.031801384,0.02923092,0.0,0.0,0.028873455,0.0,0.029640475,0.027240657999999997,0.027326051
0.029640475,0.0,0.026571183999999998,0.0,0.0,0.030774666000000006,0.0,0.02792981,0.032046452,0.030025162,0.030775767000000002,0.03683098,0.0,0.027673487000000004,0.023236196,0.02974544,0.02377165,0.0,0.033062395,0.03349605,0.033182178,0.034543466,0.0,0.033285294,0.031801384,0.02923092,0.0,0.0,0.028873455,0.0,0.029618837000000002,0.027240657999999997,0.027326051,0.027329361
0.027240657999999997,0.026571183999999998,0.0,0.0,0.030774666000000006,0.0,0.02792981,0.032046452,0.030025162,0.030775767000000002,0.03683098,0.0,0.027673487000000004,0.023236196,0.02974544,0.02377165,0.0,0.033062395,0.03349605,0.033182178,0.034543466,0.0,0.033285294,0.031801384,0.02923092,0.0,0.0,0.028873455,0.0,0.029618837000000002,0.029640475,0.027326051,0.027329361,0.031474142999999996
0.027326051,0.0,0.0,0.030774666000000006,0.0,0.02792981,0.032046452,0.030025162,0.030775767000000002,0.03683098,0.0,0.027673487000000004,0.023236196,0.02974544,0.02377165,0.0,0.033062395,0.03349605,0.033182178,0.034543466,0.0,0.033285294,0.031801384,0.02923092,0.0,0.0,0.028873455,0.0,0.029618837000000002,0.029640475,0.027240657999999997,0.027329361,0.031474142999999996,0.0
0.027329361,0.0,0.030774666000000006,0.0,0.02792981,0.032046452,0.030025162,0.030775767000000002,0.03683098,0.0,0.027673487000000004,0.023236196,0.02974544,0.02377165,0.0,0.033062395,0.03349605,0.033182178,0.034543466,0.0,0.033285294,0.031801384,0.02923092,0.0,0.0,0.028873455,0.0,0.029618837000000002,0.029640475,0.027240657999999997,0.027326051,0.031474142999999996,0.0,0.0
0.031474142999999996,0.030774666000000006,0.0,0.02792981,0.032046452,0.030025162,0.030775767000000002,0.03683098,0.0,0.027673487000000004,0.023236196,0.02974544,0.02377165,0.0,0.033062395,0.03349605,0.033182178,0.034543466,0.0,0.033285294,0.031801384,0.02923092,0.0,0.0,0.028873455,0.0,0.029618837000000002,0.029640475,0.027240657999999997,0.027326051,0.027329361,0.0,0.0,0.028311249
0.0,0.0,0.02792981,0.032046452,0.030025162,0.030775767000000002,0.03683098,0.0,0.027673487000000004,0.023236196,0.02974544,0.02377165,0.0,0.033062395,0.03349605,0.033182178,0.034543466,0.0,0.033285294,0.031801384,0.02923092,0.0,0.0,0.028873455,0.0,0.029618837000000002,0.029640475,0.027240657999999997,0.027326051,0.027329361,0.031474142999999996,0.0,0.028311249,0.0
0.0,0.02792981,0.032046452,0.030025162,0.030775767000000002,0.03683098,0.0,0.027673487000000004,0.023236196,0.02974544,0.02377165,0.0,0.033062395,0.03349605,0.033182178,0.034543466,0.0,0.033285294,0.031801384,0.02923092,0.0,0.0,0.028873455,0.0,0.029618837000000002,0.029640475,0.027240657999999997,0.027326051,0.027329361,0.031474142999999996,0.0,0.028311249,0.0,0.0
0.028311249,0.032046452,0.030025162,0.030775767000000002,0.03683098,0.0,0.027673487000000004,0.023236196,0.02974544,0.02377165,0.0,0.033062395,0.03349605,0.033182178,0.034543466,0.0,0.033285294,0.031801384,0.02923092,0.0,0.0,0.028873455,0.0,0.029618837000000002,0.029640475,0.027240657999999997,0.027326051,0.027329361,0.031474142999999996,0.0,0.0,0.0,0.0,0.03436627
0.0,0.030025162,0.030775767000000002,0.03683098,0.0,0.027673487000000004,0.023236196,0.02974544,0.02377165,0.0,0.033062395,0.03349605,0.033182178,0.034543466,0.0,0.033285294,0.031801384,0.02923092,0.0,0.0,0.028873455,0.0,0.029618837000000002,0.029640475,0.027240657999999997,0.027326051,0.027329361,0.031474142999999996,0.0,0.0,0.028311249,0.0,0.03436627,0.030974641
0.0,0.030775767000000002,0.03683098,0.0,0.027673487000000004,0.023236196,0.02974544,0.02377165,0.0,0.033062395,0.03349605,0.033182178,0.034543466,0.0,0.033285294,0.031801384,0.02923092,0.0,0.0,0.028873455,0.0,0.029618837000000002,0.029640475,0.027240657999999997,0.027326051,0.027329361,0.031474142999999996,0.0,0.0,0.028311249,0.0,0.03436627,0.030974641,0.030155612000000002
0.03436627,0.03683098,0.0,0.027673487000000004,0.023236196,0.02974544,0.02377165,0.0,0.033062395,0.03349605,0.033182178,0.034543466,0.0,0.033285294,0.031801384,0.02923092,0.0,0.0,0.028873455,0.0,0.029618837000000002,0.029640475,0.027240657999999997,0.027326051,0.027329361,0.031474142999999996,0.0,0.0,0.028311249,0.0,0.0,0.030974641,0.030155612000000002,0.028890343
0.030974641,0.0,0.027673487000000004,0.023236196,0.02974544,0.02377165,0.0,0.033062395,0.03349605,0.033182178,0.034543466,0.0,0.033285294,0.031801384,0.02923092,0.0,0.0,0.028873455,0.0,0.029618837000000002,0.029640475,0.027240657999999997,0.027326051,0.027329361,0.031474142999999996,0.0,0.0,0.028311249,0.0,0.0,0.03436627,0.030155612000000002,0.028890343,0.0
0.030155612000000002,0.027673487000000004,0.023236196,0.02974544,0.02377165,0.0,0.033062395,0.03349605,0.033182178,0.034543466,0.0,0.033285294,0.031801384,0.02923092,0.0,0.0,0.028873455,0.0,0.029618837000000002,0.029640475,0.027240657999999997,0.027326051,0.027329361,0.031474142999999996,0.0,0.0,0.028311249,0.0,0.0,0.03436627,0.030974641,0.028890343,0.0,0.03262373
0.028890343,0.023236196,0.02974544,0.02377165,0.0,0.033062395,0.03349605,0.033182178,0.034543466,0.0,0.033285294,0.031801384,0.02923092,0.0,0.0,0.028873455,0.0,0.029618837000000002,0.029640475,0.027240657999999997,0.027326051,0.027329361,0.031474142999999996,0.0,0.0,0.028311249,0.0,0.0,0.03436627,0.030974641,0.030155612000000002,0.0,0.03262373,0.0315369
0.0,0.02974544,0.02377165,0.0,0.033062395,0.03349605,0.033182178,0.034543466,0.0,0.033285294,0.031801384,0.02923092,0.0,0.0,0.028873455,0.0,0.029618837000000002,0.029640475,0.027240657999999997,0.027326051,0.027329361,0.031474142999999996,0.0,0.0,0.028311249,0.0,0.0,0.03436627,0.030974641,0.030155612000000002,0.028890343,0.03262373,0.0315369,0.029410109
0.03262373,0.02377165,0.0,0.033062395,0.03349605,0.033182178,0.034543466,0.0,0.033285294,0.031801384,0.02923092,0.0,0.0,0.028873455,0.0,0.029618837000000002,0.029640475,0.027240657999999997,0.027326051,0.027329361,0.031474142999999996,0.0,0.0,0.028311249,0.0,0.0,0.03436627,0.030974641,0.030155612000000002,0.028890343,0.0,0.0315369,0.029410109,0.02680844
0.0315369,0.0,0.033062395,0.03349605,0.033182178,0.034543466,0.0,0.033285294,0.031801384,0.02923092,0.0,0.0,0.028873455,0.0,0.029618837000000002,0.029640475,0.027240657999999997,0.027326051,0.027329361,0.031474142999999996,0.0,0.0,0.028311249,0.0,0.0,0.03436627,0.030974641,0.030155612000000002,0.028890343,0.0,0.03262373,0.029410109,0.02680844,0.0
0.029410109,0.033062395,0.03349605,0.033182178,0.034543466,0.0,0.033285294,0.031801384,0.02923092,0.0,0.0,0.028873455,0.0,0.029618837000000002,0.029640475,0.027240657999999997,0.027326051,0.027329361,0.031474142999999996,0.0,0.0,0.028311249,0.0,0.0,0.03436627,0.030974641,0.030155612000000002,0.028890343,0.0,0.03262373,0.0315369,0.02680844,0.0,0.04670117
0.02680844,0.03349605,0.033182178,0.034543466,0.0,0.033285294,0.031801384,0.02923092,0.0,0.0,0.028873455,0.0,0.029618837000000002,0.029640475,0.027240657999999997,0.027326051,0.027329361,0.031474142999999996,0.0,0.0,0.028311249,0.0,0.0,0.03436627,0.030974641,0.030155612000000002,0.028890343,0.0,0.03262373,0.0315369,0.029410109,0.0,0.04670117,0.032355946000000003
0.0,0.033182178,0.034543466,0.0,0.033285294,0.031801384,0.02923092,0.0,0.0,0.028873455,0.0,0.029618837000000002,0.029640475,0.027240657999999997,0.027326051,0.027329361,0.031474142999999996,0.0,0.0,0.028311249,0.0,0.0,0.03436627,0.030974641,0.030155612000000002,0.028890343,0.0,0.03262373,0.0315369,0.029410109,0.02680844,0.04670117,0.032355946000000003,0.031285834
0.04670117,0.034543466,0.0,0.033285294,0.031801384,0.02923092,0.0,0.0,0.028873455,0.0,0.029618837000000002,0.029640475,0.027240657999999997,0.027326051,0.027329361,0.031474142999999996,0.0,0.0,0.028311249,0.0,0.0,0.03436627,0.030974641,0.030155612000000002,0.028890343,0.0,0.03262373,0.0315369,0.029410109,0.02680844,0.0,0.032355946000000003,0.031285834,0.038012773
0.032355946000000003,0.0,0.033285294,0.031801384,0.02923092,0.0,0.0,0.028873455,0.0,0.029618837000000002,0.029640475,0.027240657999999997,0.027326051,0.027329361,0.031474142999999996,0.0,0.0,0.028311249,0.0,0.0,0.03436627,0.030974641,0.030155612000000002,0.028890343,0.0,0.03262373,0.0315369,0.029410109,0.02680844,0.0,0.04670117,0.031285834,0.038012773,0.0
0.031285834,0.033285294,0.031801384,0.02923092,0.0,0.0,0.028873455,0.0,0.029618837000000002,0.029640475,0.027240657999999997,0.027326051,0.027329361,0.031474142999999996,0.0,0.0,0.028311249,0.0,0.0,0.03436627,0.030974641,0.030155612000000002,0.028890343,0.0,0.03262373,0.0315369,0.029410109,0.02680844,0.0,0.04670117,0.032355946000000003,0.038012773,0.0,0.0
0.038012773,0.031801384,0.02923092,0.0,0.0,0.028873455,0.0,0.029618837000000002,0.029640475,0.027240657999999997,0.027326051,0.027329361,0.031474142999999996,0.0,0.0,0.028311249,0.0,0.0,0.03436627,0.030974641,0.030155612000000002,0.028890343,0.0,0.03262373,0.0315369,0.029410109,0.02680844,0.0,0.04670117,0.032355946000000003,0.031285834,0.0,0.0,0.032731548
0.0,0.02923092,0.0,0.0,0.028873455,0.0,0.029618837000000002,0.029640475,0.027240657999999997,0.027326051,0.027329361,0.031474142999999996,0.0,0.0,0.028311249,0.0,0.0,0.03436627,0.030974641,0.030155612000000002,0.028890343,0.0,0.03262373,0.0315369,0.029410109,0.02680844,0.0,0.04670117,0.032355946000000003,0.031285834,0.038012773,0.0,0.032731548,0.0
0.0,0.0,0.0,0.028873455,0.0,0.029618837000000002,0.029640475,0.027240657999999997,0.027326051,0.027329361,0.031474142999999996,0.0,0.0,0.028311249,0.0,0.0,0.03436627,0.030974641,0.030155612000000002,0.028890343,0.0,0.03262373,0.0315369,0.029410109,0.02680844,0.0,0.04670117,0.032355946000000003,0.031285834,0.038012773,0.0,0.032731548,0.0,0.03362348
0.032731548,0.0,0.028873455,0.0,0.029618837000000002,0.029640475,0.027240657999999997,0.027326051,0.027329361,0.031474142999999996,0.0,0.0,0.028311249,0.0,0.0,0.03436627,0.030974641,0.030155612000000002,0.028890343,0.0,0.03262373,0.0315369,0.029410109,0.02680844,0.0,0.04670117,0.032355946000000003,0.031285834,0.038012773,0.0,0.0,0.0,0.03362348,0.03332672
0.0,0.028873455,0.0,0.029618837000000002,0.029640475,0.027240657999999997,0.027326051,0.027329361,0.031474142999999996,0.0,0.0,0.028311249,0.0,0.0,0.03436627,0.030974641,0.030155612000000002,0.028890343,0.0,0.03262373,0.0315369,0.029410109,0.02680844,0.0,0.04670117,0.032355946000000003,0.031285834,0.038012773,0.0,0.0,0.032731548,0.03362348,0.03332672,0.032125033
0.03362348,0.0,0.029618837000000002,0.029640475,0.027240657999999997,0.027326051,0.027329361,0.031474142999999996,0.0,0.0,0.028311249,0.0,0.0,0.03436627,0.030974641,0.030155612000000002,0.028890343,0.0,0.03262373,0.0315369,0.029410109,0.02680844,0.0,0.04670117,0.032355946000000003,0.031285834,0.038012773,0.0,0.0,0.032731548,0.0,0.03332672,0.032125033,0.030286366000000002
0.03332672,0.029618837000000002,0.029640475,0.027240657999999997,0.027326051,0.027329361,0.031474142999999996,0.0,0.0,0.028311249,0.0,0.0,0.03436627,0.030974641,0.030155612000000002,0.028890343,0.0,0.03262373,0.0315369,0.029410109,0.02680844,0.0,0.04670117,0.032355946000000003,0.031285834,0.038012773,0.0,0.0,0.032731548,0.0,0.03362348,0.032125033,0.030286366000000002,0.047243614
0.032125033,0.029640475,0.027240657999999997,0.027326051,0.027329361,0.031474142999999996,0.0,0.0,0.028311249,0.0,0.0,0.03436627,0.030974641,0.030155612000000002,0.028890343,0.0,0.03262373,0.0315369,0.029410109,0.02680844,0.0,0.04670117,0.032355946000000003,0.031285834,0.038012773,0.0,0.0,0.032731548,0.0,0.03362348,0.03332672,0.030286366000000002,0.047243614,0.0
0.030286366000000002,0.027240657999999997,0.027326051,0.027329361,0.031474142999999996,0.0,0.0,0.028311249,0.0,0.0,0.03436627,0.030974641,0.030155612000000002,0.028890343,0.0,0.03262373,0.0315369,0.029410109,0.02680844,0.0,0.04670117,0.032355946000000003,0.031285834,0.038012773,0.0,0.0,0.032731548,0.0,0.03362348,0.03332672,0.032125033,0.047243614,0.0,0.0
0.047243614,0.027326051,0.027329361,0.031474142999999996,0.0,0.0,0.028311249,0.0,0.0,0.03436627,0.030974641,0.030155612000000002,0.028890343,0.0,0.03262373,0.0315369,0.029410109,0.02680844,0.0,0.04670117,0.032355946000000003,0.031285834,0.038012773,0.0,0.0,0.032731548,0.0,0.03362348,0.03332672,0.032125033,0.030286366000000002,0.0,0.0,0.0
0.0,0.027329361,0.031474142999999996,0.0,0.0,0.028311249,0.0,0.0,0.03436627,0.030974641,0.030155612000000002,0.028890343,0.0,0.03262373,0.0315369,0.029410109,0.02680844,0.0,0.04670117,0.032355946000000003,0.031285834,0.038012773,0.0,0.0,0.032731548,0.0,0.03362348,0.03332672,0.032125033,0.030286366000000002,0.047243614,0.0,0.0,0.0
0.0,0.031474142999999996,0.0,0.0,0.028311249,0.0,0.0,0.03436627,0.030974641,0.030155612000000002,0.028890343,0.0,0.03262373,0.0315369,0.029410109,0.02680844,0.0,0.04670117,0.032355946000000003,0.031285834,0.038012773,0.0,0.0,0.032731548,0.0,0.03362348,0.03332672,0.032125033,0.030286366000000002,0.047243614,0.0,0.0,0.0,0.035105012000000005
0.0,0.0,0.0,0.028311249,0.0,0.0,0.03436627,0.030974641,0.030155612000000002,0.028890343,0.0,0.03262373,0.0315369,0.029410109,0.02680844,0.0,0.04670117,0.032355946000000003,0.031285834,0.038012773,0.0,0.0,0.032731548,0.0,0.03362348,0.03332672,0.032125033,0.030286366000000002,0.047243614,0.0,0.0,0.0,0.035105012000000005,0.0
0.0,0.0,0.028311249,0.0,0.0,0.03436627,0.030974641,0.030155612000000002,0.028890343,0.0,0.03262373,0.0315369,0.029410109,0.02680844,0.0,0.04670117,0.032355946000000003,0.031285834,0.038012773,0.0,0.0,0.032731548,0.0,0.03362348,0.03332672,0.032125033,0.030286366000000002,0.047243614,0.0,0.0,0.0,0.035105012000000005,0.0,0.0
0.035105012000000005,0.028311249,0.0,0.0,0.03436627,0.030974641,0.030155612000000002,0.028890343,0.0,0.03262373,0.0315369,0.029410109,0.02680844,0.0,0.04670117,0.032355946000000003,0.031285834,0.038012773,0.0,0.0,0.032731548,0.0,0.03362348,0.03332672,0.032125033,0.030286366000000002,0.047243614,0.0,0.0,0.0,0.0,0.0,0.0,0.0
0.0,0.0,0.0,0.03436627,0.030974641,0.030155612000000002,0.028890343,0.0,0.03262373,0.0315369,0.029410109,0.02680844,0.0,0.04670117,0.032355946000000003,0.031285834,0.038012773,0.0,0.0,0.032731548,0.0,0.03362348,0.03332672,0.032125033,0.030286366000000002,0.047243614,0.0,0.0,0.0,0.0,0.035105012000000005,0.0,0.0,0.0
0.0,0.0,0.03436627,0.030974641,0.030155612000000002,0.028890343,0.0,0.03262373,0.0315369,0.029410109,0.02680844,0.0,0.04670117,0.032355946000000003,0.031285834,0.038012773,0.0,0.0,0.032731548,0.0,0.03362348,0.03332672,0.032125033,0.030286366000000002,0.047243614,0.0,0.0,0.0,0.0,0.035105012000000005,0.0,0.0,0.0,0.032211367000000005
0.0,0.03436627,0.030974641,0.030155612000000002,0.028890343,0.0,0.03262373,0.0315369,0.029410109,0.02680844,0.0,0.04670117,0.032355946000000003,0.031285834,0.038012773,0.0,0.0,0.032731548,0.0,0.03362348,0.03332672,0.032125033,0.030286366000000002,0.047243614,0.0,0.0,0.0,0.0,0.035105012000000005,0.0,0.0,0.0,0.032211367000000005,0.0
0.0,0.030974641,0.030155612000000002,0.028890343,0.0,0.03262373,0.0315369,0.029410109,0.02680844,0.0,0.04670117,0.032355946000000003,0.031285834,0.038012773,0.0,0.0,0.032731548,0.0,0.03362348,0.03332672,0.032125033,0.030286366000000002,0.047243614,0.0,0.0,0.0,0.0,0.035105012000000005,0.0,0.0,0.0,0.032211367000000005,0.0,0.03520709
0.032211367000000005,0.030155612000000002,0.028890343,0.0,0.03262373,0.0315369,0.029410109,0.02680844,0.0,0.04670117,0.032355946000000003,0.031285834,0.038012773,0.0,0.0,0.032731548,0.0,0.03362348,0.03332672,0.032125033,0.030286366000000002,0.047243614,0.0,0.0,0.0,0.0,0.035105012000000005,0.0,0.0,0.0,0.0,0.0,0.03520709,0.03236502
