52.508251,4.49875125,0.0
52.508251,4.53346975,0.0
52.508251,4.56818825,3416.6052999999993
52.508251,4.60290675,3416.6052999999993
52.508251,4.63762525,3126.1009999999997
52.508251,4.6723437500000005,3126.1009999999997
52.508251,4.70706225,3358.1786
52.508251,4.74178075,3358.1786
52.48645500000001,4.49875125,0.0
52.48645500000001,4.53346975,0.0
52.48645500000001,4.56818825,0.0
52.48645500000001,4.60290675,3126.1009999999997
52.48645500000001,4.63762525,3126.1009999999997
52.48645500000001,4.6723437500000005,3126.1009999999997
52.48645500000001,4.70706225,3358.1786
52.48645500000001,4.74178075,3358.1786
52.464659,4.49875125,0.0
52.464659,4.53346975,0.0
52.464659,4.56818825,0.0
52.464659,4.60290675,3126.1009999999997
52.464659,4.63762525,3126.1009999999997
52.464659,4.6723437500000005,3359.9444
52.464659,4.70706225,3273.1548
52.464659,4.74178075,3273.1548
52.442863,4.49875125,0.0
52.442863,4.53346975,0.0
52.442863,4.56818825,3507.666
52.442863,4.60290675,3359.9444
52.442863,4.63762525,3359.9444
52.442863,4.6723437500000005,3359.9444
52.442863,4.70706225,3359.9444
52.442863,4.74178075,3273.1548
52.421067,4.49875125,3507.666
52.421067,4.53346975,3507.666
52.421067,4.56818825,3507.666
52.421067,4.60290675,3507.666
52.421067,4.63762525,3359.9444
52.421067,4.6723437500000005,3359.9444
52.421067,4.70706225,3197.7884
52.421067,4.74178075,3182.186
52.399271,4.49875125,0.0
52.399271,4.53346975,3507.666
52.399271,4.56818825,3507.666
52.399271,4.60290675,3755.2703
52.399271,4.63762525,3197.7884
52.399271,4.6723437500000005,3197.7884
52.399271,4.70706225,3197.7884
52.399271,4.74178075,0.0
