date,latitude,longitude,value
2020-06-01,52.421067,4.74178075,0.0
2020-06-02,52.421067,4.74178075,0.035020147
2020-06-03,52.421067,4.74178075,0.0
2020-06-04,52.421067,4.74178075,0.026813362
2020-06-05,52.421067,4.74178075,0.0
2020-06-06,52.421067,4.74178075,0.0
2020-06-07,52.421067,4.74178075,0.0
2020-06-08,52.421067,4.74178075,0.0
2020-06-09,52.421067,4.74178075,0.0
2020-06-10,52.421067,4.74178075,0.0
2020-06-11,52.421067,4.74178075,0.030219205
2020-06-12,52.421067,4.74178075,0.031799234
2020-06-13,52.421067,4.74178075,0.031189937
2020-06-14,52.421067,4.74178075,0.0
2020-06-15,52.421067,4.74178075,0.0
2020-06-16,52.421067,4.74178075,0.0
2020-06-17,52.421067,4.74178075,0.031380504
2020-06-18,52.421067,4.74178075,0.02561089
2020-06-19,52.421067,4.74178075,0.028941821
2020-06-20,52.421067,4.74178075,0.024754876
2020-06-21,52.421067,4.74178075,0.0
2020-06-22,52.421067,4.74178075,0.03232714
2020-06-23,52.421067,4.74178075,0.031455528
2020-06-24,52.421067,4.74178075,0.030243887
2020-06-25,52.421067,4.74178075,0.029612036
2020-06-26,52.421067,4.74178075,0.0
2020-06-27,52.421067,4.74178075,0.030873857
2020-06-28,52.421067,4.74178075,0.026782833
2020-06-29,52.421067,4.74178075,0.0
2020-06-30,52.421067,4.74178075,0.0
2020-07-01,52.421067,4.74178075,0.029468426
2020-07-02,52.421067,4.74178075,0.026139569
2020-07-03,52.421067,4.74178075,0.026587563
2020-07-04,52.421067,4.74178075,0.0
2020-07-05,52.421067,4.74178075,0.029271537
2020-07-06,52.421067,4.74178075,0.0
2020-07-07,52.421067,4.74178075,0.028128646
2020-07-08,52.421067,4.74178075,0.0
2020-07-09,52.421067,4.74178075,0.0
2020-07-10,52.421067,4.74178075,0.027199475
2020-07-11,52.421067,4.74178075,0.026424639
2020-07-12,52.421067,4.74178075,0.030854592
2020-07-13,52.421067,4.74178075,0.031758003
2020-07-14,52.421067,4.74178075,0.028667018
2020-07-15,52.421067,4.74178075,0.029905254
2020-07-16,52.421067,4.74178075,0.0
2020-07-17,52.421067,4.74178075,0.030435007000000007
2020-07-18,52.421067,4.74178075,0.0
2020-07-19,52.421067,4.74178075,0.0
2020-07-20,52.421067,4.74178075,0.025365628
2020-07-21,52.421067,4.74178075,0.030027844
2020-07-22,52.421067,4.74178075,0.0
2020-07-23,52.421067,4.74178075,0.026571184
2020-07-24,52.421067,4.74178075,0.02613773
2020-07-25,52.421067,4.74178075,0.0
2020-07-26,52.421067,4.74178075,0.030774666000000006
2020-07-27,52.421067,4.74178075,0.0
2020-07-28,52.421067,4.74178075,0.02792981
2020-07-29,52.421067,4.74178075,0.032046452
2020-07-30,52.421067,4.74178075,0.027764954
2020-07-31,52.421067,4.74178075,0.030638514
2020-08-02,52.421067,4.74178075,0.03695634
2020-08-03,52.421067,4.74178075,0.0
2020-08-04,52.421067,4.74178075,0.027673487000000004
2020-08-05,52.421067,4.74178075,0.023236196
2020-08-06,52.421067,4.74178075,0.031096505
2020-08-07,52.421067,4.74178075,0.02377165
2020-08-08,52.421067,4.74178075,0.0
2020-08-09,52.421067,4.74178075,0.030402642
2020-08-10,52.421067,4.74178075,0.03349605
2020-08-11,52.421067,4.74178075,0.033182178
2020-08-12,52.421067,4.74178075,0.034543466
2020-08-13,52.421067,4.74178075,0.0
2020-08-14,52.421067,4.74178075,0.033285294
2020-08-15,52.421067,4.74178075,0.031801384
2020-08-16,52.421067,4.74178075,0.02923092
2020-08-17,52.421067,4.74178075,0.0
2020-08-18,52.421067,4.74178075,0.031578284
2020-08-19,52.421067,4.74178075,0.028873455
2020-08-20,52.421067,4.74178075,0.0
2020-08-21,52.421067,4.74178075,0.028580887000000006
2020-08-22,52.421067,4.74178075,0.029640475
2020-08-23,52.421067,4.74178075,0.028734816
2020-08-24,52.421067,4.74178075,0.02801198
2020-08-25,52.421067,4.74178075,0.027329361
2020-08-26,52.421067,4.74178075,0.030162783
2020-08-27,52.421067,4.74178075,0.0
2020-08-28,52.421067,4.74178075,0.0
2020-08-29,52.421067,4.74178075,0.029210947
2020-08-30,52.421067,4.74178075,0.0
2020-08-31,52.421067,4.74178075,0.0
2020-09-01,52.421067,4.74178075,0.03436627
2020-09-02,52.421067,4.74178075,0.031042708
2020-09-03,52.421067,4.74178075,0.0
2020-09-04,52.421067,4.74178075,0.03239886
2020-09-05,52.421067,4.74178075,0.0
2020-09-06,52.421067,4.74178075,0.03474495
2020-09-07,52.421067,4.74178075,0.031185526
2020-09-08,52.421067,4.74178075,0.029729046
2020-09-09,52.421067,4.74178075,0.026902061
2020-09-10,52.421067,4.74178075,0.0
2020-09-11,52.421067,4.74178075,0.0
2020-09-12,52.421067,4.74178075,0.032355946000000003
2020-09-13,52.421067,4.74178075,0.03270025
2020-09-15,52.421067,4.74178075,0.038012773
2020-09-16,52.421067,4.74178075,0.0
2020-09-17,52.421067,4.74178075,0.0
2020-09-18,52.421067,4.74178075,0.03182186
2020-09-19,52.421067,4.74178075,0.0
2020-09-20,52.421067,4.74178075,0.03362348
2020-09-21,52.421067,4.74178075,0.03332672
2020-09-22,52.421067,4.74178075,0.032125033
2020-09-23,52.421067,4.74178075,0.030286366
2020-09-24,52.421067,4.74178075,0.046996973
2020-09-25,52.421067,4.74178075,0.0
2020-09-26,52.421067,4.74178075,0.0
2020-09-27,52.421067,4.74178075,0.0
2020-09-28,52.421067,4.74178075,0.0
2020-09-29,52.421067,4.74178075,0.035105012000000005
2020-09-30,52.421067,4.74178075,0.0
2020-10-01,52.421067,4.74178075,0.0
2020-10-02,52.421067,4.74178075,0.0
2020-10-03,52.421067,4.74178075,0.0
2020-10-04,52.421067,4.74178075,0.03159049
2020-10-05,52.421067,4.74178075,0.0
2020-10-06,52.421067,4.74178075,0.03388498
2020-10-07,52.421067,4.74178075,0.03236502
2020-10-08,52.421067,4.74178075,0.0
