value,value-30,value-29,value-28,value-27,value-26,value-25,value-24,value-23,value-22,value-21,value-20,value-19,value-18,value-17,value-16,value-15,value-14,value-13,value-12,value-11,value-10,value-9,value-8,value-7,value-6,value-5,value-4,value-3,value-2,value-1,Prediction+1,Prediction+2,Prediction+3
0.029468426000000002,0.0,0.03318668,0.0,0.02561854,0.0,0.026721647,0.0,0.0,0.028345943999999998,0.0,0.0,0.031769622000000004,0.029948162,0.0,0.0,0.0,0.03134407,0.023994092,0.029300151,0.02696147,0.0,0.031425714,0.03334301,0.0,0.028335997999999998,0.0,0.028204566,0.027499039,0.0,0.028100494,0.025928347999999997,0.028508184,0.0
0.025928347999999997,0.03318668,0.0,0.02561854,0.0,0.026721647,0.0,0.0,0.028345943999999998,0.0,0.0,0.031769622000000004,0.029948162,0.0,0.0,0.0,0.03134407,0.023994092,0.029300151,0.02696147,0.0,0.031425714,0.03334301,0.0,0.028335997999999998,0.0,0.028204566,0.027499039,0.0,0.028100494,0.029468426000000002,0.028508184,0.0,0.028300472000000007
0.028508184,0.0,0.02561854,0.0,0.026721647,0.0,0.0,0.028345943999999998,0.0,0.0,0.031769622000000004,0.029948162,0.0,0.0,0.0,0.03134407,0.023994092,0.029300151,0.02696147,0.0,0.031425714,0.03334301,0.0,0.028335997999999998,0.0,0.028204566,0.027499039,0.0,0.028100494,0.029468426000000002,0.025928347999999997,0.0,0.028300472000000007,0.0
0.0,0.02561854,0.0,0.026721647,0.0,0.0,0.028345943999999998,0.0,0.0,0.031769622000000004,0.029948162,0.0,0.0,0.0,0.03134407,0.023994092,0.029300151,0.02696147,0.0,0.031425714,0.03334301,0.0,0.028335997999999998,0.0,0.028204566,0.027499039,0.0,0.028100494,0.029468426000000002,0.025928347999999997,0.028508184,0.028300472000000007,0.0,0.027058948
0.028300472000000007,0.0,0.026721647,0.0,0.0,0.028345943999999998,0.0,0.0,0.031769622000000004,0.029948162,0.0,0.0,0.0,0.03134407,0.023994092,0.029300151,0.02696147,0.0,0.031425714,0.03334301,0.0,0.028335997999999998,0.0,0.028204566,0.027499039,0.0,0.028100494,0.029468426000000002,0.025928347999999997,0.028508184,0.0,0.0,0.027058948,0.025763696000000003
0.0,0.026721647,0.0,0.0,0.028345943999999998,0.0,0.0,0.031769622000000004,0.029948162,0.0,0.0,0.0,0.03134407,0.023994092,0.029300151,0.02696147,0.0,0.031425714,0.03334301,0.0,0.028335997999999998,0.0,0.028204566,0.027499039,0.0,0.028100494,0.029468426000000002,0.025928347999999997,0.028508184,0.0,0.028300472000000007,0.027058948,0.025763696000000003,0.0
0.027058948,0.0,0.0,0.028345943999999998,0.0,0.0,0.031769622000000004,0.029948162,0.0,0.0,0.0,0.03134407,0.023994092,0.029300151,0.02696147,0.0,0.031425714,0.03334301,0.0,0.028335997999999998,0.0,0.028204566,0.027499039,0.0,0.028100494,0.029468426000000002,0.025928347999999997,0.028508184,0.0,0.028300472000000007,0.0,0.025763696000000003,0.0,0.026132086000000002
0.025763696000000003,0.0,0.028345943999999998,0.0,0.0,0.031769622000000004,0.029948162,0.0,0.0,0.0,0.03134407,0.023994092,0.029300151,0.02696147,0.0,0.031425714,0.03334301,0.0,0.028335997999999998,0.0,0.028204566,0.027499039,0.0,0.028100494,0.029468426000000002,0.025928347999999997,0.028508184,0.0,0.028300472000000007,0.0,0.027058948,0.0,0.026132086000000002,0.026311196000000002
0.0,0.028345943999999998,0.0,0.0,0.031769622000000004,0.029948162,0.0,0.0,0.0,0.03134407,0.023994092,0.029300151,0.02696147,0.0,0.031425714,0.03334301,0.0,0.028335997999999998,0.0,0.028204566,0.027499039,0.0,0.028100494,0.029468426000000002,0.025928347999999997,0.028508184,0.0,0.028300472000000007,0.0,0.027058948,0.025763696000000003,0.026132086000000002,0.026311196000000002,0.031994846
0.026132086000000002,0.0,0.0,0.031769622000000004,0.029948162,0.0,0.0,0.0,0.03134407,0.023994092,0.029300151,0.02696147,0.0,0.031425714,0.03334301,0.0,0.028335997999999998,0.0,0.028204566,0.027499039,0.0,0.028100494,0.029468426000000002,0.025928347999999997,0.028508184,0.0,0.028300472000000007,0.0,0.027058948,0.025763696000000003,0.0,0.026311196000000002,0.031994846,0.034324855
0.026311196000000002,0.0,0.031769622000000004,0.029948162,0.0,0.0,0.0,0.03134407,0.023994092,0.029300151,0.02696147,0.0,0.031425714,0.03334301,0.0,0.028335997999999998,0.0,0.028204566,0.027499039,0.0,0.028100494,0.029468426000000002,0.025928347999999997,0.028508184,0.0,0.028300472000000007,0.0,0.027058948,0.025763696000000003,0.0,0.026132086000000002,0.031994846,0.034324855,0.02956546
0.031994846,0.031769622000000004,0.029948162,0.0,0.0,0.0,0.03134407,0.023994092,0.029300151,0.02696147,0.0,0.031425714,0.03334301,0.0,0.028335997999999998,0.0,0.028204566,0.027499039,0.0,0.028100494,0.029468426000000002,0.025928347999999997,0.028508184,0.0,0.028300472000000007,0.0,0.027058948,0.025763696000000003,0.0,0.026132086000000002,0.026311196000000002,0.034324855,0.02956546,0.031632967000000005
0.034324855,0.029948162,0.0,0.0,0.0,0.03134407,0.023994092,0.029300151,0.02696147,0.0,0.031425714,0.03334301,0.0,0.028335997999999998,0.0,0.028204566,0.027499039,0.0,0.028100494,0.029468426000000002,0.025928347999999997,0.028508184,0.0,0.028300472000000007,0.0,0.027058948,0.025763696000000003,0.0,0.026132086000000002,0.026311196000000002,0.031994846,0.02956546,0.031632967000000005,0.0
0.02956546,0.0,0.0,0.0,0.03134407,0.023994092,0.029300151,0.02696147,0.0,0.031425714,0.03334301,0.0,0.028335997999999998,0.0,0.028204566,0.027499039,0.0,0.028100494,0.029468426000000002,0.025928347999999997,0.028508184,0.0,0.028300472000000007,0.0,0.027058948,0.025763696000000003,0.0,0.026132086000000002,0.026311196000000002,0.031994846,0.034324855,0.031632967000000005,0.0,0.028173767000000002
0.031632967000000005,0.0,0.0,0.03134407,0.023994092,0.029300151,0.02696147,0.0,0.031425714,0.03334301,0.0,0.028335997999999998,0.0,0.028204566,0.027499039,0.0,0.028100494,0.029468426000000002,0.025928347999999997,0.028508184,0.0,0.028300472000000007,0.0,0.027058948,0.025763696000000003,0.0,0.026132086000000002,0.026311196000000002,0.031994846,0.034324855,0.02956546,0.0,0.028173767000000002,0.0
0.0,0.0,0.03134407,0.023994092,0.029300151,0.02696147,0.0,0.031425714,0.03334301,0.0,0.028335997999999998,0.0,0.028204566,0.027499039,0.0,0.028100494,0.029468426000000002,0.025928347999999997,0.028508184,0.0,0.028300472000000007,0.0,0.027058948,0.025763696000000003,0.0,0.026132086000000002,0.026311196000000002,0.031994846,0.034324855,0.02956546,0.031632967000000005,0.028173767000000002,0.0,0.0
0.028173767000000002,0.03134407,0.023994092,0.029300151,0.02696147,0.0,0.031425714,0.03334301,0.0,0.028335997999999998,0.0,0.028204566,0.027499039,0.0,0.028100494,0.029468426000000002,0.025928347999999997,0.028508184,0.0,0.028300472000000007,0.0,0.027058948,0.025763696000000003,0.0,0.026132086000000002,0.026311196000000002,0.031994846,0.034324855,0.02956546,0.031632967000000005,0.0,0.0,0.0,0.02491781
0.0,0.023994092,0.029300151,0.02696147,0.0,0.031425714,0.03334301,0.0,0.028335997999999998,0.0,0.028204566,0.027499039,0.0,0.028100494,0.029468426000000002,0.025928347999999997,0.028508184,0.0,0.028300472000000007,0.0,0.027058948,0.025763696000000003,0.0,0.026132086000000002,0.026311196000000002,0.031994846,0.034324855,0.02956546,0.031632967000000005,0.0,0.028173767000000002,0.0,0.02491781,0.028061872
0.0,0.029300151,0.02696147,0.0,0.031425714,0.03334301,0.0,0.028335997999999998,0.0,0.028204566,0.027499039,0.0,0.028100494,0.029468426000000002,0.025928347999999997,0.028508184,0.0,0.028300472000000007,0.0,0.027058948,0.025763696000000003,0.0,0.026132086000000002,0.026311196000000002,0.031994846,0.034324855,0.02956546,0.031632967000000005,0.0,0.028173767000000002,0.0,0.02491781,0.028061872,0.0
0.02491781,0.02696147,0.0,0.031425714,0.03334301,0.0,0.028335997999999998,0.0,0.028204566,0.027499039,0.0,0.028100494,0.029468426000000002,0.025928347999999997,0.028508184,0.0,0.028300472000000007,0.0,0.027058948,0.025763696000000003,0.0,0.026132086000000002,0.026311196000000002,0.031994846,0.034324855,0.02956546,0.031632967000000005,0.0,0.028173767000000002,0.0,0.0,0.028061872,0.0,0.026571183999999998
0.028061872,0.0,0.031425714,0.03334301,0.0,0.028335997999999998,0.0,0.028204566,0.027499039,0.0,0.028100494,0.029468426000000002,0.025928347999999997,0.028508184,0.0,0.028300472000000007,0.0,0.027058948,0.025763696000000003,0.0,0.026132086000000002,0.026311196000000002,0.031994846,0.034324855,0.02956546,0.031632967000000005,0.0,0.028173767000000002,0.0,0.0,0.02491781,0.0,0.026571183999999998,0.0
0.0,0.031425714,0.03334301,0.0,0.028335997999999998,0.0,0.028204566,0.027499039,0.0,0.028100494,0.029468426000000002,0.025928347999999997,0.028508184,0.0,0.028300472000000007,0.0,0.027058948,0.025763696000000003,0.0,0.026132086000000002,0.026311196000000002,0.031994846,0.034324855,0.02956546,0.031632967000000005,0.0,0.028173767000000002,0.0,0.0,0.02491781,0.028061872,0.026571183999999998,0.0,0.0
0.026571183999999998,0.03334301,0.0,0.028335997999999998,0.0,0.028204566,0.027499039,0.0,0.028100494,0.029468426000000002,0.025928347999999997,0.028508184,0.0,0.028300472000000007,0.0,0.027058948,0.025763696000000003,0.0,0.026132086000000002,0.026311196000000002,0.031994846,0.034324855,0.02956546,0.031632967000000005,0.0,0.028173767000000002,0.0,0.0,0.02491781,0.028061872,0.0,0.0,0.0,0.030774666000000006
0.0,0.0,0.028335997999999998,0.0,0.028204566,0.027499039,0.0,0.028100494,0.029468426000000002,0.025928347999999997,0.028508184,0.0,0.028300472000000007,0.0,0.027058948,0.025763696000000003,0.0,0.026132086000000002,0.026311196000000002,0.031994846,0.034324855,0.02956546,0.031632967000000005,0.0,0.028173767000000002,0.0,0.0,0.02491781,0.028061872,0.0,0.026571183999999998,0.0,0.030774666000000006,0.0
0.0,0.028335997999999998,0.0,0.028204566,0.027499039,0.0,0.028100494,0.029468426000000002,0.025928347999999997,0.028508184,0.0,0.028300472000000007,0.0,0.027058948,0.025763696000000003,0.0,0.026132086000000002,0.026311196000000002,0.031994846,0.034324855,0.02956546,0.031632967000000005,0.0,0.028173767000000002,0.0,0.0,0.02491781,0.028061872,0.0,0.026571183999999998,0.0,0.030774666000000006,0.0,0.02792981
0.030774666000000006,0.0,0.028204566,0.027499039,0.0,0.028100494,0.029468426000000002,0.025928347999999997,0.028508184,0.0,0.028300472000000007,0.0,0.027058948,0.025763696000000003,0.0,0.026132086000000002,0.026311196000000002,0.031994846,0.034324855,0.02956546,0.031632967000000005,0.0,0.028173767000000002,0.0,0.0,0.02491781,0.028061872,0.0,0.026571183999999998,0.0,0.0,0.0,0.02792981,0.03214978
0.0,0.028204566,0.027499039,0.0,0.028100494,0.029468426000000002,0.025928347999999997,0.028508184,0.0,0.028300472000000007,0.0,0.027058948,0.025763696000000003,0.0,0.026132086000000002,0.026311196000000002,0.031994846,0.034324855,0.02956546,0.031632967000000005,0.0,0.028173767000000002,0.0,0.0,0.02491781,0.028061872,0.0,0.026571183999999998,0.0,0.0,0.030774666000000006,0.02792981,0.03214978,0.030025162
0.02792981,0.027499039,0.0,0.028100494,0.029468426000000002,0.025928347999999997,0.028508184,0.0,0.028300472000000007,0.0,0.027058948,0.025763696000000003,0.0,0.026132086000000002,0.026311196000000002,0.031994846,0.034324855,0.02956546,0.031632967000000005,0.0,0.028173767000000002,0.0,0.0,0.02491781,0.028061872,0.0,0.026571183999999998,0.0,0.0,0.030774666000000006,0.0,0.03214978,0.030025162,0.030775767000000002
0.03214978,0.0,0.028100494,0.029468426000000002,0.025928347999999997,0.028508184,0.0,0.028300472000000007,0.0,0.027058948,0.025763696000000003,0.0,0.026132086000000002,0.026311196000000002,0.031994846,0.034324855,0.02956546,0.031632967000000005,0.0,0.028173767000000002,0.0,0.0,0.02491781,0.028061872,0.0,0.026571183999999998,0.0,0.0,0.030774666000000006,0.0,0.02792981,0.030025162,0.030775767000000002,0.03683098
0.030025162,0.028100494,0.029468426000000002,0.025928347999999997,0.028508184,0.0,0.028300472000000007,0.0,0.027058948,0.025763696000000003,0.0,0.026132086000000002,0.026311196000000002,0.031994846,0.034324855,0.02956546,0.031632967000000005,0.0,0.028173767000000002,0.0,0.0,0.02491781,0.028061872,0.0,0.026571183999999998,0.0,0.0,0.030774666000000006,0.0,0.02792981,0.03214978,0.030775767000000002,0.03683098,0.0
0.030775767000000002,0.029468426000000002,0.025928347999999997,0.028508184,0.0,0.028300472000000007,0.0,0.027058948,0.025763696000000003,0.0,0.026132086000000002,0.026311196000000002,0.031994846,0.034324855,0.02956546,0.031632967000000005,0.0,0.028173767000000002,0.0,0.0,0.02491781,0.028061872,0.0,0.026571183999999998,0.0,0.0,0.030774666000000006,0.0,0.02792981,0.03214978,0.030025162,0.03683098,0.0,0.028728886000000002
0.03683098,0.025928347999999997,0.028508184,0.0,0.028300472000000007,0.0,0.027058948,0.025763696000000003,0.0,0.026132086000000002,0.026311196000000002,0.031994846,0.034324855,0.02956546,0.031632967000000005,0.0,0.028173767000000002,0.0,0.0,0.02491781,0.028061872,0.0,0.026571183999999998,0.0,0.0,0.030774666000000006,0.0,0.02792981,0.03214978,0.030025162,0.030775767000000002,0.0,0.028728886000000002,0.023236196
0.0,0.028508184,0.0,0.028300472000000007,0.0,0.027058948,0.025763696000000003,0.0,0.026132086000000002,0.026311196000000002,0.031994846,0.034324855,0.02956546,0.031632967000000005,0.0,0.028173767000000002,0.0,0.0,0.02491781,0.028061872,0.0,0.026571183999999998,0.0,0.0,0.030774666000000006,0.0,0.02792981,0.03214978,0.030025162,0.030775767000000002,0.03683098,0.028728886000000002,0.023236196,0.029142851
0.028728886000000002,0.0,0.028300472000000007,0.0,0.027058948,0.025763696000000003,0.0,0.026132086000000002,0.026311196000000002,0.031994846,0.034324855,0.02956546,0.031632967000000005,0.0,0.028173767000000002,0.0,0.0,0.02491781,0.028061872,0.0,0.026571183999999998,0.0,0.0,0.030774666000000006,0.0,0.02792981,0.03214978,0.030025162,0.030775767000000002,0.03683098,0.0,0.023236196,0.029142851,0.02377165
0.023236196,0.028300472000000007,0.0,0.027058948,0.025763696000000003,0.0,0.026132086000000002,0.026311196000000002,0.031994846,0.034324855,0.02956546,0.031632967000000005,0.0,0.028173767000000002,0.0,0.0,0.02491781,0.028061872,0.0,0.026571183999999998,0.0,0.0,0.030774666000000006,0.0,0.02792981,0.03214978,0.030025162,0.030775767000000002,0.03683098,0.0,0.028728886000000002,0.029142851,0.02377165,0.0
0.029142851,0.0,0.027058948,0.025763696000000003,0.0,0.026132086000000002,0.026311196000000002,0.031994846,0.034324855,0.02956546,0.031632967000000005,0.0,0.028173767000000002,0.0,0.0,0.02491781,0.028061872,0.0,0.026571183999999998,0.0,0.0,0.030774666000000006,0.0,0.02792981,0.03214978,0.030025162,0.030775767000000002,0.03683098,0.0,0.028728886000000002,0.023236196,0.02377165,0.0,0.033062395
0.02377165,0.027058948,0.025763696000000003,0.0,0.026132086000000002,0.026311196000000002,0.031994846,0.034324855,0.02956546,0.031632967000000005,0.0,0.028173767000000002,0.0,0.0,0.02491781,0.028061872,0.0,0.026571183999999998,0.0,0.0,0.030774666000000006,0.0,0.02792981,0.03214978,0.030025162,0.030775767000000002,0.03683098,0.0,0.028728886000000002,0.023236196,0.029142851,0.0,0.033062395,0.031192083
0.0,0.025763696000000003,0.0,0.026132086000000002,0.026311196000000002,0.031994846,0.034324855,0.02956546,0.031632967000000005,0.0,0.028173767000000002,0.0,0.0,0.02491781,0.028061872,0.0,0.026571183999999998,0.0,0.0,0.030774666000000006,0.0,0.02792981,0.03214978,0.030025162,0.030775767000000002,0.03683098,0.0,0.028728886000000002,0.023236196,0.029142851,0.02377165,0.033062395,0.031192083,0.031946175
0.033062395,0.0,0.026132086000000002,0.026311196000000002,0.031994846,0.034324855,0.02956546,0.031632967000000005,0.0,0.028173767000000002,0.0,0.0,0.02491781,0.028061872,0.0,0.026571183999999998,0.0,0.0,0.030774666000000006,0.0,0.02792981,0.03214978,0.030025162,0.030775767000000002,0.03683098,0.0,0.028728886000000002,0.023236196,0.029142851,0.02377165,0.0,0.031192083,0.031946175,0.026851278
0.031192083,0.026132086000000002,0.026311196000000002,0.031994846,0.034324855,0.02956546,0.031632967000000005,0.0,0.028173767000000002,0.0,0.0,0.02491781,0.028061872,0.0,0.026571183999999998,0.0,0.0,0.030774666000000006,0.0,0.02792981,0.03214978,0.030025162,0.030775767000000002,0.03683098,0.0,0.028728886000000002,0.023236196,0.029142851,0.02377165,0.0,0.033062395,0.031946175,0.026851278,0.0
0.031946175,0.026311196000000002,0.031994846,0.034324855,0.02956546,0.031632967000000005,0.0,0.028173767000000002,0.0,0.0,0.02491781,0.028061872,0.0,0.026571183999999998,0.0,0.0,0.030774666000000006,0.0,0.02792981,0.03214978,0.030025162,0.030775767000000002,0.03683098,0.0,0.028728886000000002,0.023236196,0.029142851,0.02377165,0.0,0.033062395,0.031192083,0.026851278,0.0,0.032750193
0.026851278,0.031994846,0.034324855,0.02956546,0.031632967000000005,0.0,0.028173767000000002,0.0,0.0,0.02491781,0.028061872,0.0,0.026571183999999998,0.0,0.0,0.030774666000000006,0.0,0.02792981,0.03214978,0.030025162,0.030775767000000002,0.03683098,0.0,0.028728886000000002,0.023236196,0.029142851,0.02377165,0.0,0.033062395,0.031192083,0.031946175,0.0,0.032750193,0.031801384
0.0,0.034324855,0.02956546,0.031632967000000005,0.0,0.028173767000000002,0.0,0.0,0.02491781,0.028061872,0.0,0.026571183999999998,0.0,0.0,0.030774666000000006,0.0,0.02792981,0.03214978,0.030025162,0.030775767000000002,0.03683098,0.0,0.028728886000000002,0.023236196,0.029142851,0.02377165,0.0,0.033062395,0.031192083,0.031946175,0.026851278,0.032750193,0.031801384,0.033235006
0.032750193,0.02956546,0.031632967000000005,0.0,0.028173767000000002,0.0,0.0,0.02491781,0.028061872,0.0,0.026571183999999998,0.0,0.0,0.030774666000000006,0.0,0.02792981,0.03214978,0.030025162,0.030775767000000002,0.03683098,0.0,0.028728886000000002,0.023236196,0.029142851,0.02377165,0.0,0.033062395,0.031192083,0.031946175,0.026851278,0.0,0.031801384,0.033235006,0.0
0.031801384,0.031632967000000005,0.0,0.028173767000000002,0.0,0.0,0.02491781,0.028061872,0.0,0.026571183999999998,0.0,0.0,0.030774666000000006,0.0,0.02792981,0.03214978,0.030025162,0.030775767000000002,0.03683098,0.0,0.028728886000000002,0.023236196,0.029142851,0.02377165,0.0,0.033062395,0.031192083,0.031946175,0.026851278,0.0,0.032750193,0.033235006,0.0,0.0
0.033235006,0.0,0.028173767000000002,0.0,0.0,0.02491781,0.028061872,0.0,0.026571183999999998,0.0,0.0,0.030774666000000006,0.0,0.02792981,0.03214978,0.030025162,0.030775767000000002,0.03683098,0.0,0.028728886000000002,0.023236196,0.029142851,0.02377165,0.0,0.033062395,0.031192083,0.031946175,0.026851278,0.0,0.032750193,0.031801384,0.0,0.0,0.028873455
0.0,0.028173767000000002,0.0,0.0,0.02491781,0.028061872,0.0,0.026571183999999998,0.0,0.0,0.030774666000000006,0.0,0.02792981,0.03214978,0.030025162,0.030775767000000002,0.03683098,0.0,0.028728886000000002,0.023236196,0.029142851,0.02377165,0.0,0.033062395,0.031192083,0.031946175,0.026851278,0.0,0.032750193,0.031801384,0.033235006,0.0,0.028873455,0.0
0.0,0.0,0.0,0.02491781,0.028061872,0.0,0.026571183999999998,0.0,0.0,0.030774666000000006,0.0,0.02792981,0.03214978,0.030025162,0.030775767000000002,0.03683098,0.0,0.028728886000000002,0.023236196,0.029142851,0.02377165,0.0,0.033062395,0.031192083,0.031946175,0.026851278,0.0,0.032750193,0.031801384,0.033235006,0.0,0.028873455,0.0,0.029618837000000002
0.028873455,0.0,0.02491781,0.028061872,0.0,0.026571183999999998,0.0,0.0,0.030774666000000006,0.0,0.02792981,0.03214978,0.030025162,0.030775767000000002,0.03683098,0.0,0.028728886000000002,0.023236196,0.029142851,0.02377165,0.0,0.033062395,0.031192083,0.031946175,0.026851278,0.0,0.032750193,0.031801384,0.033235006,0.0,0.0,0.0,0.029618837000000002,0.029289803
0.0,0.02491781,0.028061872,0.0,0.026571183999999998,0.0,0.0,0.030774666000000006,0.0,0.02792981,0.03214978,0.030025162,0.030775767000000002,0.03683098,0.0,0.028728886000000002,0.023236196,0.029142851,0.02377165,0.0,0.033062395,0.031192083,0.031946175,0.026851278,0.0,0.032750193,0.031801384,0.033235006,0.0,0.0,0.028873455,0.029618837000000002,0.029289803,0.02851417
0.029618837000000002,0.028061872,0.0,0.026571183999999998,0.0,0.0,0.030774666000000006,0.0,0.02792981,0.03214978,0.030025162,0.030775767000000002,0.03683098,0.0,0.028728886000000002,0.023236196,0.029142851,0.02377165,0.0,0.033062395,0.031192083,0.031946175,0.026851278,0.0,0.032750193,0.031801384,0.033235006,0.0,0.0,0.028873455,0.0,0.029289803,0.02851417,0.027326051
0.029289803,0.0,0.026571183999999998,0.0,0.0,0.030774666000000006,0.0,0.02792981,0.03214978,0.030025162,0.030775767000000002,0.03683098,0.0,0.028728886000000002,0.023236196,0.029142851,0.02377165,0.0,0.033062395,0.031192083,0.031946175,0.026851278,0.0,0.032750193,0.031801384,0.033235006,0.0,0.0,0.028873455,0.0,0.029618837000000002,0.02851417,0.027326051,0.028638514
0.02851417,0.026571183999999998,0.0,0.0,0.030774666000000006,0.0,0.02792981,0.03214978,0.030025162,0.030775767000000002,0.03683098,0.0,0.028728886000000002,0.023236196,0.029142851,0.02377165,0.0,0.033062395,0.031192083,0.031946175,0.026851278,0.0,0.032750193,0.031801384,0.033235006,0.0,0.0,0.028873455,0.0,0.029618837000000002,0.029289803,0.027326051,0.028638514,0.031474142999999996
0.027326051,0.0,0.0,0.030774666000000006,0.0,0.02792981,0.03214978,0.030025162,0.030775767000000002,0.03683098,0.0,0.028728886000000002,0.023236196,0.029142851,0.02377165,0.0,0.033062395,0.031192083,0.031946175,0.026851278,0.0,0.032750193,0.031801384,0.033235006,0.0,0.0,0.028873455,0.0,0.029618837000000002,0.029289803,0.02851417,0.028638514,0.031474142999999996,0.0
0.028638514,0.0,0.030774666000000006,0.0,0.02792981,0.03214978,0.030025162,0.030775767000000002,0.03683098,0.0,0.028728886000000002,0.023236196,0.029142851,0.02377165,0.0,0.033062395,0.031192083,0.031946175,0.026851278,0.0,0.032750193,0.031801384,0.033235006,0.0,0.0,0.028873455,0.0,0.029618837000000002,0.029289803,0.02851417,0.027326051,0.031474142999999996,0.0,0.0
0.031474142999999996,0.030774666000000006,0.0,0.02792981,0.03214978,0.030025162,0.030775767000000002,0.03683098,0.0,0.028728886000000002,0.023236196,0.029142851,0.02377165,0.0,0.033062395,0.031192083,0.031946175,0.026851278,0.0,0.032750193,0.031801384,0.033235006,0.0,0.0,0.028873455,0.0,0.029618837000000002,0.029289803,0.02851417,0.027326051,0.028638514,0.0,0.0,0.028311249
0.0,0.0,0.02792981,0.03214978,0.030025162,0.030775767000000002,0.03683098,0.0,0.028728886000000002,0.023236196,0.029142851,0.02377165,0.0,0.033062395,0.031192083,0.031946175,0.026851278,0.0,0.032750193,0.031801384,0.033235006,0.0,0.0,0.028873455,0.0,0.029618837000000002,0.029289803,0.02851417,0.027326051,0.028638514,0.031474142999999996,0.0,0.028311249,0.0
0.0,0.02792981,0.03214978,0.030025162,0.030775767000000002,0.03683098,0.0,0.028728886000000002,0.023236196,0.029142851,0.02377165,0.0,0.033062395,0.031192083,0.031946175,0.026851278,0.0,0.032750193,0.031801384,0.033235006,0.0,0.0,0.028873455,0.0,0.029618837000000002,0.029289803,0.02851417,0.027326051,0.028638514,0.031474142999999996,0.0,0.028311249,0.0,0.0
0.028311249,0.03214978,0.030025162,0.030775767000000002,0.03683098,0.0,0.028728886000000002,0.023236196,0.029142851,0.02377165,0.0,0.033062395,0.031192083,0.031946175,0.026851278,0.0,0.032750193,0.031801384,0.033235006,0.0,0.0,0.028873455,0.0,0.029618837000000002,0.029289803,0.02851417,0.027326051,0.028638514,0.031474142999999996,0.0,0.0,0.0,0.0,0.031827233999999996
0.0,0.030025162,0.030775767000000002,0.03683098,0.0,0.028728886000000002,0.023236196,0.029142851,0.02377165,0.0,0.033062395,0.031192083,0.031946175,0.026851278,0.0,0.032750193,0.031801384,0.033235006,0.0,0.0,0.028873455,0.0,0.029618837000000002,0.029289803,0.02851417,0.027326051,0.028638514,0.031474142999999996,0.0,0.0,0.028311249,0.0,0.031827233999999996,0.030974641
0.0,0.030775767000000002,0.03683098,0.0,0.028728886000000002,0.023236196,0.029142851,0.02377165,0.0,0.033062395,0.031192083,0.031946175,0.026851278,0.0,0.032750193,0.031801384,0.033235006,0.0,0.0,0.028873455,0.0,0.029618837000000002,0.029289803,0.02851417,0.027326051,0.028638514,0.031474142999999996,0.0,0.0,0.028311249,0.0,0.031827233999999996,0.030974641,0.030155612000000002
0.031827233999999996,0.03683098,0.0,0.028728886000000002,0.023236196,0.029142851,0.02377165,0.0,0.033062395,0.031192083,0.031946175,0.026851278,0.0,0.032750193,0.031801384,0.033235006,0.0,0.0,0.028873455,0.0,0.029618837000000002,0.029289803,0.02851417,0.027326051,0.028638514,0.031474142999999996,0.0,0.0,0.028311249,0.0,0.0,0.030974641,0.030155612000000002,0.028890343
0.030974641,0.0,0.028728886000000002,0.023236196,0.029142851,0.02377165,0.0,0.033062395,0.031192083,0.031946175,0.026851278,0.0,0.032750193,0.031801384,0.033235006,0.0,0.0,0.028873455,0.0,0.029618837000000002,0.029289803,0.02851417,0.027326051,0.028638514,0.031474142999999996,0.0,0.0,0.028311249,0.0,0.0,0.031827233999999996,0.030155612000000002,0.028890343,0.0
0.030155612000000002,0.028728886000000002,0.023236196,0.029142851,0.02377165,0.0,0.033062395,0.031192083,0.031946175,0.026851278,0.0,0.032750193,0.031801384,0.033235006,0.0,0.0,0.028873455,0.0,0.029618837000000002,0.029289803,0.02851417,0.027326051,0.028638514,0.031474142999999996,0.0,0.0,0.028311249,0.0,0.0,0.031827233999999996,0.030974641,0.028890343,0.0,0.03262373
0.028890343,0.023236196,0.029142851,0.02377165,0.0,0.033062395,0.031192083,0.031946175,0.026851278,0.0,0.032750193,0.031801384,0.033235006,0.0,0.0,0.028873455,0.0,0.029618837000000002,0.029289803,0.02851417,0.027326051,0.028638514,0.031474142999999996,0.0,0.0,0.028311249,0.0,0.0,0.031827233999999996,0.030974641,0.030155612000000002,0.0,0.03262373,0.0315369
0.0,0.029142851,0.02377165,0.0,0.033062395,0.031192083,0.031946175,0.026851278,0.0,0.032750193,0.031801384,0.033235006,0.0,0.0,0.028873455,0.0,0.029618837000000002,0.029289803,0.02851417,0.027326051,0.028638514,0.031474142999999996,0.0,0.0,0.028311249,0.0,0.0,0.031827233999999996,0.030974641,0.030155612000000002,0.028890343,0.03262373,0.0315369,0.027139481
0.03262373,0.02377165,0.0,0.033062395,0.031192083,0.031946175,0.026851278,0.0,0.032750193,0.031801384,0.033235006,0.0,0.0,0.028873455,0.0,0.029618837000000002,0.029289803,0.02851417,0.027326051,0.028638514,0.031474142999999996,0.0,0.0,0.028311249,0.0,0.0,0.031827233999999996,0.030974641,0.030155612000000002,0.028890343,0.0,0.0315369,0.027139481,0.02680844
0.0315369,0.0,0.033062395,0.031192083,0.031946175,0.026851278,0.0,0.032750193,0.031801384,0.033235006,0.0,0.0,0.028873455,0.0,0.029618837000000002,0.029289803,0.02851417,0.027326051,0.028638514,0.031474142999999996,0.0,0.0,0.028311249,0.0,0.0,0.031827233999999996,0.030974641,0.030155612000000002,0.028890343,0.0,0.03262373,0.027139481,0.02680844,0.0
0.027139481,0.033062395,0.031192083,0.031946175,0.026851278,0.0,0.032750193,0.031801384,0.033235006,0.0,0.0,0.028873455,0.0,0.029618837000000002,0.029289803,0.02851417,0.027326051,0.028638514,0.031474142999999996,0.0,0.0,0.028311249,0.0,0.0,0.031827233999999996,0.030974641,0.030155612000000002,0.028890343,0.0,0.03262373,0.0315369,0.02680844,0.0,0.04670117
0.02680844,0.031192083,0.031946175,0.026851278,0.0,0.032750193,0.031801384,0.033235006,0.0,0.0,0.028873455,0.0,0.029618837000000002,0.029289803,0.02851417,0.027326051,0.028638514,0.031474142999999996,0.0,0.0,0.028311249,0.0,0.0,0.031827233999999996,0.030974641,0.030155612000000002,0.028890343,0.0,0.03262373,0.0315369,0.027139481,0.0,0.04670117,0.034534622
0.0,0.031946175,0.026851278,0.0,0.032750193,0.031801384,0.033235006,0.0,0.0,0.028873455,0.0,0.029618837000000002,0.029289803,0.02851417,0.027326051,0.028638514,0.031474142999999996,0.0,0.0,0.028311249,0.0,0.0,0.031827233999999996,0.030974641,0.030155612000000002,0.028890343,0.0,0.03262373,0.0315369,0.027139481,0.02680844,0.04670117,0.034534622,0.031285834
0.04670117,0.026851278,0.0,0.032750193,0.031801384,0.033235006,0.0,0.0,0.028873455,0.0,0.029618837000000002,0.029289803,0.02851417,0.027326051,0.028638514,0.031474142999999996,0.0,0.0,0.028311249,0.0,0.0,0.031827233999999996,0.030974641,0.030155612000000002,0.028890343,0.0,0.03262373,0.0315369,0.027139481,0.02680844,0.0,0.034534622,0.031285834,0.036756363
0.034534622,0.0,0.032750193,0.031801384,0.033235006,0.0,0.0,0.028873455,0.0,0.029618837000000002,0.029289803,0.02851417,0.027326051,0.028638514,0.031474142999999996,0.0,0.0,0.028311249,0.0,0.0,0.031827233999999996,0.030974641,0.030155612000000002,0.028890343,0.0,0.03262373,0.0315369,0.027139481,0.02680844,0.0,0.04670117,0.031285834,0.036756363,0.0
0.031285834,0.032750193,0.031801384,0.033235006,0.0,0.0,0.028873455,0.0,0.029618837000000002,0.029289803,0.02851417,0.027326051,0.028638514,0.031474142999999996,0.0,0.0,0.028311249,0.0,0.0,0.031827233999999996,0.030974641,0.030155612000000002,0.028890343,0.0,0.03262373,0.0315369,0.027139481,0.02680844,0.0,0.04670117,0.034534622,0.036756363,0.0,0.0
0.036756363,0.031801384,0.033235006,0.0,0.0,0.028873455,0.0,0.029618837000000002,0.029289803,0.02851417,0.027326051,0.028638514,0.031474142999999996,0.0,0.0,0.028311249,0.0,0.0,0.031827233999999996,0.030974641,0.030155612000000002,0.028890343,0.0,0.03262373,0.0315369,0.027139481,0.02680844,0.0,0.04670117,0.034534622,0.031285834,0.0,0.0,0.032731548
0.0,0.033235006,0.0,0.0,0.028873455,0.0,0.029618837000000002,0.029289803,0.02851417,0.027326051,0.028638514,0.031474142999999996,0.0,0.0,0.028311249,0.0,0.0,0.031827233999999996,0.030974641,0.030155612000000002,0.028890343,0.0,0.03262373,0.0315369,0.027139481,0.02680844,0.0,0.04670117,0.034534622,0.031285834,0.036756363,0.0,0.032731548,0.0
0.0,0.0,0.0,0.028873455,0.0,0.029618837000000002,0.029289803,0.02851417,0.027326051,0.028638514,0.031474142999999996,0.0,0.0,0.028311249,0.0,0.0,0.031827233999999996,0.030974641,0.030155612000000002,0.028890343,0.0,0.03262373,0.0315369,0.027139481,0.02680844,0.0,0.04670117,0.034534622,0.031285834,0.036756363,0.0,0.032731548,0.0,0.030140062999999998
0.032731548,0.0,0.028873455,0.0,0.029618837000000002,0.029289803,0.02851417,0.027326051,0.028638514,0.031474142999999996,0.0,0.0,0.028311249,0.0,0.0,0.031827233999999996,0.030974641,0.030155612000000002,0.028890343,0.0,0.03262373,0.0315369,0.027139481,0.02680844,0.0,0.04670117,0.034534622,0.031285834,0.036756363,0.0,0.0,0.0,0.030140062999999998,0.03332672
0.0,0.028873455,0.0,0.029618837000000002,0.029289803,0.02851417,0.027326051,0.028638514,0.031474142999999996,0.0,0.0,0.028311249,0.0,0.0,0.031827233999999996,0.030974641,0.030155612000000002,0.028890343,0.0,0.03262373,0.0315369,0.027139481,0.02680844,0.0,0.04670117,0.034534622,0.031285834,0.036756363,0.0,0.0,0.032731548,0.030140062999999998,0.03332672,0.03205212
0.030140062999999998,0.0,0.029618837000000002,0.029289803,0.02851417,0.027326051,0.028638514,0.031474142999999996,0.0,0.0,0.028311249,0.0,0.0,0.031827233999999996,0.030974641,0.030155612000000002,0.028890343,0.0,0.03262373,0.0315369,0.027139481,0.02680844,0.0,0.04670117,0.034534622,0.031285834,0.036756363,0.0,0.0,0.032731548,0.0,0.03332672,0.03205212,0.031446382
0.03332672,0.029618837000000002,0.029289803,0.02851417,0.027326051,0.028638514,0.031474142999999996,0.0,0.0,0.028311249,0.0,0.0,0.031827233999999996,0.030974641,0.030155612000000002,0.028890343,0.0,0.03262373,0.0315369,0.027139481,0.02680844,0.0,0.04670117,0.034534622,0.031285834,0.036756363,0.0,0.0,0.032731548,0.0,0.030140062999999998,0.03205212,0.031446382,0.043444544
0.03205212,0.029289803,0.02851417,0.027326051,0.028638514,0.031474142999999996,0.0,0.0,0.028311249,0.0,0.0,0.031827233999999996,0.030974641,0.030155612000000002,0.028890343,0.0,0.03262373,0.0315369,0.027139481,0.02680844,0.0,0.04670117,0.034534622,0.031285834,0.036756363,0.0,0.0,0.032731548,0.0,0.030140062999999998,0.03332672,0.031446382,0.043444544,0.0
0.031446382,0.02851417,0.027326051,0.028638514,0.031474142999999996,0.0,0.0,0.028311249,0.0,0.0,0.031827233999999996,0.030974641,0.030155612000000002,0.028890343,0.0,0.03262373,0.0315369,0.027139481,0.02680844,0.0,0.04670117,0.034534622,0.031285834,0.036756363,0.0,0.0,0.032731548,0.0,0.030140062999999998,0.03332672,0.03205212,0.043444544,0.0,0.0
0.043444544,0.027326051,0.028638514,0.031474142999999996,0.0,0.0,0.028311249,0.0,0.0,0.031827233999999996,0.030974641,0.030155612000000002,0.028890343,0.0,0.03262373,0.0315369,0.027139481,0.02680844,0.0,0.04670117,0.034534622,0.031285834,0.036756363,0.0,0.0,0.032731548,0.0,0.030140062999999998,0.03332672,0.03205212,0.031446382,0.0,0.0,0.037092827
0.0,0.028638514,0.031474142999999996,0.0,0.0,0.028311249,0.0,0.0,0.031827233999999996,0.030974641,0.030155612000000002,0.028890343,0.0,0.03262373,0.0315369,0.027139481,0.02680844,0.0,0.04670117,0.034534622,0.031285834,0.036756363,0.0,0.0,0.032731548,0.0,0.030140062999999998,0.03332672,0.03205212,0.031446382,0.043444544,0.0,0.037092827,0.034075744
0.0,0.031474142999999996,0.0,0.0,0.028311249,0.0,0.0,0.031827233999999996,0.030974641,0.030155612000000002,0.028890343,0.0,0.03262373,0.0315369,0.027139481,0.02680844,0.0,0.04670117,0.034534622,0.031285834,0.036756363,0.0,0.0,0.032731548,0.0,0.030140062999999998,0.03332672,0.03205212,0.031446382,0.043444544,0.0,0.037092827,0.034075744,0.035047475
0.037092827,0.0,0.0,0.028311249,0.0,0.0,0.031827233999999996,0.030974641,0.030155612000000002,0.028890343,0.0,0.03262373,0.0315369,0.027139481,0.02680844,0.0,0.04670117,0.034534622,0.031285834,0.036756363,0.0,0.0,0.032731548,0.0,0.030140062999999998,0.03332672,0.03205212,0.031446382,0.043444544,0.0,0.0,0.034075744,0.035047475,0.0
0.034075744,0.0,0.028311249,0.0,0.0,0.031827233999999996,0.030974641,0.030155612000000002,0.028890343,0.0,0.03262373,0.0315369,0.027139481,0.02680844,0.0,0.04670117,0.034534622,0.031285834,0.036756363,0.0,0.0,0.032731548,0.0,0.030140062999999998,0.03332672,0.03205212,0.031446382,0.043444544,0.0,0.0,0.037092827,0.035047475,0.0,0.0
0.035047475,0.028311249,0.0,0.0,0.031827233999999996,0.030974641,0.030155612000000002,0.028890343,0.0,0.03262373,0.0315369,0.027139481,0.02680844,0.0,0.04670117,0.034534622,0.031285834,0.036756363,0.0,0.0,0.032731548,0.0,0.030140062999999998,0.03332672,0.03205212,0.031446382,0.043444544,0.0,0.0,0.037092827,0.034075744,0.0,0.0,0.0
0.0,0.0,0.0,0.031827233999999996,0.030974641,0.030155612000000002,0.028890343,0.0,0.03262373,0.0315369,0.027139481,0.02680844,0.0,0.04670117,0.034534622,0.031285834,0.036756363,0.0,0.0,0.032731548,0.0,0.030140062999999998,0.03332672,0.03205212,0.031446382,0.043444544,0.0,0.0,0.037092827,0.034075744,0.035047475,0.0,0.0,0.0
0.0,0.0,0.031827233999999996,0.030974641,0.030155612000000002,0.028890343,0.0,0.03262373,0.0315369,0.027139481,0.02680844,0.0,0.04670117,0.034534622,0.031285834,0.036756363,0.0,0.0,0.032731548,0.0,0.030140062999999998,0.03332672,0.03205212,0.031446382,0.043444544,0.0,0.0,0.037092827,0.034075744,0.035047475,0.0,0.0,0.0,0.032211367000000005
0.0,0.031827233999999996,0.030974641,0.030155612000000002,0.028890343,0.0,0.03262373,0.0315369,0.027139481,0.02680844,0.0,0.04670117,0.034534622,0.031285834,0.036756363,0.0,0.0,0.032731548,0.0,0.030140062999999998,0.03332672,0.03205212,0.031446382,0.043444544,0.0,0.0,0.037092827,0.034075744,0.035047475,0.0,0.0,0.0,0.032211367000000005,0.0
0.0,0.030974641,0.030155612000000002,0.028890343,0.0,0.03262373,0.0315369,0.027139481,0.02680844,0.0,0.04670117,0.034534622,0.031285834,0.036756363,0.0,0.0,0.032731548,0.0,0.030140062999999998,0.03332672,0.03205212,0.031446382,0.043444544,0.0,0.0,0.037092827,0.034075744,0.035047475,0.0,0.0,0.0,0.032211367000000005,0.0,0.03520709
0.032211367000000005,0.030155612000000002,0.028890343,0.0,0.03262373,0.0315369,0.027139481,0.02680844,0.0,0.04670117,0.034534622,0.031285834,0.036756363,0.0,0.0,0.032731548,0.0,0.030140062999999998,0.03332672,0.03205212,0.031446382,0.043444544,0.0,0.0,0.037092827,0.034075744,0.035047475,0.0,0.0,0.0,0.0,0.0,0.03520709,0.031952478
