value,value-30,value-29,value-28,value-27,value-26,value-25,value-24,value-23,value-22,value-21,value-20,value-19,value-18,value-17,value-16,value-15,value-14,value-13,value-12,value-11,value-10,value-9,value-8,value-7,value-6,value-5,value-4,value-3,value-2,value-1,Prediction+1,Prediction+2,Prediction+3
0.029468426000000002,0.0,0.032982416,0.0,0.027080176,0.0,0.026721647,0.0,0.032281343,0.0,0.0,0.0,0.029409353,0.03294727,0.0,0.0,0.0,0.03134407,0.027380007999999997,0.03100736,0.025391756,0.0,0.03149755,0.03464796,0.03172306,0.029612036,0.0,0.028204566,0.027499039,0.0,0.0,0.026139568999999998,0.026587562999999998,0.0
0.026139568999999998,0.032982416,0.0,0.027080176,0.0,0.026721647,0.0,0.032281343,0.0,0.0,0.0,0.029409353,0.03294727,0.0,0.0,0.0,0.03134407,0.027380007999999997,0.03100736,0.025391756,0.0,0.03149755,0.03464796,0.03172306,0.029612036,0.0,0.028204566,0.027499039,0.0,0.0,0.029468426000000002,0.026587562999999998,0.0,0.02969392
0.026587562999999998,0.0,0.027080176,0.0,0.026721647,0.0,0.032281343,0.0,0.0,0.0,0.029409353,0.03294727,0.0,0.0,0.0,0.03134407,0.027380007999999997,0.03100736,0.025391756,0.0,0.03149755,0.03464796,0.03172306,0.029612036,0.0,0.028204566,0.027499039,0.0,0.0,0.029468426000000002,0.026139568999999998,0.0,0.02969392,0.0
0.0,0.027080176,0.0,0.026721647,0.0,0.032281343,0.0,0.0,0.0,0.029409353,0.03294727,0.0,0.0,0.0,0.03134407,0.027380007999999997,0.03100736,0.025391756,0.0,0.03149755,0.03464796,0.03172306,0.029612036,0.0,0.028204566,0.027499039,0.0,0.0,0.029468426000000002,0.026139568999999998,0.026587562999999998,0.02969392,0.0,0.0
0.02969392,0.0,0.026721647,0.0,0.032281343,0.0,0.0,0.0,0.029409353,0.03294727,0.0,0.0,0.0,0.03134407,0.027380007999999997,0.03100736,0.025391756,0.0,0.03149755,0.03464796,0.03172306,0.029612036,0.0,0.028204566,0.027499039,0.0,0.0,0.029468426000000002,0.026139568999999998,0.026587562999999998,0.0,0.0,0.0,0.0
0.0,0.026721647,0.0,0.032281343,0.0,0.0,0.0,0.029409353,0.03294727,0.0,0.0,0.0,0.03134407,0.027380007999999997,0.03100736,0.025391756,0.0,0.03149755,0.03464796,0.03172306,0.029612036,0.0,0.028204566,0.027499039,0.0,0.0,0.029468426000000002,0.026139568999999998,0.026587562999999998,0.0,0.02969392,0.0,0.0,0.031150034
0.0,0.0,0.032281343,0.0,0.0,0.0,0.029409353,0.03294727,0.0,0.0,0.0,0.03134407,0.027380007999999997,0.03100736,0.025391756,0.0,0.03149755,0.03464796,0.03172306,0.029612036,0.0,0.028204566,0.027499039,0.0,0.0,0.029468426000000002,0.026139568999999998,0.026587562999999998,0.0,0.02969392,0.0,0.0,0.031150034,0.0
0.0,0.032281343,0.0,0.0,0.0,0.029409353,0.03294727,0.0,0.0,0.0,0.03134407,0.027380007999999997,0.03100736,0.025391756,0.0,0.03149755,0.03464796,0.03172306,0.029612036,0.0,0.028204566,0.027499039,0.0,0.0,0.029468426000000002,0.026139568999999998,0.026587562999999998,0.0,0.02969392,0.0,0.0,0.031150034,0.0,0.023850739
0.031150034,0.0,0.0,0.0,0.029409353,0.03294727,0.0,0.0,0.0,0.03134407,0.027380007999999997,0.03100736,0.025391756,0.0,0.03149755,0.03464796,0.03172306,0.029612036,0.0,0.028204566,0.027499039,0.0,0.0,0.029468426000000002,0.026139568999999998,0.026587562999999998,0.0,0.02969392,0.0,0.0,0.0,0.0,0.023850739,0.0
0.0,0.0,0.0,0.029409353,0.03294727,0.0,0.0,0.0,0.03134407,0.027380007999999997,0.03100736,0.025391756,0.0,0.03149755,0.03464796,0.03172306,0.029612036,0.0,0.028204566,0.027499039,0.0,0.0,0.029468426000000002,0.026139568999999998,0.026587562999999998,0.0,0.02969392,0.0,0.0,0.0,0.031150034,0.023850739,0.0,0.031758003
0.023850739,0.0,0.029409353,0.03294727,0.0,0.0,0.0,0.03134407,0.027380007999999997,0.03100736,0.025391756,0.0,0.03149755,0.03464796,0.03172306,0.029612036,0.0,0.028204566,0.027499039,0.0,0.0,0.029468426000000002,0.026139568999999998,0.026587562999999998,0.0,0.02969392,0.0,0.0,0.0,0.031150034,0.0,0.0,0.031758003,0.0
0.0,0.029409353,0.03294727,0.0,0.0,0.0,0.03134407,0.027380007999999997,0.03100736,0.025391756,0.0,0.03149755,0.03464796,0.03172306,0.029612036,0.0,0.028204566,0.027499039,0.0,0.0,0.029468426000000002,0.026139568999999998,0.026587562999999998,0.0,0.02969392,0.0,0.0,0.0,0.031150034,0.0,0.023850739,0.031758003,0.0,0.028962977
0.031758003,0.03294727,0.0,0.0,0.0,0.03134407,0.027380007999999997,0.03100736,0.025391756,0.0,0.03149755,0.03464796,0.03172306,0.029612036,0.0,0.028204566,0.027499039,0.0,0.0,0.029468426000000002,0.026139568999999998,0.026587562999999998,0.0,0.02969392,0.0,0.0,0.0,0.031150034,0.0,0.023850739,0.0,0.0,0.028962977,0.030119114
0.0,0.0,0.0,0.0,0.03134407,0.027380007999999997,0.03100736,0.025391756,0.0,0.03149755,0.03464796,0.03172306,0.029612036,0.0,0.028204566,0.027499039,0.0,0.0,0.029468426000000002,0.026139568999999998,0.026587562999999998,0.0,0.02969392,0.0,0.0,0.0,0.031150034,0.0,0.023850739,0.0,0.031758003,0.028962977,0.030119114,0.030435007000000007
0.028962977,0.0,0.0,0.03134407,0.027380007999999997,0.03100736,0.025391756,0.0,0.03149755,0.03464796,0.03172306,0.029612036,0.0,0.028204566,0.027499039,0.0,0.0,0.029468426000000002,0.026139568999999998,0.026587562999999998,0.0,0.02969392,0.0,0.0,0.0,0.031150034,0.0,0.023850739,0.0,0.031758003,0.0,0.030119114,0.030435007000000007,0.02604433
0.030119114,0.0,0.03134407,0.027380007999999997,0.03100736,0.025391756,0.0,0.03149755,0.03464796,0.03172306,0.029612036,0.0,0.028204566,0.027499039,0.0,0.0,0.029468426000000002,0.026139568999999998,0.026587562999999998,0.0,0.02969392,0.0,0.0,0.0,0.031150034,0.0,0.023850739,0.0,0.031758003,0.0,0.028962977,0.030435007000000007,0.02604433,0.0
0.030435007000000007,0.03134407,0.027380007999999997,0.03100736,0.025391756,0.0,0.03149755,0.03464796,0.03172306,0.029612036,0.0,0.028204566,0.027499039,0.0,0.0,0.029468426000000002,0.026139568999999998,0.026587562999999998,0.0,0.02969392,0.0,0.0,0.0,0.031150034,0.0,0.023850739,0.0,0.031758003,0.0,0.028962977,0.030119114,0.02604433,0.0,0.03175038
0.02604433,0.027380007999999997,0.03100736,0.025391756,0.0,0.03149755,0.03464796,0.03172306,0.029612036,0.0,0.028204566,0.027499039,0.0,0.0,0.029468426000000002,0.026139568999999998,0.026587562999999998,0.0,0.02969392,0.0,0.0,0.0,0.031150034,0.0,0.023850739,0.0,0.031758003,0.0,0.028962977,0.030119114,0.030435007000000007,0.0,0.03175038,0.029448934
0.0,0.03100736,0.025391756,0.0,0.03149755,0.03464796,0.03172306,0.029612036,0.0,0.028204566,0.027499039,0.0,0.0,0.029468426000000002,0.026139568999999998,0.026587562999999998,0.0,0.02969392,0.0,0.0,0.0,0.031150034,0.0,0.023850739,0.0,0.031758003,0.0,0.028962977,0.030119114,0.030435007000000007,0.02604433,0.03175038,0.029448934,0.0
0.03175038,0.025391756,0.0,0.03149755,0.03464796,0.03172306,0.029612036,0.0,0.028204566,0.027499039,0.0,0.0,0.029468426000000002,0.026139568999999998,0.026587562999999998,0.0,0.02969392,0.0,0.0,0.0,0.031150034,0.0,0.023850739,0.0,0.031758003,0.0,0.028962977,0.030119114,0.030435007000000007,0.02604433,0.0,0.029448934,0.0,0.0
0.029448934,0.0,0.03149755,0.03464796,0.03172306,0.029612036,0.0,0.028204566,0.027499039,0.0,0.0,0.029468426000000002,0.026139568999999998,0.026587562999999998,0.0,0.02969392,0.0,0.0,0.0,0.031150034,0.0,0.023850739,0.0,0.031758003,0.0,0.028962977,0.030119114,0.030435007000000007,0.02604433,0.0,0.03175038,0.0,0.0,0.02613773
0.0,0.03149755,0.03464796,0.03172306,0.029612036,0.0,0.028204566,0.027499039,0.0,0.0,0.029468426000000002,0.026139568999999998,0.026587562999999998,0.0,0.02969392,0.0,0.0,0.0,0.031150034,0.0,0.023850739,0.0,0.031758003,0.0,0.028962977,0.030119114,0.030435007000000007,0.02604433,0.0,0.03175038,0.029448934,0.0,0.02613773,0.0
0.0,0.03464796,0.03172306,0.029612036,0.0,0.028204566,0.027499039,0.0,0.0,0.029468426000000002,0.026139568999999998,0.026587562999999998,0.0,0.02969392,0.0,0.0,0.0,0.031150034,0.0,0.023850739,0.0,0.031758003,0.0,0.028962977,0.030119114,0.030435007000000007,0.02604433,0.0,0.03175038,0.029448934,0.0,0.02613773,0.0,0.030978726
0.02613773,0.03172306,0.029612036,0.0,0.028204566,0.027499039,0.0,0.0,0.029468426000000002,0.026139568999999998,0.026587562999999998,0.0,0.02969392,0.0,0.0,0.0,0.031150034,0.0,0.023850739,0.0,0.031758003,0.0,0.028962977,0.030119114,0.030435007000000007,0.02604433,0.0,0.03175038,0.029448934,0.0,0.0,0.0,0.030978726,0.0
0.0,0.029612036,0.0,0.028204566,0.027499039,0.0,0.0,0.029468426000000002,0.026139568999999998,0.026587562999999998,0.0,0.02969392,0.0,0.0,0.0,0.031150034,0.0,0.023850739,0.0,0.031758003,0.0,0.028962977,0.030119114,0.030435007000000007,0.02604433,0.0,0.03175038,0.029448934,0.0,0.0,0.02613773,0.030978726,0.0,0.019181255
0.030978726,0.0,0.028204566,0.027499039,0.0,0.0,0.029468426000000002,0.026139568999999998,0.026587562999999998,0.0,0.02969392,0.0,0.0,0.0,0.031150034,0.0,0.023850739,0.0,0.031758003,0.0,0.028962977,0.030119114,0.030435007000000007,0.02604433,0.0,0.03175038,0.029448934,0.0,0.0,0.02613773,0.0,0.0,0.019181255,0.032046452
0.0,0.028204566,0.027499039,0.0,0.0,0.029468426000000002,0.026139568999999998,0.026587562999999998,0.0,0.02969392,0.0,0.0,0.0,0.031150034,0.0,0.023850739,0.0,0.031758003,0.0,0.028962977,0.030119114,0.030435007000000007,0.02604433,0.0,0.03175038,0.029448934,0.0,0.0,0.02613773,0.0,0.030978726,0.019181255,0.032046452,0.032984603
0.019181255,0.027499039,0.0,0.0,0.029468426000000002,0.026139568999999998,0.026587562999999998,0.0,0.02969392,0.0,0.0,0.0,0.031150034,0.0,0.023850739,0.0,0.031758003,0.0,0.028962977,0.030119114,0.030435007000000007,0.02604433,0.0,0.03175038,0.029448934,0.0,0.0,0.02613773,0.0,0.030978726,0.0,0.032046452,0.032984603,0.02939457
0.032046452,0.0,0.0,0.029468426000000002,0.026139568999999998,0.026587562999999998,0.0,0.02969392,0.0,0.0,0.0,0.031150034,0.0,0.023850739,0.0,0.031758003,0.0,0.028962977,0.030119114,0.030435007000000007,0.02604433,0.0,0.03175038,0.029448934,0.0,0.0,0.02613773,0.0,0.030978726,0.0,0.019181255,0.032984603,0.02939457,0.03695634
0.032984603,0.0,0.029468426000000002,0.026139568999999998,0.026587562999999998,0.0,0.02969392,0.0,0.0,0.0,0.031150034,0.0,0.023850739,0.0,0.031758003,0.0,0.028962977,0.030119114,0.030435007000000007,0.02604433,0.0,0.03175038,0.029448934,0.0,0.0,0.02613773,0.0,0.030978726,0.0,0.019181255,0.032046452,0.02939457,0.03695634,0.0
0.02939457,0.029468426000000002,0.026139568999999998,0.026587562999999998,0.0,0.02969392,0.0,0.0,0.0,0.031150034,0.0,0.023850739,0.0,0.031758003,0.0,0.028962977,0.030119114,0.030435007000000007,0.02604433,0.0,0.03175038,0.029448934,0.0,0.0,0.02613773,0.0,0.030978726,0.0,0.019181255,0.032046452,0.032984603,0.03695634,0.0,0.031500667
0.03695634,0.026139568999999998,0.026587562999999998,0.0,0.02969392,0.0,0.0,0.0,0.031150034,0.0,0.023850739,0.0,0.031758003,0.0,0.028962977,0.030119114,0.030435007000000007,0.02604433,0.0,0.03175038,0.029448934,0.0,0.0,0.02613773,0.0,0.030978726,0.0,0.019181255,0.032046452,0.032984603,0.02939457,0.0,0.031500667,0.026598902
0.0,0.026587562999999998,0.0,0.02969392,0.0,0.0,0.0,0.031150034,0.0,0.023850739,0.0,0.031758003,0.0,0.028962977,0.030119114,0.030435007000000007,0.02604433,0.0,0.03175038,0.029448934,0.0,0.0,0.02613773,0.0,0.030978726,0.0,0.019181255,0.032046452,0.032984603,0.02939457,0.03695634,0.031500667,0.026598902,0.033983417
0.031500667,0.0,0.02969392,0.0,0.0,0.0,0.031150034,0.0,0.023850739,0.0,0.031758003,0.0,0.028962977,0.030119114,0.030435007000000007,0.02604433,0.0,0.03175038,0.029448934,0.0,0.0,0.02613773,0.0,0.030978726,0.0,0.019181255,0.032046452,0.032984603,0.02939457,0.03695634,0.0,0.026598902,0.033983417,0.026082814
0.026598902,0.02969392,0.0,0.0,0.0,0.031150034,0.0,0.023850739,0.0,0.031758003,0.0,0.028962977,0.030119114,0.030435007000000007,0.02604433,0.0,0.03175038,0.029448934,0.0,0.0,0.02613773,0.0,0.030978726,0.0,0.019181255,0.032046452,0.032984603,0.02939457,0.03695634,0.0,0.031500667,0.033983417,0.026082814,0.0
0.033983417,0.0,0.0,0.0,0.031150034,0.0,0.023850739,0.0,0.031758003,0.0,0.028962977,0.030119114,0.030435007000000007,0.02604433,0.0,0.03175038,0.029448934,0.0,0.0,0.02613773,0.0,0.030978726,0.0,0.019181255,0.032046452,0.032984603,0.02939457,0.03695634,0.0,0.031500667,0.026598902,0.026082814,0.0,0.033062395
0.026082814,0.0,0.0,0.031150034,0.0,0.023850739,0.0,0.031758003,0.0,0.028962977,0.030119114,0.030435007000000007,0.02604433,0.0,0.03175038,0.029448934,0.0,0.0,0.02613773,0.0,0.030978726,0.0,0.019181255,0.032046452,0.032984603,0.02939457,0.03695634,0.0,0.031500667,0.026598902,0.033983417,0.0,0.033062395,0.029986234
0.0,0.0,0.031150034,0.0,0.023850739,0.0,0.031758003,0.0,0.028962977,0.030119114,0.030435007000000007,0.02604433,0.0,0.03175038,0.029448934,0.0,0.0,0.02613773,0.0,0.030978726,0.0,0.019181255,0.032046452,0.032984603,0.02939457,0.03695634,0.0,0.031500667,0.026598902,0.033983417,0.026082814,0.033062395,0.029986234,0.03570881
0.033062395,0.031150034,0.0,0.023850739,0.0,0.031758003,0.0,0.028962977,0.030119114,0.030435007000000007,0.02604433,0.0,0.03175038,0.029448934,0.0,0.0,0.02613773,0.0,0.030978726,0.0,0.019181255,0.032046452,0.032984603,0.02939457,0.03695634,0.0,0.031500667,0.026598902,0.033983417,0.026082814,0.0,0.029986234,0.03570881,0.032829445
0.029986234,0.0,0.023850739,0.0,0.031758003,0.0,0.028962977,0.030119114,0.030435007000000007,0.02604433,0.0,0.03175038,0.029448934,0.0,0.0,0.02613773,0.0,0.030978726,0.0,0.019181255,0.032046452,0.032984603,0.02939457,0.03695634,0.0,0.031500667,0.026598902,0.033983417,0.026082814,0.0,0.033062395,0.03570881,0.032829445,0.0
0.03570881,0.023850739,0.0,0.031758003,0.0,0.028962977,0.030119114,0.030435007000000007,0.02604433,0.0,0.03175038,0.029448934,0.0,0.0,0.02613773,0.0,0.030978726,0.0,0.019181255,0.032046452,0.032984603,0.02939457,0.03695634,0.0,0.031500667,0.026598902,0.033983417,0.026082814,0.0,0.033062395,0.029986234,0.032829445,0.0,0.0
0.032829445,0.0,0.031758003,0.0,0.028962977,0.030119114,0.030435007000000007,0.02604433,0.0,0.03175038,0.029448934,0.0,0.0,0.02613773,0.0,0.030978726,0.0,0.019181255,0.032046452,0.032984603,0.02939457,0.03695634,0.0,0.031500667,0.026598902,0.033983417,0.026082814,0.0,0.033062395,0.029986234,0.03570881,0.0,0.0,0.031801384
0.0,0.031758003,0.0,0.028962977,0.030119114,0.030435007000000007,0.02604433,0.0,0.03175038,0.029448934,0.0,0.0,0.02613773,0.0,0.030978726,0.0,0.019181255,0.032046452,0.032984603,0.02939457,0.03695634,0.0,0.031500667,0.026598902,0.033983417,0.026082814,0.0,0.033062395,0.029986234,0.03570881,0.032829445,0.0,0.031801384,0.02923092
0.0,0.0,0.028962977,0.030119114,0.030435007000000007,0.02604433,0.0,0.03175038,0.029448934,0.0,0.0,0.02613773,0.0,0.030978726,0.0,0.019181255,0.032046452,0.032984603,0.02939457,0.03695634,0.0,0.031500667,0.026598902,0.033983417,0.026082814,0.0,0.033062395,0.029986234,0.03570881,0.032829445,0.0,0.031801384,0.02923092,0.025568518999999998
0.031801384,0.028962977,0.030119114,0.030435007000000007,0.02604433,0.0,0.03175038,0.029448934,0.0,0.0,0.02613773,0.0,0.030978726,0.0,0.019181255,0.032046452,0.032984603,0.02939457,0.03695634,0.0,0.031500667,0.026598902,0.033983417,0.026082814,0.0,0.033062395,0.029986234,0.03570881,0.032829445,0.0,0.0,0.02923092,0.025568518999999998,0.0
0.02923092,0.030119114,0.030435007000000007,0.02604433,0.0,0.03175038,0.029448934,0.0,0.0,0.02613773,0.0,0.030978726,0.0,0.019181255,0.032046452,0.032984603,0.02939457,0.03695634,0.0,0.031500667,0.026598902,0.033983417,0.026082814,0.0,0.033062395,0.029986234,0.03570881,0.032829445,0.0,0.0,0.031801384,0.025568518999999998,0.0,0.0
0.025568518999999998,0.030435007000000007,0.02604433,0.0,0.03175038,0.029448934,0.0,0.0,0.02613773,0.0,0.030978726,0.0,0.019181255,0.032046452,0.032984603,0.02939457,0.03695634,0.0,0.031500667,0.026598902,0.033983417,0.026082814,0.0,0.033062395,0.029986234,0.03570881,0.032829445,0.0,0.0,0.031801384,0.02923092,0.0,0.0,0.0
0.0,0.02604433,0.0,0.03175038,0.029448934,0.0,0.0,0.02613773,0.0,0.030978726,0.0,0.019181255,0.032046452,0.032984603,0.02939457,0.03695634,0.0,0.031500667,0.026598902,0.033983417,0.026082814,0.0,0.033062395,0.029986234,0.03570881,0.032829445,0.0,0.0,0.031801384,0.02923092,0.025568518999999998,0.0,0.0,0.030884118999999998
0.0,0.0,0.03175038,0.029448934,0.0,0.0,0.02613773,0.0,0.030978726,0.0,0.019181255,0.032046452,0.032984603,0.02939457,0.03695634,0.0,0.031500667,0.026598902,0.033983417,0.026082814,0.0,0.033062395,0.029986234,0.03570881,0.032829445,0.0,0.0,0.031801384,0.02923092,0.025568518999999998,0.0,0.0,0.030884118999999998,0.028983342999999998
0.0,0.03175038,0.029448934,0.0,0.0,0.02613773,0.0,0.030978726,0.0,0.019181255,0.032046452,0.032984603,0.02939457,0.03695634,0.0,0.031500667,0.026598902,0.033983417,0.026082814,0.0,0.033062395,0.029986234,0.03570881,0.032829445,0.0,0.0,0.031801384,0.02923092,0.025568518999999998,0.0,0.0,0.030884118999999998,0.028983342999999998,0.028841572000000006
0.030884118999999998,0.029448934,0.0,0.0,0.02613773,0.0,0.030978726,0.0,0.019181255,0.032046452,0.032984603,0.02939457,0.03695634,0.0,0.031500667,0.026598902,0.033983417,0.026082814,0.0,0.033062395,0.029986234,0.03570881,0.032829445,0.0,0.0,0.031801384,0.02923092,0.025568518999999998,0.0,0.0,0.0,0.028983342999999998,0.028841572000000006,0.027326051
0.028983342999999998,0.0,0.0,0.02613773,0.0,0.030978726,0.0,0.019181255,0.032046452,0.032984603,0.02939457,0.03695634,0.0,0.031500667,0.026598902,0.033983417,0.026082814,0.0,0.033062395,0.029986234,0.03570881,0.032829445,0.0,0.0,0.031801384,0.02923092,0.025568518999999998,0.0,0.0,0.0,0.030884118999999998,0.028841572000000006,0.027326051,0.027329361
0.028841572000000006,0.0,0.02613773,0.0,0.030978726,0.0,0.019181255,0.032046452,0.032984603,0.02939457,0.03695634,0.0,0.031500667,0.026598902,0.033983417,0.026082814,0.0,0.033062395,0.029986234,0.03570881,0.032829445,0.0,0.0,0.031801384,0.02923092,0.025568518999999998,0.0,0.0,0.0,0.030884118999999998,0.028983342999999998,0.027326051,0.027329361,0.0
0.027326051,0.02613773,0.0,0.030978726,0.0,0.019181255,0.032046452,0.032984603,0.02939457,0.03695634,0.0,0.031500667,0.026598902,0.033983417,0.026082814,0.0,0.033062395,0.029986234,0.03570881,0.032829445,0.0,0.0,0.031801384,0.02923092,0.025568518999999998,0.0,0.0,0.0,0.030884118999999998,0.028983342999999998,0.028841572000000006,0.027329361,0.0,0.0
0.027329361,0.0,0.030978726,0.0,0.019181255,0.032046452,0.032984603,0.02939457,0.03695634,0.0,0.031500667,0.026598902,0.033983417,0.026082814,0.0,0.033062395,0.029986234,0.03570881,0.032829445,0.0,0.0,0.031801384,0.02923092,0.025568518999999998,0.0,0.0,0.0,0.030884118999999998,0.028983342999999998,0.028841572000000006,0.027326051,0.0,0.0,0.0
0.0,0.030978726,0.0,0.019181255,0.032046452,0.032984603,0.02939457,0.03695634,0.0,0.031500667,0.026598902,0.033983417,0.026082814,0.0,0.033062395,0.029986234,0.03570881,0.032829445,0.0,0.0,0.031801384,0.02923092,0.025568518999999998,0.0,0.0,0.0,0.030884118999999998,0.028983342999999998,0.028841572000000006,0.027326051,0.027329361,0.0,0.0,0.028311249
0.0,0.0,0.019181255,0.032046452,0.032984603,0.02939457,0.03695634,0.0,0.031500667,0.026598902,0.033983417,0.026082814,0.0,0.033062395,0.029986234,0.03570881,0.032829445,0.0,0.0,0.031801384,0.02923092,0.025568518999999998,0.0,0.0,0.0,0.030884118999999998,0.028983342999999998,0.028841572000000006,0.027326051,0.027329361,0.0,0.0,0.028311249,0.0
0.0,0.019181255,0.032046452,0.032984603,0.02939457,0.03695634,0.0,0.031500667,0.026598902,0.033983417,0.026082814,0.0,0.033062395,0.029986234,0.03570881,0.032829445,0.0,0.0,0.031801384,0.02923092,0.025568518999999998,0.0,0.0,0.0,0.030884118999999998,0.028983342999999998,0.028841572000000006,0.027326051,0.027329361,0.0,0.0,0.028311249,0.0,0.0
0.028311249,0.032046452,0.032984603,0.02939457,0.03695634,0.0,0.031500667,0.026598902,0.033983417,0.026082814,0.0,0.033062395,0.029986234,0.03570881,0.032829445,0.0,0.0,0.031801384,0.02923092,0.025568518999999998,0.0,0.0,0.0,0.030884118999999998,0.028983342999999998,0.028841572000000006,0.027326051,0.027329361,0.0,0.0,0.0,0.0,0.0,0.027226318
0.0,0.032984603,0.02939457,0.03695634,0.0,0.031500667,0.026598902,0.033983417,0.026082814,0.0,0.033062395,0.029986234,0.03570881,0.032829445,0.0,0.0,0.031801384,0.02923092,0.025568518999999998,0.0,0.0,0.0,0.030884118999999998,0.028983342999999998,0.028841572000000006,0.027326051,0.027329361,0.0,0.0,0.0,0.028311249,0.0,0.027226318,0.029535282000000006
0.0,0.02939457,0.03695634,0.0,0.031500667,0.026598902,0.033983417,0.026082814,0.0,0.033062395,0.029986234,0.03570881,0.032829445,0.0,0.0,0.031801384,0.02923092,0.025568518999999998,0.0,0.0,0.0,0.030884118999999998,0.028983342999999998,0.028841572000000006,0.027326051,0.027329361,0.0,0.0,0.0,0.028311249,0.0,0.027226318,0.029535282000000006,0.0
0.027226318,0.03695634,0.0,0.031500667,0.026598902,0.033983417,0.026082814,0.0,0.033062395,0.029986234,0.03570881,0.032829445,0.0,0.0,0.031801384,0.02923092,0.025568518999999998,0.0,0.0,0.0,0.030884118999999998,0.028983342999999998,0.028841572000000006,0.027326051,0.027329361,0.0,0.0,0.0,0.028311249,0.0,0.0,0.029535282000000006,0.0,0.028890343
0.029535282000000006,0.0,0.031500667,0.026598902,0.033983417,0.026082814,0.0,0.033062395,0.029986234,0.03570881,0.032829445,0.0,0.0,0.031801384,0.02923092,0.025568518999999998,0.0,0.0,0.0,0.030884118999999998,0.028983342999999998,0.028841572000000006,0.027326051,0.027329361,0.0,0.0,0.0,0.028311249,0.0,0.0,0.027226318,0.0,0.028890343,0.0
0.0,0.031500667,0.026598902,0.033983417,0.026082814,0.0,0.033062395,0.029986234,0.03570881,0.032829445,0.0,0.0,0.031801384,0.02923092,0.025568518999999998,0.0,0.0,0.0,0.030884118999999998,0.028983342999999998,0.028841572000000006,0.027326051,0.027329361,0.0,0.0,0.0,0.028311249,0.0,0.0,0.027226318,0.029535282000000006,0.028890343,0.0,0.033673834
0.028890343,0.026598902,0.033983417,0.026082814,0.0,0.033062395,0.029986234,0.03570881,0.032829445,0.0,0.0,0.031801384,0.02923092,0.025568518999999998,0.0,0.0,0.0,0.030884118999999998,0.028983342999999998,0.028841572000000006,0.027326051,0.027329361,0.0,0.0,0.0,0.028311249,0.0,0.0,0.027226318,0.029535282000000006,0.0,0.0,0.033673834,0.026990443
0.0,0.033983417,0.026082814,0.0,0.033062395,0.029986234,0.03570881,0.032829445,0.0,0.0,0.031801384,0.02923092,0.025568518999999998,0.0,0.0,0.0,0.030884118999999998,0.028983342999999998,0.028841572000000006,0.027326051,0.027329361,0.0,0.0,0.0,0.028311249,0.0,0.0,0.027226318,0.029535282000000006,0.0,0.028890343,0.033673834,0.026990443,0.029410109
0.033673834,0.026082814,0.0,0.033062395,0.029986234,0.03570881,0.032829445,0.0,0.0,0.031801384,0.02923092,0.025568518999999998,0.0,0.0,0.0,0.030884118999999998,0.028983342999999998,0.028841572000000006,0.027326051,0.027329361,0.0,0.0,0.0,0.028311249,0.0,0.0,0.027226318,0.029535282000000006,0.0,0.028890343,0.0,0.026990443,0.029410109,0.02680844
0.026990443,0.0,0.033062395,0.029986234,0.03570881,0.032829445,0.0,0.0,0.031801384,0.02923092,0.025568518999999998,0.0,0.0,0.0,0.030884118999999998,0.028983342999999998,0.028841572000000006,0.027326051,0.027329361,0.0,0.0,0.0,0.028311249,0.0,0.0,0.027226318,0.029535282000000006,0.0,0.028890343,0.0,0.033673834,0.029410109,0.02680844,0.0
0.029410109,0.033062395,0.029986234,0.03570881,0.032829445,0.0,0.0,0.031801384,0.02923092,0.025568518999999998,0.0,0.0,0.0,0.030884118999999998,0.028983342999999998,0.028841572000000006,0.027326051,0.027329361,0.0,0.0,0.0,0.028311249,0.0,0.0,0.027226318,0.029535282000000006,0.0,0.028890343,0.0,0.033673834,0.026990443,0.02680844,0.0,0.046097837
0.02680844,0.029986234,0.03570881,0.032829445,0.0,0.0,0.031801384,0.02923092,0.025568518999999998,0.0,0.0,0.0,0.030884118999999998,0.028983342999999998,0.028841572000000006,0.027326051,0.027329361,0.0,0.0,0.0,0.028311249,0.0,0.0,0.027226318,0.029535282000000006,0.0,0.028890343,0.0,0.033673834,0.026990443,0.029410109,0.0,0.046097837,0.032797456
0.0,0.03570881,0.032829445,0.0,0.0,0.031801384,0.02923092,0.025568518999999998,0.0,0.0,0.0,0.030884118999999998,0.028983342999999998,0.028841572000000006,0.027326051,0.027329361,0.0,0.0,0.0,0.028311249,0.0,0.0,0.027226318,0.029535282000000006,0.0,0.028890343,0.0,0.033673834,0.026990443,0.029410109,0.02680844,0.046097837,0.032797456,0.03189038
0.046097837,0.032829445,0.0,0.0,0.031801384,0.02923092,0.025568518999999998,0.0,0.0,0.0,0.030884118999999998,0.028983342999999998,0.028841572000000006,0.027326051,0.027329361,0.0,0.0,0.0,0.028311249,0.0,0.0,0.027226318,0.029535282000000006,0.0,0.028890343,0.0,0.033673834,0.026990443,0.029410109,0.02680844,0.0,0.032797456,0.03189038,0.038728725
0.032797456,0.0,0.0,0.031801384,0.02923092,0.025568518999999998,0.0,0.0,0.0,0.030884118999999998,0.028983342999999998,0.028841572000000006,0.027326051,0.027329361,0.0,0.0,0.0,0.028311249,0.0,0.0,0.027226318,0.029535282000000006,0.0,0.028890343,0.0,0.033673834,0.026990443,0.029410109,0.02680844,0.0,0.046097837,0.03189038,0.038728725,0.0
0.03189038,0.0,0.031801384,0.02923092,0.025568518999999998,0.0,0.0,0.0,0.030884118999999998,0.028983342999999998,0.028841572000000006,0.027326051,0.027329361,0.0,0.0,0.0,0.028311249,0.0,0.0,0.027226318,0.029535282000000006,0.0,0.028890343,0.0,0.033673834,0.026990443,0.029410109,0.02680844,0.0,0.046097837,0.032797456,0.038728725,0.0,0.0
0.038728725,0.031801384,0.02923092,0.025568518999999998,0.0,0.0,0.0,0.030884118999999998,0.028983342999999998,0.028841572000000006,0.027326051,0.027329361,0.0,0.0,0.0,0.028311249,0.0,0.0,0.027226318,0.029535282000000006,0.0,0.028890343,0.0,0.033673834,0.026990443,0.029410109,0.02680844,0.0,0.046097837,0.032797456,0.03189038,0.0,0.0,0.033599444
0.0,0.02923092,0.025568518999999998,0.0,0.0,0.0,0.030884118999999998,0.028983342999999998,0.028841572000000006,0.027326051,0.027329361,0.0,0.0,0.0,0.028311249,0.0,0.0,0.027226318,0.029535282000000006,0.0,0.028890343,0.0,0.033673834,0.026990443,0.029410109,0.02680844,0.0,0.046097837,0.032797456,0.03189038,0.038728725,0.0,0.033599444,0.0
0.0,0.025568518999999998,0.0,0.0,0.0,0.030884118999999998,0.028983342999999998,0.028841572000000006,0.027326051,0.027329361,0.0,0.0,0.0,0.028311249,0.0,0.0,0.027226318,0.029535282000000006,0.0,0.028890343,0.0,0.033673834,0.026990443,0.029410109,0.02680844,0.0,0.046097837,0.032797456,0.03189038,0.038728725,0.0,0.033599444,0.0,0.03362348
0.033599444,0.0,0.0,0.0,0.030884118999999998,0.028983342999999998,0.028841572000000006,0.027326051,0.027329361,0.0,0.0,0.0,0.028311249,0.0,0.0,0.027226318,0.029535282000000006,0.0,0.028890343,0.0,0.033673834,0.026990443,0.029410109,0.02680844,0.0,0.046097837,0.032797456,0.03189038,0.038728725,0.0,0.0,0.0,0.03362348,0.03332672
0.0,0.0,0.0,0.030884118999999998,0.028983342999999998,0.028841572000000006,0.027326051,0.027329361,0.0,0.0,0.0,0.028311249,0.0,0.0,0.027226318,0.029535282000000006,0.0,0.028890343,0.0,0.033673834,0.026990443,0.029410109,0.02680844,0.0,0.046097837,0.032797456,0.03189038,0.038728725,0.0,0.0,0.033599444,0.03362348,0.03332672,0.0310205
0.03362348,0.0,0.030884118999999998,0.028983342999999998,0.028841572000000006,0.027326051,0.027329361,0.0,0.0,0.0,0.028311249,0.0,0.0,0.027226318,0.029535282000000006,0.0,0.028890343,0.0,0.033673834,0.026990443,0.029410109,0.02680844,0.0,0.046097837,0.032797456,0.03189038,0.038728725,0.0,0.0,0.033599444,0.0,0.03332672,0.0310205,0.03053266
0.03332672,0.030884118999999998,0.028983342999999998,0.028841572000000006,0.027326051,0.027329361,0.0,0.0,0.0,0.028311249,0.0,0.0,0.027226318,0.029535282000000006,0.0,0.028890343,0.0,0.033673834,0.026990443,0.029410109,0.02680844,0.0,0.046097837,0.032797456,0.03189038,0.038728725,0.0,0.0,0.033599444,0.0,0.03362348,0.0310205,0.03053266,0.047243614
0.0310205,0.028983342999999998,0.028841572000000006,0.027326051,0.027329361,0.0,0.0,0.0,0.028311249,0.0,0.0,0.027226318,0.029535282000000006,0.0,0.028890343,0.0,0.033673834,0.026990443,0.029410109,0.02680844,0.0,0.046097837,0.032797456,0.03189038,0.038728725,0.0,0.0,0.033599444,0.0,0.03362348,0.03332672,0.03053266,0.047243614,0.0
0.03053266,0.028841572000000006,0.027326051,0.027329361,0.0,0.0,0.0,0.028311249,0.0,0.0,0.027226318,0.029535282000000006,0.0,0.028890343,0.0,0.033673834,0.026990443,0.029410109,0.02680844,0.0,0.046097837,0.032797456,0.03189038,0.038728725,0.0,0.0,0.033599444,0.0,0.03362348,0.03332672,0.0310205,0.047243614,0.0,0.0
0.047243614,0.027326051,0.027329361,0.0,0.0,0.0,0.028311249,0.0,0.0,0.027226318,0.029535282000000006,0.0,0.028890343,0.0,0.033673834,0.026990443,0.029410109,0.02680844,0.0,0.046097837,0.032797456,0.03189038,0.038728725,0.0,0.0,0.033599444,0.0,0.03362348,0.03332672,0.0310205,0.03053266,0.0,0.0,0.035847377
0.0,0.027329361,0.0,0.0,0.0,0.028311249,0.0,0.0,0.027226318,0.029535282000000006,0.0,0.028890343,0.0,0.033673834,0.026990443,0.029410109,0.02680844,0.0,0.046097837,0.032797456,0.03189038,0.038728725,0.0,0.0,0.033599444,0.0,0.03362348,0.03332672,0.0310205,0.03053266,0.047243614,0.0,0.035847377,0.0
0.0,0.0,0.0,0.0,0.028311249,0.0,0.0,0.027226318,0.029535282000000006,0.0,0.028890343,0.0,0.033673834,0.026990443,0.029410109,0.02680844,0.0,0.046097837,0.032797456,0.03189038,0.038728725,0.0,0.0,0.033599444,0.0,0.03362348,0.03332672,0.0310205,0.03053266,0.047243614,0.0,0.035847377,0.0,0.037801865
0.035847377,0.0,0.0,0.028311249,0.0,0.0,0.027226318,0.029535282000000006,0.0,0.028890343,0.0,0.033673834,0.026990443,0.029410109,0.02680844,0.0,0.046097837,0.032797456,0.03189038,0.038728725,0.0,0.0,0.033599444,0.0,0.03362348,0.03332672,0.0310205,0.03053266,0.047243614,0.0,0.0,0.0,0.037801865,0.0
0.0,0.0,0.028311249,0.0,0.0,0.027226318,0.029535282000000006,0.0,0.028890343,0.0,0.033673834,0.026990443,0.029410109,0.02680844,0.0,0.046097837,0.032797456,0.03189038,0.038728725,0.0,0.0,0.033599444,0.0,0.03362348,0.03332672,0.0310205,0.03053266,0.047243614,0.0,0.0,0.035847377,0.037801865,0.0,0.0
0.037801865,0.028311249,0.0,0.0,0.027226318,0.029535282000000006,0.0,0.028890343,0.0,0.033673834,0.026990443,0.029410109,0.02680844,0.0,0.046097837,0.032797456,0.03189038,0.038728725,0.0,0.0,0.033599444,0.0,0.03362348,0.03332672,0.0310205,0.03053266,0.047243614,0.0,0.0,0.035847377,0.0,0.0,0.0,0.0
0.0,0.0,0.0,0.027226318,0.029535282000000006,0.0,0.028890343,0.0,0.033673834,0.026990443,0.029410109,0.02680844,0.0,0.046097837,0.032797456,0.03189038,0.038728725,0.0,0.0,0.033599444,0.0,0.03362348,0.03332672,0.0310205,0.03053266,0.047243614,0.0,0.0,0.035847377,0.0,0.037801865,0.0,0.0,0.0
0.0,0.0,0.027226318,0.029535282000000006,0.0,0.028890343,0.0,0.033673834,0.026990443,0.029410109,0.02680844,0.0,0.046097837,0.032797456,0.03189038,0.038728725,0.0,0.0,0.033599444,0.0,0.03362348,0.03332672,0.0310205,0.03053266,0.047243614,0.0,0.0,0.035847377,0.0,0.037801865,0.0,0.0,0.0,0.030881468
0.0,0.027226318,0.029535282000000006,0.0,0.028890343,0.0,0.033673834,0.026990443,0.029410109,0.02680844,0.0,0.046097837,0.032797456,0.03189038,0.038728725,0.0,0.0,0.033599444,0.0,0.03362348,0.03332672,0.0310205,0.03053266,0.047243614,0.0,0.0,0.035847377,0.0,0.037801865,0.0,0.0,0.0,0.030881468,0.0
0.0,0.029535282000000006,0.0,0.028890343,0.0,0.033673834,0.026990443,0.029410109,0.02680844,0.0,0.046097837,0.032797456,0.03189038,0.038728725,0.0,0.0,0.033599444,0.0,0.03362348,0.03332672,0.0310205,0.03053266,0.047243614,0.0,0.0,0.035847377,0.0,0.037801865,0.0,0.0,0.0,0.030881468,0.0,0.03520709
0.030881468,0.0,0.028890343,0.0,0.033673834,0.026990443,0.029410109,0.02680844,0.0,0.046097837,0.032797456,0.03189038,0.038728725,0.0,0.0,0.033599444,0.0,0.03362348,0.03332672,0.0310205,0.03053266,0.047243614,0.0,0.0,0.035847377,0.0,0.037801865,0.0,0.0,0.0,0.0,0.0,0.03520709,0.03236502
