date,latitude,longitude,value
2020-06-01,52.45880953866191,4.550142288208009,0.0
2020-06-02,52.45880953866191,4.550142288208009,0.0
2020-06-03,52.45880953866191,4.550142288208009,0.0
2020-06-04,52.45880953866191,4.550142288208009,0.0
2020-06-05,52.45880953866191,4.550142288208009,0.0
2020-06-06,52.45880953866191,4.550142288208009,0.029726433
2020-06-07,52.45880953866191,4.550142288208009,0.0
2020-06-08,52.45880953866191,4.550142288208009,0.032281343
2020-06-09,52.45880953866191,4.550142288208009,0.031351954
2020-06-10,52.45880953866191,4.550142288208009,0.0
2020-06-11,52.45880953866191,4.550142288208009,0.0
2020-06-12,52.45880953866191,4.550142288208009,0.032007422
2020-06-13,52.45880953866191,4.550142288208009,0.0
2020-06-14,52.45880953866191,4.550142288208009,0.0
2020-06-15,52.45880953866191,4.550142288208009,0.0
2020-06-16,52.45880953866191,4.550142288208009,0.0
2020-06-17,52.45880953866191,4.550142288208009,0.0
2020-06-18,52.45880953866191,4.550142288208009,0.032526605
2020-06-19,52.45880953866191,4.550142288208009,0.03147652
2020-06-20,52.45880953866191,4.550142288208009,0.02588413
2020-06-21,52.45880953866191,4.550142288208009,0.0
2020-06-22,52.45880953866191,4.550142288208009,0.028616041
2020-06-23,52.45880953866191,4.550142288208009,0.033073552
2020-06-24,52.45880953866191,4.550142288208009,0.0
2020-06-25,52.45880953866191,4.550142288208009,0.03222478
2020-06-26,52.45880953866191,4.550142288208009,0.0
2020-06-27,52.45880953866191,4.550142288208009,0.028204566
2020-06-28,52.45880953866191,4.550142288208009,0.024269098
2020-06-29,52.45880953866191,4.550142288208009,0.0
2020-06-30,52.45880953866191,4.550142288208009,0.02564431
2020-07-01,52.45880953866191,4.550142288208009,0.029468426
2020-07-02,52.45880953866191,4.550142288208009,0.023974143
2020-07-03,52.45880953866191,4.550142288208009,0.027190384
2020-07-04,52.45880953866191,4.550142288208009,0.0
2020-07-05,52.45880953866191,4.550142288208009,0.03129725
2020-07-06,52.45880953866191,4.550142288208009,0.0
2020-07-07,52.45880953866191,4.550142288208009,0.0
2020-07-08,52.45880953866191,4.550142288208009,0.0
2020-07-09,52.45880953866191,4.550142288208009,0.031150034
2020-07-10,52.45880953866191,4.550142288208009,0.028911673
2020-07-11,52.45880953866191,4.550142288208009,0.023850739
2020-07-12,52.45880953866191,4.550142288208009,0.0
2020-07-13,52.45880953866191,4.550142288208009,0.034324855
2020-07-14,52.45880953866191,4.550142288208009,0.0
2020-07-15,52.45880953866191,4.550142288208009,0.028962977
2020-07-16,52.45880953866191,4.550142288208009,0.033310506000000004
2020-07-17,52.45880953866191,4.550142288208009,0.030435007000000007
2020-07-18,52.45880953866191,4.550142288208009,0.02604433
2020-07-19,52.45880953866191,4.550142288208009,0.0
2020-07-20,52.45880953866191,4.550142288208009,0.03175038
2020-07-21,52.45880953866191,4.550142288208009,0.028013559
2020-07-22,52.45880953866191,4.550142288208009,0.0
2020-07-23,52.45880953866191,4.550142288208009,0.0
2020-07-24,52.45880953866191,4.550142288208009,0.02613773
2020-07-25,52.45880953866191,4.550142288208009,0.0
2020-07-26,52.45880953866191,4.550142288208009,0.026715279
2020-07-27,52.45880953866191,4.550142288208009,0.0
2020-07-28,52.45880953866191,4.550142288208009,0.019181255
2020-07-29,52.45880953866191,4.550142288208009,0.034367412
2020-07-30,52.45880953866191,4.550142288208009,0.032984603
2020-07-31,52.45880953866191,4.550142288208009,0.0
2020-08-01,52.45880953866191,4.550142288208009,0.0
2020-08-02,52.45880953866191,4.550142288208009,0.03683098
2020-08-03,52.45880953866191,4.550142288208009,0.0
2020-08-04,52.45880953866191,4.550142288208009,0.03204436
2020-08-05,52.45880953866191,4.550142288208009,0.0
2020-08-06,52.45880953866191,4.550142288208009,0.026999373
2020-08-07,52.45880953866191,4.550142288208009,0.0
2020-08-08,52.45880953866191,4.550142288208009,0.0
2020-08-09,52.45880953866191,4.550142288208009,0.0
2020-08-10,52.45880953866191,4.550142288208009,0.029653832
2020-08-11,52.45880953866191,4.550142288208009,0.028617281
2020-08-12,52.45880953866191,4.550142288208009,0.02844978
2020-08-13,52.45880953866191,4.550142288208009,0.0
2020-08-14,52.45880953866191,4.550142288208009,0.0
2020-08-15,52.45880953866191,4.550142288208009,0.030284438
2020-08-16,52.45880953866191,4.550142288208009,0.030988012
2020-08-17,52.45880953866191,4.550142288208009,0.0
2020-08-18,52.45880953866191,4.550142288208009,0.0
2020-08-19,52.45880953866191,4.550142288208009,0.0
2020-08-20,52.45880953866191,4.550142288208009,0.0
2020-08-21,52.45880953866191,4.550142288208009,0.026663145
2020-08-22,52.45880953866191,4.550142288208009,0.028989814
2020-08-23,52.45880953866191,4.550142288208009,0.030905787
2020-08-24,52.45880953866191,4.550142288208009,0.027326051
2020-08-25,52.45880953866191,4.550142288208009,0.030373154
2020-08-26,52.45880953866191,4.550142288208009,0.0
2020-08-27,52.45880953866191,4.550142288208009,0.0
2020-08-28,52.45880953866191,4.550142288208009,0.0
2020-08-29,52.45880953866191,4.550142288208009,0.028311249
2020-08-30,52.45880953866191,4.550142288208009,0.0
2020-08-31,52.45880953866191,4.550142288208009,0.03330343
2020-09-01,52.45880953866191,4.550142288208009,0.027226318
2020-09-02,52.45880953866191,4.550142288208009,0.0
2020-09-03,52.45880953866191,4.550142288208009,0.030155612
2020-09-04,52.45880953866191,4.550142288208009,0.028890343
2020-09-05,52.45880953866191,4.550142288208009,0.0
2020-09-06,52.45880953866191,4.550142288208009,0.033673834
2020-09-07,52.45880953866191,4.550142288208009,0.027273828
2020-09-08,52.45880953866191,4.550142288208009,0.033234645
2020-09-09,52.45880953866191,4.550142288208009,0.02680844
2020-09-10,52.45880953866191,4.550142288208009,0.0
2020-09-11,52.45880953866191,4.550142288208009,0.046097837
2020-09-12,52.45880953866191,4.550142288208009,0.032797456
2020-09-13,52.45880953866191,4.550142288208009,0.030685792000000007
2020-09-15,52.45880953866191,4.550142288208009,0.039670736
2020-09-16,52.45880953866191,4.550142288208009,0.031300493
2020-09-17,52.45880953866191,4.550142288208009,0.0
2020-09-18,52.45880953866191,4.550142288208009,0.0
2020-09-19,52.45880953866191,4.550142288208009,0.0
2020-09-20,52.45880953866191,4.550142288208009,0.03362348
2020-09-21,52.45880953866191,4.550142288208009,0.027911885
2020-09-22,52.45880953866191,4.550142288208009,0.0310205
2020-09-23,52.45880953866191,4.550142288208009,0.029495144
2020-09-24,52.45880953866191,4.550142288208009,0.048903435
2020-09-25,52.45880953866191,4.550142288208009,0.0
2020-09-26,52.45880953866191,4.550142288208009,0.0
2020-09-27,52.45880953866191,4.550142288208009,0.03646863
2020-09-28,52.45880953866191,4.550142288208009,0.0
2020-09-29,52.45880953866191,4.550142288208009,0.037801865
2020-09-30,52.45880953866191,4.550142288208009,0.0
2020-10-01,52.45880953866191,4.550142288208009,0.0
2020-10-02,52.45880953866191,4.550142288208009,0.03847526
2020-10-03,52.45880953866191,4.550142288208009,0.0
2020-10-04,52.45880953866191,4.550142288208009,0.0
2020-10-05,52.45880953866191,4.550142288208009,0.0
2020-10-06,52.45880953866191,4.550142288208009,0.03520709
2020-10-07,52.45880953866191,4.550142288208009,0.033102627999999995
2020-10-08,52.45880953866191,4.550142288208009,0.033161774
DateWiseCO,4.550142288208009,52.45880953866191,0.033161774
