latitude,longitude,value
52.508251,4.49875125,0.02335059
52.508251,4.53346975,0.02335059
52.508251,4.56818825,0.02335059
52.508251,4.60290675,0.02335059
52.508251,4.63762525,0.02335059
52.508251,4.67234375,0.02335059
52.508251,4.70706225,0.02335059
52.508251,4.74178075,0.02335059
52.486455,4.49875125,0.02335059
52.486455,4.53346975,0.02335059
52.486455,4.56818825,0.02335059
52.486455,4.60290675,0.02335059
52.486455,4.63762525,0.02335059
52.486455,4.67234375,0.02335059
52.486455,4.70706225,0.02335059
52.486455,4.74178075,0.02335059
52.464659,4.49875125,0.02335059
52.464659,4.53346975,0.02335059
52.464659,4.56818825,0.02335059
52.464659,4.60290675,0.02335059
52.464659,4.63762525,0.02335059
52.464659,4.67234375,0.02335059
52.464659,4.70706225,0.02335059
52.464659,4.74178075,0.02335059
52.442863,4.49875125,0.02335059
52.442863,4.53346975,0.02335059
52.442863,4.56818825,0.02335059
52.442863,4.60290675,0.02335059
52.442863,4.63762525,0.02335059
52.442863,4.67234375,0.02335059
52.442863,4.70706225,0.02335059
52.442863,4.74178075,0.02335059
52.421067,4.49875125,0.02335059
52.421067,4.53346975,0.02335059
52.421067,4.56818825,0.02335059
52.421067,4.60290675,0.02335059
52.421067,4.63762525,0.02335059
52.421067,4.67234375,0.02335059
52.421067,4.70706225,0.02335059
52.421067,4.74178075,0.02335059
52.399271,4.49875125,0.02335059
52.399271,4.53346975,0.02335059
52.399271,4.56818825,0.02335059
52.399271,4.60290675,0.02335059
52.399271,4.63762525,0.02335059
52.399271,4.67234375,0.02335059
52.399271,4.70706225,0.02335059
52.399271,4.74178075,0.02335059