52.508251,4.49875125,3384.529
52.508251,4.53346975,3384.529
52.508251,4.56818825,3384.529
52.508251,4.60290675,3137.0226000000002
52.508251,4.63762525,3137.0226000000002
52.508251,4.6723437500000005,3137.0226000000002
52.508251,4.70706225,3137.0226000000002
52.508251,4.74178075,3137.0226000000002
52.48645500000001,4.49875125,3310.2627999999995
52.48645500000001,4.53346975,3310.2627999999995
52.48645500000001,4.56818825,3310.2627999999995
52.48645500000001,4.60290675,3195.2478
52.48645500000001,4.63762525,3195.2478
52.48645500000001,4.6723437500000005,3195.2478
52.48645500000001,4.70706225,3195.2478
52.48645500000001,4.74178075,3195.2478
52.464659,4.49875125,3310.2627999999995
52.464659,4.53346975,3310.2627999999995
52.464659,4.56818825,3310.2627999999995
52.464659,4.60290675,3310.2627999999995
52.464659,4.63762525,3195.2478
52.464659,4.6723437500000005,3195.2478
52.464659,4.70706225,3195.2478
52.464659,4.74178075,3195.2478
52.442863,4.49875125,3310.2627999999995
52.442863,4.53346975,3310.2627999999995
52.442863,4.56818825,3310.2627999999995
52.442863,4.60290675,3264.8254
52.442863,4.63762525,3236.502
52.442863,4.6723437500000005,3236.502
52.442863,4.70706225,3236.502
52.442863,4.74178075,3236.502
52.421067,4.49875125,3264.8254
52.421067,4.53346975,3264.8254
52.421067,4.56818825,3264.8254
52.421067,4.60290675,3264.8254
52.421067,4.63762525,3236.502
52.421067,4.6723437500000005,3236.502
52.421067,4.70706225,3236.502
52.421067,4.74178075,3236.502
52.399271,4.49875125,0.0
52.399271,4.53346975,3264.8254
52.399271,4.56818825,3264.8254
52.399271,4.60290675,3264.8254
52.399271,4.63762525,3236.502
52.399271,4.6723437500000005,3236.502
52.399271,4.70706225,3236.502
52.399271,4.74178075,0.0
