52.508251,4.49875125,2979.3877000000007
52.508251,4.53346975,2979.3877000000007
52.508251,4.56818825,2979.3877000000007
52.508251,4.60290675,2979.3877000000007
52.508251,4.63762525,2979.3877000000007
52.508251,4.6723437500000005,2979.3877000000007
52.508251,4.70706225,2979.3877000000007
52.508251,4.74178075,2979.3877000000007
52.48645500000001,4.49875125,2831.1249
52.48645500000001,4.53346975,2831.1249
52.48645500000001,4.56818825,2831.1249
52.48645500000001,4.60290675,2831.1249
52.48645500000001,4.63762525,2831.1249
52.48645500000001,4.6723437500000005,2979.3877000000007
52.48645500000001,4.70706225,2979.3877000000007
52.48645500000001,4.74178075,2979.3877000000007
52.464659,4.49875125,2831.1249
52.464659,4.53346975,2831.1249
52.464659,4.56818825,2831.1249
52.464659,4.60290675,2831.1249
52.464659,4.63762525,2831.1249
52.464659,4.6723437500000005,2831.1249
52.464659,4.70706225,2831.1249
52.464659,4.74178075,2831.1249
52.442863,4.49875125,2921.0947
52.442863,4.53346975,2921.0947
52.442863,4.56818825,2921.0947
52.442863,4.60290675,2921.0947
52.442863,4.63762525,2831.1249
52.442863,4.6723437500000005,2831.1249
52.442863,4.70706225,2831.1249
52.442863,4.74178075,2831.1249
52.421067,4.49875125,2921.0947
52.421067,4.53346975,2921.0947
52.421067,4.56818825,2921.0947
52.421067,4.60290675,2921.0947
52.421067,4.63762525,2921.0947
52.421067,4.6723437500000005,2921.0947
52.421067,4.70706225,2921.0947
52.421067,4.74178075,2921.0947
52.399271,4.49875125,0.0
52.399271,4.53346975,2789.7349
52.399271,4.56818825,2921.0947
52.399271,4.60290675,2921.0947
52.399271,4.63762525,2921.0947
52.399271,4.6723437500000005,2921.0947
52.399271,4.70706225,2921.0947
52.399271,4.74178075,0.0
