value,value-30,value-29,value-28,value-27,value-26,value-25,value-24,value-23,value-22,value-21,value-20,value-19,value-18,value-17,value-16,value-15,value-14,value-13,value-12,value-11,value-10,value-9,value-8,value-7,value-6,value-5,value-4,value-3,value-2,value-1,Prediction+1,Prediction+2,Prediction+3
0.03029552,0.0,0.032982416,0.0,0.027080176,0.0,0.0,0.0,0.03198655,0.0,0.0,0.0,0.031799233999999996,0.03294727,0.0,0.0,0.0,0.031380504,0.027816696000000002,0.03100736,0.027121363,0.0,0.03149755,0.03464796,0.029635236000000002,0.029612036,0.0,0.030873857,0.026782833,0.0,0.0,0.026139568999999998,0.026587562999999998,0.0
0.026139568999999998,0.032982416,0.0,0.027080176,0.0,0.0,0.0,0.03198655,0.0,0.0,0.0,0.031799233999999996,0.03294727,0.0,0.0,0.0,0.031380504,0.027816696000000002,0.03100736,0.027121363,0.0,0.03149755,0.03464796,0.029635236000000002,0.029612036,0.0,0.030873857,0.026782833,0.0,0.0,0.03029552,0.026587562999999998,0.0,0.02969392
0.026587562999999998,0.0,0.027080176,0.0,0.0,0.0,0.03198655,0.0,0.0,0.0,0.031799233999999996,0.03294727,0.0,0.0,0.0,0.031380504,0.027816696000000002,0.03100736,0.027121363,0.0,0.03149755,0.03464796,0.029635236000000002,0.029612036,0.0,0.030873857,0.026782833,0.0,0.0,0.03029552,0.026139568999999998,0.0,0.02969392,0.0
0.0,0.027080176,0.0,0.0,0.0,0.03198655,0.0,0.0,0.0,0.031799233999999996,0.03294727,0.0,0.0,0.0,0.031380504,0.027816696000000002,0.03100736,0.027121363,0.0,0.03149755,0.03464796,0.029635236000000002,0.029612036,0.0,0.030873857,0.026782833,0.0,0.0,0.03029552,0.026139568999999998,0.026587562999999998,0.02969392,0.0,0.0
0.02969392,0.0,0.0,0.0,0.03198655,0.0,0.0,0.0,0.031799233999999996,0.03294727,0.0,0.0,0.0,0.031380504,0.027816696000000002,0.03100736,0.027121363,0.0,0.03149755,0.03464796,0.029635236000000002,0.029612036,0.0,0.030873857,0.026782833,0.0,0.0,0.03029552,0.026139568999999998,0.026587562999999998,0.0,0.0,0.0,0.0
0.0,0.0,0.0,0.03198655,0.0,0.0,0.0,0.031799233999999996,0.03294727,0.0,0.0,0.0,0.031380504,0.027816696000000002,0.03100736,0.027121363,0.0,0.03149755,0.03464796,0.029635236000000002,0.029612036,0.0,0.030873857,0.026782833,0.0,0.0,0.03029552,0.026139568999999998,0.026587562999999998,0.0,0.02969392,0.0,0.0,0.028100599999999996
0.0,0.0,0.03198655,0.0,0.0,0.0,0.031799233999999996,0.03294727,0.0,0.0,0.0,0.031380504,0.027816696000000002,0.03100736,0.027121363,0.0,0.03149755,0.03464796,0.029635236000000002,0.029612036,0.0,0.030873857,0.026782833,0.0,0.0,0.03029552,0.026139568999999998,0.026587562999999998,0.0,0.02969392,0.0,0.0,0.028100599999999996,0.027199475
0.0,0.03198655,0.0,0.0,0.0,0.031799233999999996,0.03294727,0.0,0.0,0.0,0.031380504,0.027816696000000002,0.03100736,0.027121363,0.0,0.03149755,0.03464796,0.029635236000000002,0.029612036,0.0,0.030873857,0.026782833,0.0,0.0,0.03029552,0.026139568999999998,0.026587562999999998,0.0,0.02969392,0.0,0.0,0.028100599999999996,0.027199475,0.023787139
0.028100599999999996,0.0,0.0,0.0,0.031799233999999996,0.03294727,0.0,0.0,0.0,0.031380504,0.027816696000000002,0.03100736,0.027121363,0.0,0.03149755,0.03464796,0.029635236000000002,0.029612036,0.0,0.030873857,0.026782833,0.0,0.0,0.03029552,0.026139568999999998,0.026587562999999998,0.0,0.02969392,0.0,0.0,0.0,0.027199475,0.023787139,0.0
0.027199475,0.0,0.0,0.031799233999999996,0.03294727,0.0,0.0,0.0,0.031380504,0.027816696000000002,0.03100736,0.027121363,0.0,0.03149755,0.03464796,0.029635236000000002,0.029612036,0.0,0.030873857,0.026782833,0.0,0.0,0.03029552,0.026139568999999998,0.026587562999999998,0.0,0.02969392,0.0,0.0,0.0,0.028100599999999996,0.023787139,0.0,0.031758003
0.023787139,0.0,0.031799233999999996,0.03294727,0.0,0.0,0.0,0.031380504,0.027816696000000002,0.03100736,0.027121363,0.0,0.03149755,0.03464796,0.029635236000000002,0.029612036,0.0,0.030873857,0.026782833,0.0,0.0,0.03029552,0.026139568999999998,0.026587562999999998,0.0,0.02969392,0.0,0.0,0.0,0.028100599999999996,0.027199475,0.0,0.031758003,0.0
0.0,0.031799233999999996,0.03294727,0.0,0.0,0.0,0.031380504,0.027816696000000002,0.03100736,0.027121363,0.0,0.03149755,0.03464796,0.029635236000000002,0.029612036,0.0,0.030873857,0.026782833,0.0,0.0,0.03029552,0.026139568999999998,0.026587562999999998,0.0,0.02969392,0.0,0.0,0.0,0.028100599999999996,0.027199475,0.023787139,0.031758003,0.0,0.028962977
0.031758003,0.03294727,0.0,0.0,0.0,0.031380504,0.027816696000000002,0.03100736,0.027121363,0.0,0.03149755,0.03464796,0.029635236000000002,0.029612036,0.0,0.030873857,0.026782833,0.0,0.0,0.03029552,0.026139568999999998,0.026587562999999998,0.0,0.02969392,0.0,0.0,0.0,0.028100599999999996,0.027199475,0.023787139,0.0,0.0,0.028962977,0.030119114
0.0,0.0,0.0,0.0,0.031380504,0.027816696000000002,0.03100736,0.027121363,0.0,0.03149755,0.03464796,0.029635236000000002,0.029612036,0.0,0.030873857,0.026782833,0.0,0.0,0.03029552,0.026139568999999998,0.026587562999999998,0.0,0.02969392,0.0,0.0,0.0,0.028100599999999996,0.027199475,0.023787139,0.0,0.031758003,0.028962977,0.030119114,0.030405112
0.028962977,0.0,0.0,0.031380504,0.027816696000000002,0.03100736,0.027121363,0.0,0.03149755,0.03464796,0.029635236000000002,0.029612036,0.0,0.030873857,0.026782833,0.0,0.0,0.03029552,0.026139568999999998,0.026587562999999998,0.0,0.02969392,0.0,0.0,0.0,0.028100599999999996,0.027199475,0.023787139,0.0,0.031758003,0.0,0.030119114,0.030405112,0.027216855
0.030119114,0.0,0.031380504,0.027816696000000002,0.03100736,0.027121363,0.0,0.03149755,0.03464796,0.029635236000000002,0.029612036,0.0,0.030873857,0.026782833,0.0,0.0,0.03029552,0.026139568999999998,0.026587562999999998,0.0,0.02969392,0.0,0.0,0.0,0.028100599999999996,0.027199475,0.023787139,0.0,0.031758003,0.0,0.028962977,0.030405112,0.027216855,0.0
0.030405112,0.031380504,0.027816696000000002,0.03100736,0.027121363,0.0,0.03149755,0.03464796,0.029635236000000002,0.029612036,0.0,0.030873857,0.026782833,0.0,0.0,0.03029552,0.026139568999999998,0.026587562999999998,0.0,0.02969392,0.0,0.0,0.0,0.028100599999999996,0.027199475,0.023787139,0.0,0.031758003,0.0,0.028962977,0.030119114,0.027216855,0.0,0.03175038
0.027216855,0.027816696000000002,0.03100736,0.027121363,0.0,0.03149755,0.03464796,0.029635236000000002,0.029612036,0.0,0.030873857,0.026782833,0.0,0.0,0.03029552,0.026139568999999998,0.026587562999999998,0.0,0.02969392,0.0,0.0,0.0,0.028100599999999996,0.027199475,0.023787139,0.0,0.031758003,0.0,0.028962977,0.030119114,0.030405112,0.0,0.03175038,0.029401382
0.0,0.03100736,0.027121363,0.0,0.03149755,0.03464796,0.029635236000000002,0.029612036,0.0,0.030873857,0.026782833,0.0,0.0,0.03029552,0.026139568999999998,0.026587562999999998,0.0,0.02969392,0.0,0.0,0.0,0.028100599999999996,0.027199475,0.023787139,0.0,0.031758003,0.0,0.028962977,0.030119114,0.030405112,0.027216855,0.03175038,0.029401382,0.0
0.03175038,0.027121363,0.0,0.03149755,0.03464796,0.029635236000000002,0.029612036,0.0,0.030873857,0.026782833,0.0,0.0,0.03029552,0.026139568999999998,0.026587562999999998,0.0,0.02969392,0.0,0.0,0.0,0.028100599999999996,0.027199475,0.023787139,0.0,0.031758003,0.0,0.028962977,0.030119114,0.030405112,0.027216855,0.0,0.029401382,0.0,0.0
0.029401382,0.0,0.03149755,0.03464796,0.029635236000000002,0.029612036,0.0,0.030873857,0.026782833,0.0,0.0,0.03029552,0.026139568999999998,0.026587562999999998,0.0,0.02969392,0.0,0.0,0.0,0.028100599999999996,0.027199475,0.023787139,0.0,0.031758003,0.0,0.028962977,0.030119114,0.030405112,0.027216855,0.0,0.03175038,0.0,0.0,0.02613773
0.0,0.03149755,0.03464796,0.029635236000000002,0.029612036,0.0,0.030873857,0.026782833,0.0,0.0,0.03029552,0.026139568999999998,0.026587562999999998,0.0,0.02969392,0.0,0.0,0.0,0.028100599999999996,0.027199475,0.023787139,0.0,0.031758003,0.0,0.028962977,0.030119114,0.030405112,0.027216855,0.0,0.03175038,0.029401382,0.0,0.02613773,0.0
0.0,0.03464796,0.029635236000000002,0.029612036,0.0,0.030873857,0.026782833,0.0,0.0,0.03029552,0.026139568999999998,0.026587562999999998,0.0,0.02969392,0.0,0.0,0.0,0.028100599999999996,0.027199475,0.023787139,0.0,0.031758003,0.0,0.028962977,0.030119114,0.030405112,0.027216855,0.0,0.03175038,0.029401382,0.0,0.02613773,0.0,0.030978726
0.02613773,0.029635236000000002,0.029612036,0.0,0.030873857,0.026782833,0.0,0.0,0.03029552,0.026139568999999998,0.026587562999999998,0.0,0.02969392,0.0,0.0,0.0,0.028100599999999996,0.027199475,0.023787139,0.0,0.031758003,0.0,0.028962977,0.030119114,0.030405112,0.027216855,0.0,0.03175038,0.029401382,0.0,0.0,0.0,0.030978726,0.0
0.0,0.029612036,0.0,0.030873857,0.026782833,0.0,0.0,0.03029552,0.026139568999999998,0.026587562999999998,0.0,0.02969392,0.0,0.0,0.0,0.028100599999999996,0.027199475,0.023787139,0.0,0.031758003,0.0,0.028962977,0.030119114,0.030405112,0.027216855,0.0,0.03175038,0.029401382,0.0,0.0,0.02613773,0.030978726,0.0,0.023602225
0.030978726,0.0,0.030873857,0.026782833,0.0,0.0,0.03029552,0.026139568999999998,0.026587562999999998,0.0,0.02969392,0.0,0.0,0.0,0.028100599999999996,0.027199475,0.023787139,0.0,0.031758003,0.0,0.028962977,0.030119114,0.030405112,0.027216855,0.0,0.03175038,0.029401382,0.0,0.0,0.02613773,0.0,0.0,0.023602225,0.032046452
0.0,0.030873857,0.026782833,0.0,0.0,0.03029552,0.026139568999999998,0.026587562999999998,0.0,0.02969392,0.0,0.0,0.0,0.028100599999999996,0.027199475,0.023787139,0.0,0.031758003,0.0,0.028962977,0.030119114,0.030405112,0.027216855,0.0,0.03175038,0.029401382,0.0,0.0,0.02613773,0.0,0.030978726,0.023602225,0.032046452,0.031236835
0.023602225,0.026782833,0.0,0.0,0.03029552,0.026139568999999998,0.026587562999999998,0.0,0.02969392,0.0,0.0,0.0,0.028100599999999996,0.027199475,0.023787139,0.0,0.031758003,0.0,0.028962977,0.030119114,0.030405112,0.027216855,0.0,0.03175038,0.029401382,0.0,0.0,0.02613773,0.0,0.030978726,0.0,0.032046452,0.031236835,0.02939457
0.032046452,0.0,0.0,0.03029552,0.026139568999999998,0.026587562999999998,0.0,0.02969392,0.0,0.0,0.0,0.028100599999999996,0.027199475,0.023787139,0.0,0.031758003,0.0,0.028962977,0.030119114,0.030405112,0.027216855,0.0,0.03175038,0.029401382,0.0,0.0,0.02613773,0.0,0.030978726,0.0,0.023602225,0.031236835,0.02939457,0.03695634
0.031236835,0.0,0.03029552,0.026139568999999998,0.026587562999999998,0.0,0.02969392,0.0,0.0,0.0,0.028100599999999996,0.027199475,0.023787139,0.0,0.031758003,0.0,0.028962977,0.030119114,0.030405112,0.027216855,0.0,0.03175038,0.029401382,0.0,0.0,0.02613773,0.0,0.030978726,0.0,0.023602225,0.032046452,0.02939457,0.03695634,0.0317654
0.02939457,0.03029552,0.026139568999999998,0.026587562999999998,0.0,0.02969392,0.0,0.0,0.0,0.028100599999999996,0.027199475,0.023787139,0.0,0.031758003,0.0,0.028962977,0.030119114,0.030405112,0.027216855,0.0,0.03175038,0.029401382,0.0,0.0,0.02613773,0.0,0.030978726,0.0,0.023602225,0.032046452,0.031236835,0.03695634,0.0317654,0.031500667
0.03695634,0.026139568999999998,0.026587562999999998,0.0,0.02969392,0.0,0.0,0.0,0.028100599999999996,0.027199475,0.023787139,0.0,0.031758003,0.0,0.028962977,0.030119114,0.030405112,0.027216855,0.0,0.03175038,0.029401382,0.0,0.0,0.02613773,0.0,0.030978726,0.0,0.023602225,0.032046452,0.031236835,0.02939457,0.0317654,0.031500667,0.026598902
0.0317654,0.026587562999999998,0.0,0.02969392,0.0,0.0,0.0,0.028100599999999996,0.027199475,0.023787139,0.0,0.031758003,0.0,0.028962977,0.030119114,0.030405112,0.027216855,0.0,0.03175038,0.029401382,0.0,0.0,0.02613773,0.0,0.030978726,0.0,0.023602225,0.032046452,0.031236835,0.02939457,0.03695634,0.031500667,0.026598902,0.031096505
0.031500667,0.0,0.02969392,0.0,0.0,0.0,0.028100599999999996,0.027199475,0.023787139,0.0,0.031758003,0.0,0.028962977,0.030119114,0.030405112,0.027216855,0.0,0.03175038,0.029401382,0.0,0.0,0.02613773,0.0,0.030978726,0.0,0.023602225,0.032046452,0.031236835,0.02939457,0.03695634,0.0317654,0.026598902,0.031096505,0.029290475
0.026598902,0.02969392,0.0,0.0,0.0,0.028100599999999996,0.027199475,0.023787139,0.0,0.031758003,0.0,0.028962977,0.030119114,0.030405112,0.027216855,0.0,0.03175038,0.029401382,0.0,0.0,0.02613773,0.0,0.030978726,0.0,0.023602225,0.032046452,0.031236835,0.02939457,0.03695634,0.0317654,0.031500667,0.031096505,0.029290475,0.0
0.031096505,0.0,0.0,0.0,0.028100599999999996,0.027199475,0.023787139,0.0,0.031758003,0.0,0.028962977,0.030119114,0.030405112,0.027216855,0.0,0.03175038,0.029401382,0.0,0.0,0.02613773,0.0,0.030978726,0.0,0.023602225,0.032046452,0.031236835,0.02939457,0.03695634,0.0317654,0.031500667,0.026598902,0.029290475,0.0,0.030402642
0.029290475,0.0,0.0,0.028100599999999996,0.027199475,0.023787139,0.0,0.031758003,0.0,0.028962977,0.030119114,0.030405112,0.027216855,0.0,0.03175038,0.029401382,0.0,0.0,0.02613773,0.0,0.030978726,0.0,0.023602225,0.032046452,0.031236835,0.02939457,0.03695634,0.0317654,0.031500667,0.026598902,0.031096505,0.0,0.030402642,0.029986234
0.0,0.0,0.028100599999999996,0.027199475,0.023787139,0.0,0.031758003,0.0,0.028962977,0.030119114,0.030405112,0.027216855,0.0,0.03175038,0.029401382,0.0,0.0,0.02613773,0.0,0.030978726,0.0,0.023602225,0.032046452,0.031236835,0.02939457,0.03695634,0.0317654,0.031500667,0.026598902,0.031096505,0.029290475,0.030402642,0.029986234,0.03570881
0.030402642,0.028100599999999996,0.027199475,0.023787139,0.0,0.031758003,0.0,0.028962977,0.030119114,0.030405112,0.027216855,0.0,0.03175038,0.029401382,0.0,0.0,0.02613773,0.0,0.030978726,0.0,0.023602225,0.032046452,0.031236835,0.02939457,0.03695634,0.0317654,0.031500667,0.026598902,0.031096505,0.029290475,0.0,0.029986234,0.03570881,0.0299043
0.029986234,0.027199475,0.023787139,0.0,0.031758003,0.0,0.028962977,0.030119114,0.030405112,0.027216855,0.0,0.03175038,0.029401382,0.0,0.0,0.02613773,0.0,0.030978726,0.0,0.023602225,0.032046452,0.031236835,0.02939457,0.03695634,0.0317654,0.031500667,0.026598902,0.031096505,0.029290475,0.0,0.030402642,0.03570881,0.0299043,0.0
0.03570881,0.023787139,0.0,0.031758003,0.0,0.028962977,0.030119114,0.030405112,0.027216855,0.0,0.03175038,0.029401382,0.0,0.0,0.02613773,0.0,0.030978726,0.0,0.023602225,0.032046452,0.031236835,0.02939457,0.03695634,0.0317654,0.031500667,0.026598902,0.031096505,0.029290475,0.0,0.030402642,0.029986234,0.0299043,0.0,0.0
0.0299043,0.0,0.031758003,0.0,0.028962977,0.030119114,0.030405112,0.027216855,0.0,0.03175038,0.029401382,0.0,0.0,0.02613773,0.0,0.030978726,0.0,0.023602225,0.032046452,0.031236835,0.02939457,0.03695634,0.0317654,0.031500667,0.026598902,0.031096505,0.029290475,0.0,0.030402642,0.029986234,0.03570881,0.0,0.0,0.031801384
0.0,0.031758003,0.0,0.028962977,0.030119114,0.030405112,0.027216855,0.0,0.03175038,0.029401382,0.0,0.0,0.02613773,0.0,0.030978726,0.0,0.023602225,0.032046452,0.031236835,0.02939457,0.03695634,0.0317654,0.031500667,0.026598902,0.031096505,0.029290475,0.0,0.030402642,0.029986234,0.03570881,0.0299043,0.0,0.031801384,0.028913462999999997
0.0,0.0,0.028962977,0.030119114,0.030405112,0.027216855,0.0,0.03175038,0.029401382,0.0,0.0,0.02613773,0.0,0.030978726,0.0,0.023602225,0.032046452,0.031236835,0.02939457,0.03695634,0.0317654,0.031500667,0.026598902,0.031096505,0.029290475,0.0,0.030402642,0.029986234,0.03570881,0.0299043,0.0,0.031801384,0.028913462999999997,0.025568518999999998
0.031801384,0.028962977,0.030119114,0.030405112,0.027216855,0.0,0.03175038,0.029401382,0.0,0.0,0.02613773,0.0,0.030978726,0.0,0.023602225,0.032046452,0.031236835,0.02939457,0.03695634,0.0317654,0.031500667,0.026598902,0.031096505,0.029290475,0.0,0.030402642,0.029986234,0.03570881,0.0299043,0.0,0.0,0.028913462999999997,0.025568518999999998,0.031578284
0.028913462999999997,0.030119114,0.030405112,0.027216855,0.0,0.03175038,0.029401382,0.0,0.0,0.02613773,0.0,0.030978726,0.0,0.023602225,0.032046452,0.031236835,0.02939457,0.03695634,0.0317654,0.031500667,0.026598902,0.031096505,0.029290475,0.0,0.030402642,0.029986234,0.03570881,0.0299043,0.0,0.0,0.031801384,0.025568518999999998,0.031578284,0.0
0.025568518999999998,0.030405112,0.027216855,0.0,0.03175038,0.029401382,0.0,0.0,0.02613773,0.0,0.030978726,0.0,0.023602225,0.032046452,0.031236835,0.02939457,0.03695634,0.0317654,0.031500667,0.026598902,0.031096505,0.029290475,0.0,0.030402642,0.029986234,0.03570881,0.0299043,0.0,0.0,0.031801384,0.028913462999999997,0.031578284,0.0,0.0
0.031578284,0.027216855,0.0,0.03175038,0.029401382,0.0,0.0,0.02613773,0.0,0.030978726,0.0,0.023602225,0.032046452,0.031236835,0.02939457,0.03695634,0.0317654,0.031500667,0.026598902,0.031096505,0.029290475,0.0,0.030402642,0.029986234,0.03570881,0.0299043,0.0,0.0,0.031801384,0.028913462999999997,0.025568518999999998,0.0,0.0,0.030884118999999998
0.0,0.0,0.03175038,0.029401382,0.0,0.0,0.02613773,0.0,0.030978726,0.0,0.023602225,0.032046452,0.031236835,0.02939457,0.03695634,0.0317654,0.031500667,0.026598902,0.031096505,0.029290475,0.0,0.030402642,0.029986234,0.03570881,0.0299043,0.0,0.0,0.031801384,0.028913462999999997,0.025568518999999998,0.031578284,0.0,0.030884118999999998,0.026836334
0.0,0.03175038,0.029401382,0.0,0.0,0.02613773,0.0,0.030978726,0.0,0.023602225,0.032046452,0.031236835,0.02939457,0.03695634,0.0317654,0.031500667,0.026598902,0.031096505,0.029290475,0.0,0.030402642,0.029986234,0.03570881,0.0299043,0.0,0.0,0.031801384,0.028913462999999997,0.025568518999999998,0.031578284,0.0,0.030884118999999998,0.026836334,0.028841572000000006
0.030884118999999998,0.029401382,0.0,0.0,0.02613773,0.0,0.030978726,0.0,0.023602225,0.032046452,0.031236835,0.02939457,0.03695634,0.0317654,0.031500667,0.026598902,0.031096505,0.029290475,0.0,0.030402642,0.029986234,0.03570881,0.0299043,0.0,0.0,0.031801384,0.028913462999999997,0.025568518999999998,0.031578284,0.0,0.0,0.026836334,0.028841572000000006,0.02801198
0.026836334,0.0,0.0,0.02613773,0.0,0.030978726,0.0,0.023602225,0.032046452,0.031236835,0.02939457,0.03695634,0.0317654,0.031500667,0.026598902,0.031096505,0.029290475,0.0,0.030402642,0.029986234,0.03570881,0.0299043,0.0,0.0,0.031801384,0.028913462999999997,0.025568518999999998,0.031578284,0.0,0.0,0.030884118999999998,0.028841572000000006,0.02801198,0.027329361
0.028841572000000006,0.0,0.02613773,0.0,0.030978726,0.0,0.023602225,0.032046452,0.031236835,0.02939457,0.03695634,0.0317654,0.031500667,0.026598902,0.031096505,0.029290475,0.0,0.030402642,0.029986234,0.03570881,0.0299043,0.0,0.0,0.031801384,0.028913462999999997,0.025568518999999998,0.031578284,0.0,0.0,0.030884118999999998,0.026836334,0.02801198,0.027329361,0.0
0.02801198,0.02613773,0.0,0.030978726,0.0,0.023602225,0.032046452,0.031236835,0.02939457,0.03695634,0.0317654,0.031500667,0.026598902,0.031096505,0.029290475,0.0,0.030402642,0.029986234,0.03570881,0.0299043,0.0,0.0,0.031801384,0.028913462999999997,0.025568518999999998,0.031578284,0.0,0.0,0.030884118999999998,0.026836334,0.028841572000000006,0.027329361,0.0,0.0
0.027329361,0.0,0.030978726,0.0,0.023602225,0.032046452,0.031236835,0.02939457,0.03695634,0.0317654,0.031500667,0.026598902,0.031096505,0.029290475,0.0,0.030402642,0.029986234,0.03570881,0.0299043,0.0,0.0,0.031801384,0.028913462999999997,0.025568518999999998,0.031578284,0.0,0.0,0.030884118999999998,0.026836334,0.028841572000000006,0.02801198,0.0,0.0,0.0
0.0,0.030978726,0.0,0.023602225,0.032046452,0.031236835,0.02939457,0.03695634,0.0317654,0.031500667,0.026598902,0.031096505,0.029290475,0.0,0.030402642,0.029986234,0.03570881,0.0299043,0.0,0.0,0.031801384,0.028913462999999997,0.025568518999999998,0.031578284,0.0,0.0,0.030884118999999998,0.026836334,0.028841572000000006,0.02801198,0.027329361,0.0,0.0,0.029210947
0.0,0.0,0.023602225,0.032046452,0.031236835,0.02939457,0.03695634,0.0317654,0.031500667,0.026598902,0.031096505,0.029290475,0.0,0.030402642,0.029986234,0.03570881,0.0299043,0.0,0.0,0.031801384,0.028913462999999997,0.025568518999999998,0.031578284,0.0,0.0,0.030884118999999998,0.026836334,0.028841572000000006,0.02801198,0.027329361,0.0,0.0,0.029210947,0.0
0.0,0.023602225,0.032046452,0.031236835,0.02939457,0.03695634,0.0317654,0.031500667,0.026598902,0.031096505,0.029290475,0.0,0.030402642,0.029986234,0.03570881,0.0299043,0.0,0.0,0.031801384,0.028913462999999997,0.025568518999999998,0.031578284,0.0,0.0,0.030884118999999998,0.026836334,0.028841572000000006,0.02801198,0.027329361,0.0,0.0,0.029210947,0.0,0.0
0.029210947,0.032046452,0.031236835,0.02939457,0.03695634,0.0317654,0.031500667,0.026598902,0.031096505,0.029290475,0.0,0.030402642,0.029986234,0.03570881,0.0299043,0.0,0.0,0.031801384,0.028913462999999997,0.025568518999999998,0.031578284,0.0,0.0,0.030884118999999998,0.026836334,0.028841572000000006,0.02801198,0.027329361,0.0,0.0,0.0,0.0,0.0,0.029222537000000007
0.0,0.031236835,0.02939457,0.03695634,0.0317654,0.031500667,0.026598902,0.031096505,0.029290475,0.0,0.030402642,0.029986234,0.03570881,0.0299043,0.0,0.0,0.031801384,0.028913462999999997,0.025568518999999998,0.031578284,0.0,0.0,0.030884118999999998,0.026836334,0.028841572000000006,0.02801198,0.027329361,0.0,0.0,0.0,0.029210947,0.0,0.029222537000000007,0.029535282000000006
0.0,0.02939457,0.03695634,0.0317654,0.031500667,0.026598902,0.031096505,0.029290475,0.0,0.030402642,0.029986234,0.03570881,0.0299043,0.0,0.0,0.031801384,0.028913462999999997,0.025568518999999998,0.031578284,0.0,0.0,0.030884118999999998,0.026836334,0.028841572000000006,0.02801198,0.027329361,0.0,0.0,0.0,0.029210947,0.0,0.029222537000000007,0.029535282000000006,0.0
0.029222537000000007,0.03695634,0.0317654,0.031500667,0.026598902,0.031096505,0.029290475,0.0,0.030402642,0.029986234,0.03570881,0.0299043,0.0,0.0,0.031801384,0.028913462999999997,0.025568518999999998,0.031578284,0.0,0.0,0.030884118999999998,0.026836334,0.028841572000000006,0.02801198,0.027329361,0.0,0.0,0.0,0.029210947,0.0,0.0,0.029535282000000006,0.0,0.03239886
0.029535282000000006,0.0317654,0.031500667,0.026598902,0.031096505,0.029290475,0.0,0.030402642,0.029986234,0.03570881,0.0299043,0.0,0.0,0.031801384,0.028913462999999997,0.025568518999999998,0.031578284,0.0,0.0,0.030884118999999998,0.026836334,0.028841572000000006,0.02801198,0.027329361,0.0,0.0,0.0,0.029210947,0.0,0.0,0.029222537000000007,0.0,0.03239886,0.0
0.0,0.031500667,0.026598902,0.031096505,0.029290475,0.0,0.030402642,0.029986234,0.03570881,0.0299043,0.0,0.0,0.031801384,0.028913462999999997,0.025568518999999998,0.031578284,0.0,0.0,0.030884118999999998,0.026836334,0.028841572000000006,0.02801198,0.027329361,0.0,0.0,0.0,0.029210947,0.0,0.0,0.029222537000000007,0.029535282000000006,0.03239886,0.0,0.03486366
0.03239886,0.026598902,0.031096505,0.029290475,0.0,0.030402642,0.029986234,0.03570881,0.0299043,0.0,0.0,0.031801384,0.028913462999999997,0.025568518999999998,0.031578284,0.0,0.0,0.030884118999999998,0.026836334,0.028841572000000006,0.02801198,0.027329361,0.0,0.0,0.0,0.029210947,0.0,0.0,0.029222537000000007,0.029535282000000006,0.0,0.0,0.03486366,0.026990443
0.0,0.031096505,0.029290475,0.0,0.030402642,0.029986234,0.03570881,0.0299043,0.0,0.0,0.031801384,0.028913462999999997,0.025568518999999998,0.031578284,0.0,0.0,0.030884118999999998,0.026836334,0.028841572000000006,0.02801198,0.027329361,0.0,0.0,0.0,0.029210947,0.0,0.0,0.029222537000000007,0.029535282000000006,0.0,0.03239886,0.03486366,0.026990443,0.029410109
0.03486366,0.029290475,0.0,0.030402642,0.029986234,0.03570881,0.0299043,0.0,0.0,0.031801384,0.028913462999999997,0.025568518999999998,0.031578284,0.0,0.0,0.030884118999999998,0.026836334,0.028841572000000006,0.02801198,0.027329361,0.0,0.0,0.0,0.029210947,0.0,0.0,0.029222537000000007,0.029535282000000006,0.0,0.03239886,0.0,0.026990443,0.029410109,0.026902061
0.026990443,0.0,0.030402642,0.029986234,0.03570881,0.0299043,0.0,0.0,0.031801384,0.028913462999999997,0.025568518999999998,0.031578284,0.0,0.0,0.030884118999999998,0.026836334,0.028841572000000006,0.02801198,0.027329361,0.0,0.0,0.0,0.029210947,0.0,0.0,0.029222537000000007,0.029535282000000006,0.0,0.03239886,0.0,0.03486366,0.029410109,0.026902061,0.0
0.029410109,0.030402642,0.029986234,0.03570881,0.0299043,0.0,0.0,0.031801384,0.028913462999999997,0.025568518999999998,0.031578284,0.0,0.0,0.030884118999999998,0.026836334,0.028841572000000006,0.02801198,0.027329361,0.0,0.0,0.0,0.029210947,0.0,0.0,0.029222537000000007,0.029535282000000006,0.0,0.03239886,0.0,0.03486366,0.026990443,0.026902061,0.0,0.0
0.026902061,0.029986234,0.03570881,0.0299043,0.0,0.0,0.031801384,0.028913462999999997,0.025568518999999998,0.031578284,0.0,0.0,0.030884118999999998,0.026836334,0.028841572000000006,0.02801198,0.027329361,0.0,0.0,0.0,0.029210947,0.0,0.0,0.029222537000000007,0.029535282000000006,0.0,0.03239886,0.0,0.03486366,0.026990443,0.029410109,0.0,0.0,0.030890979
0.0,0.03570881,0.0299043,0.0,0.0,0.031801384,0.028913462999999997,0.025568518999999998,0.031578284,0.0,0.0,0.030884118999999998,0.026836334,0.028841572000000006,0.02801198,0.027329361,0.0,0.0,0.0,0.029210947,0.0,0.0,0.029222537000000007,0.029535282000000006,0.0,0.03239886,0.0,0.03486366,0.026990443,0.029410109,0.026902061,0.0,0.030890979,0.03189038
0.0,0.0299043,0.0,0.0,0.031801384,0.028913462999999997,0.025568518999999998,0.031578284,0.0,0.0,0.030884118999999998,0.026836334,0.028841572000000006,0.02801198,0.027329361,0.0,0.0,0.0,0.029210947,0.0,0.0,0.029222537000000007,0.029535282000000006,0.0,0.03239886,0.0,0.03486366,0.026990443,0.029410109,0.026902061,0.0,0.030890979,0.03189038,0.038728725
0.030890979,0.0,0.0,0.031801384,0.028913462999999997,0.025568518999999998,0.031578284,0.0,0.0,0.030884118999999998,0.026836334,0.028841572000000006,0.02801198,0.027329361,0.0,0.0,0.0,0.029210947,0.0,0.0,0.029222537000000007,0.029535282000000006,0.0,0.03239886,0.0,0.03486366,0.026990443,0.029410109,0.026902061,0.0,0.0,0.03189038,0.038728725,0.0
0.03189038,0.0,0.031801384,0.028913462999999997,0.025568518999999998,0.031578284,0.0,0.0,0.030884118999999998,0.026836334,0.028841572000000006,0.02801198,0.027329361,0.0,0.0,0.0,0.029210947,0.0,0.0,0.029222537000000007,0.029535282000000006,0.0,0.03239886,0.0,0.03486366,0.026990443,0.029410109,0.026902061,0.0,0.0,0.030890979,0.038728725,0.0,0.0
0.038728725,0.031801384,0.028913462999999997,0.025568518999999998,0.031578284,0.0,0.0,0.030884118999999998,0.026836334,0.028841572000000006,0.02801198,0.027329361,0.0,0.0,0.0,0.029210947,0.0,0.0,0.029222537000000007,0.029535282000000006,0.0,0.03239886,0.0,0.03486366,0.026990443,0.029410109,0.026902061,0.0,0.0,0.030890979,0.03189038,0.0,0.0,0.033599444
0.0,0.028913462999999997,0.025568518999999998,0.031578284,0.0,0.0,0.030884118999999998,0.026836334,0.028841572000000006,0.02801198,0.027329361,0.0,0.0,0.0,0.029210947,0.0,0.0,0.029222537000000007,0.029535282000000006,0.0,0.03239886,0.0,0.03486366,0.026990443,0.029410109,0.026902061,0.0,0.0,0.030890979,0.03189038,0.038728725,0.0,0.033599444,0.0
0.0,0.025568518999999998,0.031578284,0.0,0.0,0.030884118999999998,0.026836334,0.028841572000000006,0.02801198,0.027329361,0.0,0.0,0.0,0.029210947,0.0,0.0,0.029222537000000007,0.029535282000000006,0.0,0.03239886,0.0,0.03486366,0.026990443,0.029410109,0.026902061,0.0,0.0,0.030890979,0.03189038,0.038728725,0.0,0.033599444,0.0,0.03362348
0.033599444,0.031578284,0.0,0.0,0.030884118999999998,0.026836334,0.028841572000000006,0.02801198,0.027329361,0.0,0.0,0.0,0.029210947,0.0,0.0,0.029222537000000007,0.029535282000000006,0.0,0.03239886,0.0,0.03486366,0.026990443,0.029410109,0.026902061,0.0,0.0,0.030890979,0.03189038,0.038728725,0.0,0.0,0.0,0.03362348,0.03332672
0.0,0.0,0.0,0.030884118999999998,0.026836334,0.028841572000000006,0.02801198,0.027329361,0.0,0.0,0.0,0.029210947,0.0,0.0,0.029222537000000007,0.029535282000000006,0.0,0.03239886,0.0,0.03486366,0.026990443,0.029410109,0.026902061,0.0,0.0,0.030890979,0.03189038,0.038728725,0.0,0.0,0.033599444,0.03362348,0.03332672,0.03361641
0.03362348,0.0,0.030884118999999998,0.026836334,0.028841572000000006,0.02801198,0.027329361,0.0,0.0,0.0,0.029210947,0.0,0.0,0.029222537000000007,0.029535282000000006,0.0,0.03239886,0.0,0.03486366,0.026990443,0.029410109,0.026902061,0.0,0.0,0.030890979,0.03189038,0.038728725,0.0,0.0,0.033599444,0.0,0.03332672,0.03361641,0.03130918
0.03332672,0.030884118999999998,0.026836334,0.028841572000000006,0.02801198,0.027329361,0.0,0.0,0.0,0.029210947,0.0,0.0,0.029222537000000007,0.029535282000000006,0.0,0.03239886,0.0,0.03486366,0.026990443,0.029410109,0.026902061,0.0,0.0,0.030890979,0.03189038,0.038728725,0.0,0.0,0.033599444,0.0,0.03362348,0.03361641,0.03130918,0.047243614
0.03361641,0.026836334,0.028841572000000006,0.02801198,0.027329361,0.0,0.0,0.0,0.029210947,0.0,0.0,0.029222537000000007,0.029535282000000006,0.0,0.03239886,0.0,0.03486366,0.026990443,0.029410109,0.026902061,0.0,0.0,0.030890979,0.03189038,0.038728725,0.0,0.0,0.033599444,0.0,0.03362348,0.03332672,0.03130918,0.047243614,0.0
0.03130918,0.028841572000000006,0.02801198,0.027329361,0.0,0.0,0.0,0.029210947,0.0,0.0,0.029222537000000007,0.029535282000000006,0.0,0.03239886,0.0,0.03486366,0.026990443,0.029410109,0.026902061,0.0,0.0,0.030890979,0.03189038,0.038728725,0.0,0.0,0.033599444,0.0,0.03362348,0.03332672,0.03361641,0.047243614,0.0,0.0
0.047243614,0.02801198,0.027329361,0.0,0.0,0.0,0.029210947,0.0,0.0,0.029222537000000007,0.029535282000000006,0.0,0.03239886,0.0,0.03486366,0.026990443,0.029410109,0.026902061,0.0,0.0,0.030890979,0.03189038,0.038728725,0.0,0.0,0.033599444,0.0,0.03362348,0.03332672,0.03361641,0.03130918,0.0,0.0,0.035847377
0.0,0.027329361,0.0,0.0,0.0,0.029210947,0.0,0.0,0.029222537000000007,0.029535282000000006,0.0,0.03239886,0.0,0.03486366,0.026990443,0.029410109,0.026902061,0.0,0.0,0.030890979,0.03189038,0.038728725,0.0,0.0,0.033599444,0.0,0.03362348,0.03332672,0.03361641,0.03130918,0.047243614,0.0,0.035847377,0.0
0.0,0.0,0.0,0.0,0.029210947,0.0,0.0,0.029222537000000007,0.029535282000000006,0.0,0.03239886,0.0,0.03486366,0.026990443,0.029410109,0.026902061,0.0,0.0,0.030890979,0.03189038,0.038728725,0.0,0.0,0.033599444,0.0,0.03362348,0.03332672,0.03361641,0.03130918,0.047243614,0.0,0.035847377,0.0,0.036591277
0.035847377,0.0,0.0,0.029210947,0.0,0.0,0.029222537000000007,0.029535282000000006,0.0,0.03239886,0.0,0.03486366,0.026990443,0.029410109,0.026902061,0.0,0.0,0.030890979,0.03189038,0.038728725,0.0,0.0,0.033599444,0.0,0.03362348,0.03332672,0.03361641,0.03130918,0.047243614,0.0,0.0,0.0,0.036591277,0.0
0.0,0.0,0.029210947,0.0,0.0,0.029222537000000007,0.029535282000000006,0.0,0.03239886,0.0,0.03486366,0.026990443,0.029410109,0.026902061,0.0,0.0,0.030890979,0.03189038,0.038728725,0.0,0.0,0.033599444,0.0,0.03362348,0.03332672,0.03361641,0.03130918,0.047243614,0.0,0.0,0.035847377,0.036591277,0.0,0.0
0.036591277,0.029210947,0.0,0.0,0.029222537000000007,0.029535282000000006,0.0,0.03239886,0.0,0.03486366,0.026990443,0.029410109,0.026902061,0.0,0.0,0.030890979,0.03189038,0.038728725,0.0,0.0,0.033599444,0.0,0.03362348,0.03332672,0.03361641,0.03130918,0.047243614,0.0,0.0,0.035847377,0.0,0.0,0.0,0.0
0.0,0.0,0.0,0.029222537000000007,0.029535282000000006,0.0,0.03239886,0.0,0.03486366,0.026990443,0.029410109,0.026902061,0.0,0.0,0.030890979,0.03189038,0.038728725,0.0,0.0,0.033599444,0.0,0.03362348,0.03332672,0.03361641,0.03130918,0.047243614,0.0,0.0,0.035847377,0.0,0.036591277,0.0,0.0,0.0
0.0,0.0,0.029222537000000007,0.029535282000000006,0.0,0.03239886,0.0,0.03486366,0.026990443,0.029410109,0.026902061,0.0,0.0,0.030890979,0.03189038,0.038728725,0.0,0.0,0.033599444,0.0,0.03362348,0.03332672,0.03361641,0.03130918,0.047243614,0.0,0.0,0.035847377,0.0,0.036591277,0.0,0.0,0.0,0.034242764
0.0,0.029222537000000007,0.029535282000000006,0.0,0.03239886,0.0,0.03486366,0.026990443,0.029410109,0.026902061,0.0,0.0,0.030890979,0.03189038,0.038728725,0.0,0.0,0.033599444,0.0,0.03362348,0.03332672,0.03361641,0.03130918,0.047243614,0.0,0.0,0.035847377,0.0,0.036591277,0.0,0.0,0.0,0.034242764,0.0
0.0,0.029535282000000006,0.0,0.03239886,0.0,0.03486366,0.026990443,0.029410109,0.026902061,0.0,0.0,0.030890979,0.03189038,0.038728725,0.0,0.0,0.033599444,0.0,0.03362348,0.03332672,0.03361641,0.03130918,0.047243614,0.0,0.0,0.035847377,0.0,0.036591277,0.0,0.0,0.0,0.034242764,0.0,0.03388498
0.034242764,0.0,0.03239886,0.0,0.03486366,0.026990443,0.029410109,0.026902061,0.0,0.0,0.030890979,0.03189038,0.038728725,0.0,0.0,0.033599444,0.0,0.03362348,0.03332672,0.03361641,0.03130918,0.047243614,0.0,0.0,0.035847377,0.0,0.036591277,0.0,0.0,0.0,0.0,0.0,0.03388498,0.03236502
