latitude,longitude,value
52.49892840473542,4.550142288208009,0.03943741
52.49892840473542,4.614171981811523,0.03943741
52.49892840473542,4.67820167541504,0.037424635
52.49892840473542,4.7422313690185565,0.037424635
52.45880953866191,4.550142288208009,0.039670736
52.45880953866191,4.614171981811523,0.039670736
52.45880953866191,4.67820167541504,0.036756363
52.45880953866191,4.7422313690185565,0.036756363
52.4186906725884,4.550142288208009,0.038728725
52.4186906725884,4.614171981811523,0.038728725
52.4186906725884,4.67820167541504,0.038012773
52.4186906725884,4.7422313690185565,0.038012773
