52.508251,4.49875125,0.0
52.508251,4.53346975,0.0
52.508251,4.56818825,0.0
52.508251,4.60290675,0.0
52.508251,4.63762525,0.0
52.508251,4.6723437500000005,0.0
52.508251,4.70706225,0.0
52.508251,4.74178075,0.0
52.48645500000001,4.49875125,2972.6433
52.48645500000001,4.53346975,2972.6433
52.48645500000001,4.56818825,2972.6433
52.48645500000001,4.60290675,2972.6433
52.48645500000001,4.63762525,2672.1647000000003
52.48645500000001,4.6723437500000005,2672.1647000000003
52.48645500000001,4.70706225,2672.1647000000003
52.48645500000001,4.74178075,2672.1647000000003
52.464659,4.49875125,2972.6433
52.464659,4.53346975,2972.6433
52.464659,4.56818825,2972.6433
52.464659,4.60290675,2972.6433
52.464659,4.63762525,2672.1647000000003
52.464659,4.6723437500000005,2672.1647000000003
52.464659,4.70706225,2672.1647000000003
52.464659,4.74178075,2672.1647000000003
52.442863,4.49875125,2972.6433
52.442863,4.53346975,2972.6433
52.442863,4.56818825,2972.6433
52.442863,4.60290675,2972.6433
52.442863,4.63762525,2672.1647000000003
52.442863,4.6723437500000005,2672.1647000000003
52.442863,4.70706225,2672.1647000000003
52.442863,4.74178075,2672.1647000000003
52.421067,4.49875125,3036.6207999999997
52.421067,4.53346975,3036.6207999999997
52.421067,4.56818825,3036.6207999999997
52.421067,4.60290675,3036.6207999999997
52.421067,4.63762525,0.0
52.421067,4.6723437500000005,0.0
52.421067,4.70706225,0.0
52.421067,4.74178075,0.0
52.399271,4.49875125,0.0
52.399271,4.53346975,3036.6207999999997
52.399271,4.56818825,3036.6207999999997
52.399271,4.60290675,3036.6207999999997
52.399271,4.63762525,0.0
52.399271,4.6723437500000005,0.0
52.399271,4.70706225,0.0
52.399271,4.74178075,0.0
