value,value-30,value-29,value-28,value-27,value-26,value-25,value-24,value-23,value-22,value-21,value-20,value-19,value-18,value-17,value-16,value-15,value-14,value-13,value-12,value-11,value-10,value-9,value-8,value-7,value-6,value-5,value-4,value-3,value-2,value-1,Prediction+1,Prediction+2,Prediction+3
0.03029552,0.0,0.03002327,0.0,0.026813362,0.0,0.0,0.0,0.0,0.0,0.0,0.0,0.031799233999999996,0.030821096,0.0,0.0,0.0,0.031380504,0.027816696000000002,0.029167745,0.027121363,0.0,0.03232714,0.031627722000000004,0.02919753,0.02954039,0.0,0.030873857,0.026782833,0.0,0.0,0.026936326,0.027088942,0.0
0.026936326,0.03002327,0.0,0.026813362,0.0,0.0,0.0,0.0,0.0,0.0,0.0,0.031799233999999996,0.030821096,0.0,0.0,0.0,0.031380504,0.027816696000000002,0.029167745,0.027121363,0.0,0.03232714,0.031627722000000004,0.02919753,0.02954039,0.0,0.030873857,0.026782833,0.0,0.0,0.03029552,0.027088942,0.0,0.0
0.027088942,0.0,0.026813362,0.0,0.0,0.0,0.0,0.0,0.0,0.0,0.031799233999999996,0.030821096,0.0,0.0,0.0,0.031380504,0.027816696000000002,0.029167745,0.027121363,0.0,0.03232714,0.031627722000000004,0.02919753,0.02954039,0.0,0.030873857,0.026782833,0.0,0.0,0.03029552,0.026936326,0.0,0.0,0.0
0.0,0.026813362,0.0,0.0,0.0,0.0,0.0,0.0,0.0,0.031799233999999996,0.030821096,0.0,0.0,0.0,0.031380504,0.027816696000000002,0.029167745,0.027121363,0.0,0.03232714,0.031627722000000004,0.02919753,0.02954039,0.0,0.030873857,0.026782833,0.0,0.0,0.03029552,0.026936326,0.027088942,0.0,0.0,0.028128646
0.0,0.0,0.0,0.0,0.0,0.0,0.0,0.0,0.031799233999999996,0.030821096,0.0,0.0,0.0,0.031380504,0.027816696000000002,0.029167745,0.027121363,0.0,0.03232714,0.031627722000000004,0.02919753,0.02954039,0.0,0.030873857,0.026782833,0.0,0.0,0.03029552,0.026936326,0.027088942,0.0,0.0,0.028128646,0.0
0.0,0.0,0.0,0.0,0.0,0.0,0.0,0.031799233999999996,0.030821096,0.0,0.0,0.0,0.031380504,0.027816696000000002,0.029167745,0.027121363,0.0,0.03232714,0.031627722000000004,0.02919753,0.02954039,0.0,0.030873857,0.026782833,0.0,0.0,0.03029552,0.026936326,0.027088942,0.0,0.0,0.028128646,0.0,0.028100599999999996
0.028128646,0.0,0.0,0.0,0.0,0.0,0.031799233999999996,0.030821096,0.0,0.0,0.0,0.031380504,0.027816696000000002,0.029167745,0.027121363,0.0,0.03232714,0.031627722000000004,0.02919753,0.02954039,0.0,0.030873857,0.026782833,0.0,0.0,0.03029552,0.026936326,0.027088942,0.0,0.0,0.0,0.0,0.028100599999999996,0.027199475
0.0,0.0,0.0,0.0,0.0,0.031799233999999996,0.030821096,0.0,0.0,0.0,0.031380504,0.027816696000000002,0.029167745,0.027121363,0.0,0.03232714,0.031627722000000004,0.02919753,0.02954039,0.0,0.030873857,0.026782833,0.0,0.0,0.03029552,0.026936326,0.027088942,0.0,0.0,0.0,0.028128646,0.028100599999999996,0.027199475,0.026424639
0.028100599999999996,0.0,0.0,0.0,0.031799233999999996,0.030821096,0.0,0.0,0.0,0.031380504,0.027816696000000002,0.029167745,0.027121363,0.0,0.03232714,0.031627722000000004,0.02919753,0.02954039,0.0,0.030873857,0.026782833,0.0,0.0,0.03029552,0.026936326,0.027088942,0.0,0.0,0.0,0.028128646,0.0,0.027199475,0.026424639,0.030984376
0.027199475,0.0,0.0,0.031799233999999996,0.030821096,0.0,0.0,0.0,0.031380504,0.027816696000000002,0.029167745,0.027121363,0.0,0.03232714,0.031627722000000004,0.02919753,0.02954039,0.0,0.030873857,0.026782833,0.0,0.0,0.03029552,0.026936326,0.027088942,0.0,0.0,0.0,0.028128646,0.0,0.028100599999999996,0.026424639,0.030984376,0.032842614
0.026424639,0.0,0.031799233999999996,0.030821096,0.0,0.0,0.0,0.031380504,0.027816696000000002,0.029167745,0.027121363,0.0,0.03232714,0.031627722000000004,0.02919753,0.02954039,0.0,0.030873857,0.026782833,0.0,0.0,0.03029552,0.026936326,0.027088942,0.0,0.0,0.0,0.028128646,0.0,0.028100599999999996,0.027199475,0.030984376,0.032842614,0.028667018
0.030984376,0.031799233999999996,0.030821096,0.0,0.0,0.0,0.031380504,0.027816696000000002,0.029167745,0.027121363,0.0,0.03232714,0.031627722000000004,0.02919753,0.02954039,0.0,0.030873857,0.026782833,0.0,0.0,0.03029552,0.026936326,0.027088942,0.0,0.0,0.0,0.028128646,0.0,0.028100599999999996,0.027199475,0.026424639,0.032842614,0.028667018,0.029905254
0.032842614,0.030821096,0.0,0.0,0.0,0.031380504,0.027816696000000002,0.029167745,0.027121363,0.0,0.03232714,0.031627722000000004,0.02919753,0.02954039,0.0,0.030873857,0.026782833,0.0,0.0,0.03029552,0.026936326,0.027088942,0.0,0.0,0.0,0.028128646,0.0,0.028100599999999996,0.027199475,0.026424639,0.030984376,0.028667018,0.029905254,0.028553579
0.028667018,0.0,0.0,0.0,0.031380504,0.027816696000000002,0.029167745,0.027121363,0.0,0.03232714,0.031627722000000004,0.02919753,0.02954039,0.0,0.030873857,0.026782833,0.0,0.0,0.03029552,0.026936326,0.027088942,0.0,0.0,0.0,0.028128646,0.0,0.028100599999999996,0.027199475,0.026424639,0.030984376,0.032842614,0.029905254,0.028553579,0.030405112
0.029905254,0.0,0.0,0.031380504,0.027816696000000002,0.029167745,0.027121363,0.0,0.03232714,0.031627722000000004,0.02919753,0.02954039,0.0,0.030873857,0.026782833,0.0,0.0,0.03029552,0.026936326,0.027088942,0.0,0.0,0.0,0.028128646,0.0,0.028100599999999996,0.027199475,0.026424639,0.030984376,0.032842614,0.028667018,0.028553579,0.030405112,0.0
0.028553579,0.0,0.031380504,0.027816696000000002,0.029167745,0.027121363,0.0,0.03232714,0.031627722000000004,0.02919753,0.02954039,0.0,0.030873857,0.026782833,0.0,0.0,0.03029552,0.026936326,0.027088942,0.0,0.0,0.0,0.028128646,0.0,0.028100599999999996,0.027199475,0.026424639,0.030984376,0.032842614,0.028667018,0.029905254,0.030405112,0.0,0.029153286
0.030405112,0.031380504,0.027816696000000002,0.029167745,0.027121363,0.0,0.03232714,0.031627722000000004,0.02919753,0.02954039,0.0,0.030873857,0.026782833,0.0,0.0,0.03029552,0.026936326,0.027088942,0.0,0.0,0.0,0.028128646,0.0,0.028100599999999996,0.027199475,0.026424639,0.030984376,0.032842614,0.028667018,0.029905254,0.028553579,0.0,0.029153286,0.025365627999999998
0.0,0.027816696000000002,0.029167745,0.027121363,0.0,0.03232714,0.031627722000000004,0.02919753,0.02954039,0.0,0.030873857,0.026782833,0.0,0.0,0.03029552,0.026936326,0.027088942,0.0,0.0,0.0,0.028128646,0.0,0.028100599999999996,0.027199475,0.026424639,0.030984376,0.032842614,0.028667018,0.029905254,0.028553579,0.030405112,0.029153286,0.025365627999999998,0.029401382
0.029153286,0.029167745,0.027121363,0.0,0.03232714,0.031627722000000004,0.02919753,0.02954039,0.0,0.030873857,0.026782833,0.0,0.0,0.03029552,0.026936326,0.027088942,0.0,0.0,0.0,0.028128646,0.0,0.028100599999999996,0.027199475,0.026424639,0.030984376,0.032842614,0.028667018,0.029905254,0.028553579,0.030405112,0.0,0.025365627999999998,0.029401382,0.0
0.025365627999999998,0.027121363,0.0,0.03232714,0.031627722000000004,0.02919753,0.02954039,0.0,0.030873857,0.026782833,0.0,0.0,0.03029552,0.026936326,0.027088942,0.0,0.0,0.0,0.028128646,0.0,0.028100599999999996,0.027199475,0.026424639,0.030984376,0.032842614,0.028667018,0.029905254,0.028553579,0.030405112,0.0,0.029153286,0.029401382,0.0,0.0
0.029401382,0.0,0.03232714,0.031627722000000004,0.02919753,0.02954039,0.0,0.030873857,0.026782833,0.0,0.0,0.03029552,0.026936326,0.027088942,0.0,0.0,0.0,0.028128646,0.0,0.028100599999999996,0.027199475,0.026424639,0.030984376,0.032842614,0.028667018,0.029905254,0.028553579,0.030405112,0.0,0.029153286,0.025365627999999998,0.0,0.0,0.028228363
0.0,0.03232714,0.031627722000000004,0.02919753,0.02954039,0.0,0.030873857,0.026782833,0.0,0.0,0.03029552,0.026936326,0.027088942,0.0,0.0,0.0,0.028128646,0.0,0.028100599999999996,0.027199475,0.026424639,0.030984376,0.032842614,0.028667018,0.029905254,0.028553579,0.030405112,0.0,0.029153286,0.025365627999999998,0.029401382,0.0,0.028228363,0.0
0.0,0.031627722000000004,0.02919753,0.02954039,0.0,0.030873857,0.026782833,0.0,0.0,0.03029552,0.026936326,0.027088942,0.0,0.0,0.0,0.028128646,0.0,0.028100599999999996,0.027199475,0.026424639,0.030984376,0.032842614,0.028667018,0.029905254,0.028553579,0.030405112,0.0,0.029153286,0.025365627999999998,0.029401382,0.0,0.028228363,0.0,0.0
0.028228363,0.02919753,0.02954039,0.0,0.030873857,0.026782833,0.0,0.0,0.03029552,0.026936326,0.027088942,0.0,0.0,0.0,0.028128646,0.0,0.028100599999999996,0.027199475,0.026424639,0.030984376,0.032842614,0.028667018,0.029905254,0.028553579,0.030405112,0.0,0.029153286,0.025365627999999998,0.029401382,0.0,0.0,0.0,0.0,0.0
0.0,0.02954039,0.0,0.030873857,0.026782833,0.0,0.0,0.03029552,0.026936326,0.027088942,0.0,0.0,0.0,0.028128646,0.0,0.028100599999999996,0.027199475,0.026424639,0.030984376,0.032842614,0.028667018,0.029905254,0.028553579,0.030405112,0.0,0.029153286,0.025365627999999998,0.029401382,0.0,0.0,0.028228363,0.0,0.0,0.029291606
0.0,0.0,0.030873857,0.026782833,0.0,0.0,0.03029552,0.026936326,0.027088942,0.0,0.0,0.0,0.028128646,0.0,0.028100599999999996,0.027199475,0.026424639,0.030984376,0.032842614,0.028667018,0.029905254,0.028553579,0.030405112,0.0,0.029153286,0.025365627999999998,0.029401382,0.0,0.0,0.028228363,0.0,0.0,0.029291606,0.032263115
0.0,0.030873857,0.026782833,0.0,0.0,0.03029552,0.026936326,0.027088942,0.0,0.0,0.0,0.028128646,0.0,0.028100599999999996,0.027199475,0.026424639,0.030984376,0.032842614,0.028667018,0.029905254,0.028553579,0.030405112,0.0,0.029153286,0.025365627999999998,0.029401382,0.0,0.0,0.028228363,0.0,0.0,0.029291606,0.032263115,0.031236835
0.029291606,0.026782833,0.0,0.0,0.03029552,0.026936326,0.027088942,0.0,0.0,0.0,0.028128646,0.0,0.028100599999999996,0.027199475,0.026424639,0.030984376,0.032842614,0.028667018,0.029905254,0.028553579,0.030405112,0.0,0.029153286,0.025365627999999998,0.029401382,0.0,0.0,0.028228363,0.0,0.0,0.0,0.032263115,0.031236835,0.029274654
0.032263115,0.0,0.0,0.03029552,0.026936326,0.027088942,0.0,0.0,0.0,0.028128646,0.0,0.028100599999999996,0.027199475,0.026424639,0.030984376,0.032842614,0.028667018,0.029905254,0.028553579,0.030405112,0.0,0.029153286,0.025365627999999998,0.029401382,0.0,0.0,0.028228363,0.0,0.0,0.0,0.029291606,0.031236835,0.029274654,0.03695634
0.031236835,0.0,0.03029552,0.026936326,0.027088942,0.0,0.0,0.0,0.028128646,0.0,0.028100599999999996,0.027199475,0.026424639,0.030984376,0.032842614,0.028667018,0.029905254,0.028553579,0.030405112,0.0,0.029153286,0.025365627999999998,0.029401382,0.0,0.0,0.028228363,0.0,0.0,0.0,0.029291606,0.032263115,0.029274654,0.03695634,0.0
0.029274654,0.03029552,0.026936326,0.027088942,0.0,0.0,0.0,0.028128646,0.0,0.028100599999999996,0.027199475,0.026424639,0.030984376,0.032842614,0.028667018,0.029905254,0.028553579,0.030405112,0.0,0.029153286,0.025365627999999998,0.029401382,0.0,0.0,0.028228363,0.0,0.0,0.0,0.029291606,0.032263115,0.031236835,0.03695634,0.0,0.031331114
0.03695634,0.026936326,0.027088942,0.0,0.0,0.0,0.028128646,0.0,0.028100599999999996,0.027199475,0.026424639,0.030984376,0.032842614,0.028667018,0.029905254,0.028553579,0.030405112,0.0,0.029153286,0.025365627999999998,0.029401382,0.0,0.0,0.028228363,0.0,0.0,0.0,0.029291606,0.032263115,0.031236835,0.029274654,0.0,0.031331114,0.024322873
0.0,0.027088942,0.0,0.0,0.0,0.028128646,0.0,0.028100599999999996,0.027199475,0.026424639,0.030984376,0.032842614,0.028667018,0.029905254,0.028553579,0.030405112,0.0,0.029153286,0.025365627999999998,0.029401382,0.0,0.0,0.028228363,0.0,0.0,0.0,0.029291606,0.032263115,0.031236835,0.029274654,0.03695634,0.031331114,0.024322873,0.031096505
0.031331114,0.0,0.0,0.0,0.028128646,0.0,0.028100599999999996,0.027199475,0.026424639,0.030984376,0.032842614,0.028667018,0.029905254,0.028553579,0.030405112,0.0,0.029153286,0.025365627999999998,0.029401382,0.0,0.0,0.028228363,0.0,0.0,0.0,0.029291606,0.032263115,0.031236835,0.029274654,0.03695634,0.0,0.024322873,0.031096505,0.028733484
0.024322873,0.0,0.0,0.028128646,0.0,0.028100599999999996,0.027199475,0.026424639,0.030984376,0.032842614,0.028667018,0.029905254,0.028553579,0.030405112,0.0,0.029153286,0.025365627999999998,0.029401382,0.0,0.0,0.028228363,0.0,0.0,0.0,0.029291606,0.032263115,0.031236835,0.029274654,0.03695634,0.0,0.031331114,0.031096505,0.028733484,0.0
0.031096505,0.0,0.028128646,0.0,0.028100599999999996,0.027199475,0.026424639,0.030984376,0.032842614,0.028667018,0.029905254,0.028553579,0.030405112,0.0,0.029153286,0.025365627999999998,0.029401382,0.0,0.0,0.028228363,0.0,0.0,0.0,0.029291606,0.032263115,0.031236835,0.029274654,0.03695634,0.0,0.031331114,0.024322873,0.028733484,0.0,0.030402642
0.028733484,0.028128646,0.0,0.028100599999999996,0.027199475,0.026424639,0.030984376,0.032842614,0.028667018,0.029905254,0.028553579,0.030405112,0.0,0.029153286,0.025365627999999998,0.029401382,0.0,0.0,0.028228363,0.0,0.0,0.0,0.029291606,0.032263115,0.031236835,0.029274654,0.03695634,0.0,0.031331114,0.024322873,0.031096505,0.0,0.030402642,0.035161674
0.0,0.0,0.028100599999999996,0.027199475,0.026424639,0.030984376,0.032842614,0.028667018,0.029905254,0.028553579,0.030405112,0.0,0.029153286,0.025365627999999998,0.029401382,0.0,0.0,0.028228363,0.0,0.0,0.0,0.029291606,0.032263115,0.031236835,0.029274654,0.03695634,0.0,0.031331114,0.024322873,0.031096505,0.028733484,0.030402642,0.035161674,0.031668656
0.030402642,0.028100599999999996,0.027199475,0.026424639,0.030984376,0.032842614,0.028667018,0.029905254,0.028553579,0.030405112,0.0,0.029153286,0.025365627999999998,0.029401382,0.0,0.0,0.028228363,0.0,0.0,0.0,0.029291606,0.032263115,0.031236835,0.029274654,0.03695634,0.0,0.031331114,0.024322873,0.031096505,0.028733484,0.0,0.035161674,0.031668656,0.034543466
0.035161674,0.027199475,0.026424639,0.030984376,0.032842614,0.028667018,0.029905254,0.028553579,0.030405112,0.0,0.029153286,0.025365627999999998,0.029401382,0.0,0.0,0.028228363,0.0,0.0,0.0,0.029291606,0.032263115,0.031236835,0.029274654,0.03695634,0.0,0.031331114,0.024322873,0.031096505,0.028733484,0.0,0.030402642,0.031668656,0.034543466,0.0
0.031668656,0.026424639,0.030984376,0.032842614,0.028667018,0.029905254,0.028553579,0.030405112,0.0,0.029153286,0.025365627999999998,0.029401382,0.0,0.0,0.028228363,0.0,0.0,0.0,0.029291606,0.032263115,0.031236835,0.029274654,0.03695634,0.0,0.031331114,0.024322873,0.031096505,0.028733484,0.0,0.030402642,0.035161674,0.034543466,0.0,0.033285294
0.034543466,0.030984376,0.032842614,0.028667018,0.029905254,0.028553579,0.030405112,0.0,0.029153286,0.025365627999999998,0.029401382,0.0,0.0,0.028228363,0.0,0.0,0.0,0.029291606,0.032263115,0.031236835,0.029274654,0.03695634,0.0,0.031331114,0.024322873,0.031096505,0.028733484,0.0,0.030402642,0.035161674,0.031668656,0.0,0.033285294,0.03326462
0.0,0.032842614,0.028667018,0.029905254,0.028553579,0.030405112,0.0,0.029153286,0.025365627999999998,0.029401382,0.0,0.0,0.028228363,0.0,0.0,0.0,0.029291606,0.032263115,0.031236835,0.029274654,0.03695634,0.0,0.031331114,0.024322873,0.031096505,0.028733484,0.0,0.030402642,0.035161674,0.031668656,0.034543466,0.033285294,0.03326462,0.03361305
0.033285294,0.028667018,0.029905254,0.028553579,0.030405112,0.0,0.029153286,0.025365627999999998,0.029401382,0.0,0.0,0.028228363,0.0,0.0,0.0,0.029291606,0.032263115,0.031236835,0.029274654,0.03695634,0.0,0.031331114,0.024322873,0.031096505,0.028733484,0.0,0.030402642,0.035161674,0.031668656,0.034543466,0.0,0.03326462,0.03361305,0.026172532000000002
0.03326462,0.029905254,0.028553579,0.030405112,0.0,0.029153286,0.025365627999999998,0.029401382,0.0,0.0,0.028228363,0.0,0.0,0.0,0.029291606,0.032263115,0.031236835,0.029274654,0.03695634,0.0,0.031331114,0.024322873,0.031096505,0.028733484,0.0,0.030402642,0.035161674,0.031668656,0.034543466,0.0,0.033285294,0.03361305,0.026172532000000002,0.031578284
0.03361305,0.028553579,0.030405112,0.0,0.029153286,0.025365627999999998,0.029401382,0.0,0.0,0.028228363,0.0,0.0,0.0,0.029291606,0.032263115,0.031236835,0.029274654,0.03695634,0.0,0.031331114,0.024322873,0.031096505,0.028733484,0.0,0.030402642,0.035161674,0.031668656,0.034543466,0.0,0.033285294,0.03326462,0.026172532000000002,0.031578284,0.0
0.026172532000000002,0.030405112,0.0,0.029153286,0.025365627999999998,0.029401382,0.0,0.0,0.028228363,0.0,0.0,0.0,0.029291606,0.032263115,0.031236835,0.029274654,0.03695634,0.0,0.031331114,0.024322873,0.031096505,0.028733484,0.0,0.030402642,0.035161674,0.031668656,0.034543466,0.0,0.033285294,0.03326462,0.03361305,0.031578284,0.0,0.0
0.031578284,0.0,0.029153286,0.025365627999999998,0.029401382,0.0,0.0,0.028228363,0.0,0.0,0.0,0.029291606,0.032263115,0.031236835,0.029274654,0.03695634,0.0,0.031331114,0.024322873,0.031096505,0.028733484,0.0,0.030402642,0.035161674,0.031668656,0.034543466,0.0,0.033285294,0.03326462,0.03361305,0.026172532000000002,0.0,0.0,0.028580887000000006
0.0,0.029153286,0.025365627999999998,0.029401382,0.0,0.0,0.028228363,0.0,0.0,0.0,0.029291606,0.032263115,0.031236835,0.029274654,0.03695634,0.0,0.031331114,0.024322873,0.031096505,0.028733484,0.0,0.030402642,0.035161674,0.031668656,0.034543466,0.0,0.033285294,0.03326462,0.03361305,0.026172532000000002,0.031578284,0.0,0.028580887000000006,0.029640475
0.0,0.025365627999999998,0.029401382,0.0,0.0,0.028228363,0.0,0.0,0.0,0.029291606,0.032263115,0.031236835,0.029274654,0.03695634,0.0,0.031331114,0.024322873,0.031096505,0.028733484,0.0,0.030402642,0.035161674,0.031668656,0.034543466,0.0,0.033285294,0.03326462,0.03361305,0.026172532000000002,0.031578284,0.0,0.028580887000000006,0.029640475,0.028734816
0.028580887000000006,0.029401382,0.0,0.0,0.028228363,0.0,0.0,0.0,0.029291606,0.032263115,0.031236835,0.029274654,0.03695634,0.0,0.031331114,0.024322873,0.031096505,0.028733484,0.0,0.030402642,0.035161674,0.031668656,0.034543466,0.0,0.033285294,0.03326462,0.03361305,0.026172532000000002,0.031578284,0.0,0.0,0.029640475,0.028734816,0.02801198
0.029640475,0.0,0.0,0.028228363,0.0,0.0,0.0,0.029291606,0.032263115,0.031236835,0.029274654,0.03695634,0.0,0.031331114,0.024322873,0.031096505,0.028733484,0.0,0.030402642,0.035161674,0.031668656,0.034543466,0.0,0.033285294,0.03326462,0.03361305,0.026172532000000002,0.031578284,0.0,0.0,0.028580887000000006,0.028734816,0.02801198,0.027329361
0.028734816,0.0,0.028228363,0.0,0.0,0.0,0.029291606,0.032263115,0.031236835,0.029274654,0.03695634,0.0,0.031331114,0.024322873,0.031096505,0.028733484,0.0,0.030402642,0.035161674,0.031668656,0.034543466,0.0,0.033285294,0.03326462,0.03361305,0.026172532000000002,0.031578284,0.0,0.0,0.028580887000000006,0.029640475,0.02801198,0.027329361,0.030162783
0.02801198,0.028228363,0.0,0.0,0.0,0.029291606,0.032263115,0.031236835,0.029274654,0.03695634,0.0,0.031331114,0.024322873,0.031096505,0.028733484,0.0,0.030402642,0.035161674,0.031668656,0.034543466,0.0,0.033285294,0.03326462,0.03361305,0.026172532000000002,0.031578284,0.0,0.0,0.028580887000000006,0.029640475,0.028734816,0.027329361,0.030162783,0.0
0.027329361,0.0,0.0,0.0,0.029291606,0.032263115,0.031236835,0.029274654,0.03695634,0.0,0.031331114,0.024322873,0.031096505,0.028733484,0.0,0.030402642,0.035161674,0.031668656,0.034543466,0.0,0.033285294,0.03326462,0.03361305,0.026172532000000002,0.031578284,0.0,0.0,0.028580887000000006,0.029640475,0.028734816,0.02801198,0.030162783,0.0,0.0
0.030162783,0.0,0.0,0.029291606,0.032263115,0.031236835,0.029274654,0.03695634,0.0,0.031331114,0.024322873,0.031096505,0.028733484,0.0,0.030402642,0.035161674,0.031668656,0.034543466,0.0,0.033285294,0.03326462,0.03361305,0.026172532000000002,0.031578284,0.0,0.0,0.028580887000000006,0.029640475,0.028734816,0.02801198,0.027329361,0.0,0.0,0.029210947
0.0,0.0,0.029291606,0.032263115,0.031236835,0.029274654,0.03695634,0.0,0.031331114,0.024322873,0.031096505,0.028733484,0.0,0.030402642,0.035161674,0.031668656,0.034543466,0.0,0.033285294,0.03326462,0.03361305,0.026172532000000002,0.031578284,0.0,0.0,0.028580887000000006,0.029640475,0.028734816,0.02801198,0.027329361,0.030162783,0.0,0.029210947,0.0
0.0,0.029291606,0.032263115,0.031236835,0.029274654,0.03695634,0.0,0.031331114,0.024322873,0.031096505,0.028733484,0.0,0.030402642,0.035161674,0.031668656,0.034543466,0.0,0.033285294,0.03326462,0.03361305,0.026172532000000002,0.031578284,0.0,0.0,0.028580887000000006,0.029640475,0.028734816,0.02801198,0.027329361,0.030162783,0.0,0.029210947,0.0,0.0
0.029210947,0.032263115,0.031236835,0.029274654,0.03695634,0.0,0.031331114,0.024322873,0.031096505,0.028733484,0.0,0.030402642,0.035161674,0.031668656,0.034543466,0.0,0.033285294,0.03326462,0.03361305,0.026172532000000002,0.031578284,0.0,0.0,0.028580887000000006,0.029640475,0.028734816,0.02801198,0.027329361,0.030162783,0.0,0.0,0.0,0.0,0.03436627
0.0,0.031236835,0.029274654,0.03695634,0.0,0.031331114,0.024322873,0.031096505,0.028733484,0.0,0.030402642,0.035161674,0.031668656,0.034543466,0.0,0.033285294,0.03326462,0.03361305,0.026172532000000002,0.031578284,0.0,0.0,0.028580887000000006,0.029640475,0.028734816,0.02801198,0.027329361,0.030162783,0.0,0.0,0.029210947,0.0,0.03436627,0.03313066
0.0,0.029274654,0.03695634,0.0,0.031331114,0.024322873,0.031096505,0.028733484,0.0,0.030402642,0.035161674,0.031668656,0.034543466,0.0,0.033285294,0.03326462,0.03361305,0.026172532000000002,0.031578284,0.0,0.0,0.028580887000000006,0.029640475,0.028734816,0.02801198,0.027329361,0.030162783,0.0,0.0,0.029210947,0.0,0.03436627,0.03313066,0.0
0.03436627,0.03695634,0.0,0.031331114,0.024322873,0.031096505,0.028733484,0.0,0.030402642,0.035161674,0.031668656,0.034543466,0.0,0.033285294,0.03326462,0.03361305,0.026172532000000002,0.031578284,0.0,0.0,0.028580887000000006,0.029640475,0.028734816,0.02801198,0.027329361,0.030162783,0.0,0.0,0.029210947,0.0,0.0,0.03313066,0.0,0.03239886
0.03313066,0.0,0.031331114,0.024322873,0.031096505,0.028733484,0.0,0.030402642,0.035161674,0.031668656,0.034543466,0.0,0.033285294,0.03326462,0.03361305,0.026172532000000002,0.031578284,0.0,0.0,0.028580887000000006,0.029640475,0.028734816,0.02801198,0.027329361,0.030162783,0.0,0.0,0.029210947,0.0,0.0,0.03436627,0.0,0.03239886,0.0
0.0,0.031331114,0.024322873,0.031096505,0.028733484,0.0,0.030402642,0.035161674,0.031668656,0.034543466,0.0,0.033285294,0.03326462,0.03361305,0.026172532000000002,0.031578284,0.0,0.0,0.028580887000000006,0.029640475,0.028734816,0.02801198,0.027329361,0.030162783,0.0,0.0,0.029210947,0.0,0.0,0.03436627,0.03313066,0.03239886,0.0,0.03474495
0.03239886,0.024322873,0.031096505,0.028733484,0.0,0.030402642,0.035161674,0.031668656,0.034543466,0.0,0.033285294,0.03326462,0.03361305,0.026172532000000002,0.031578284,0.0,0.0,0.028580887000000006,0.029640475,0.028734816,0.02801198,0.027329361,0.030162783,0.0,0.0,0.029210947,0.0,0.0,0.03436627,0.03313066,0.0,0.0,0.03474495,0.031185526
0.0,0.031096505,0.028733484,0.0,0.030402642,0.035161674,0.031668656,0.034543466,0.0,0.033285294,0.03326462,0.03361305,0.026172532000000002,0.031578284,0.0,0.0,0.028580887000000006,0.029640475,0.028734816,0.02801198,0.027329361,0.030162783,0.0,0.0,0.029210947,0.0,0.0,0.03436627,0.03313066,0.0,0.03239886,0.03474495,0.031185526,0.029729046000000002
0.03474495,0.028733484,0.0,0.030402642,0.035161674,0.031668656,0.034543466,0.0,0.033285294,0.03326462,0.03361305,0.026172532000000002,0.031578284,0.0,0.0,0.028580887000000006,0.029640475,0.028734816,0.02801198,0.027329361,0.030162783,0.0,0.0,0.029210947,0.0,0.0,0.03436627,0.03313066,0.0,0.03239886,0.0,0.031185526,0.029729046000000002,0.026902061
0.031185526,0.0,0.030402642,0.035161674,0.031668656,0.034543466,0.0,0.033285294,0.03326462,0.03361305,0.026172532000000002,0.031578284,0.0,0.0,0.028580887000000006,0.029640475,0.028734816,0.02801198,0.027329361,0.030162783,0.0,0.0,0.029210947,0.0,0.0,0.03436627,0.03313066,0.0,0.03239886,0.0,0.03474495,0.029729046000000002,0.026902061,0.0
0.029729046000000002,0.030402642,0.035161674,0.031668656,0.034543466,0.0,0.033285294,0.03326462,0.03361305,0.026172532000000002,0.031578284,0.0,0.0,0.028580887000000006,0.029640475,0.028734816,0.02801198,0.027329361,0.030162783,0.0,0.0,0.029210947,0.0,0.0,0.03436627,0.03313066,0.0,0.03239886,0.0,0.03474495,0.031185526,0.026902061,0.0,0.0
0.026902061,0.035161674,0.031668656,0.034543466,0.0,0.033285294,0.03326462,0.03361305,0.026172532000000002,0.031578284,0.0,0.0,0.028580887000000006,0.029640475,0.028734816,0.02801198,0.027329361,0.030162783,0.0,0.0,0.029210947,0.0,0.0,0.03436627,0.03313066,0.0,0.03239886,0.0,0.03474495,0.031185526,0.029729046000000002,0.0,0.0,0.03408421
0.0,0.031668656,0.034543466,0.0,0.033285294,0.03326462,0.03361305,0.026172532000000002,0.031578284,0.0,0.0,0.028580887000000006,0.029640475,0.028734816,0.02801198,0.027329361,0.030162783,0.0,0.0,0.029210947,0.0,0.0,0.03436627,0.03313066,0.0,0.03239886,0.0,0.03474495,0.031185526,0.029729046000000002,0.026902061,0.0,0.03408421,0.03270025
0.0,0.034543466,0.0,0.033285294,0.03326462,0.03361305,0.026172532000000002,0.031578284,0.0,0.0,0.028580887000000006,0.029640475,0.028734816,0.02801198,0.027329361,0.030162783,0.0,0.0,0.029210947,0.0,0.0,0.03436627,0.03313066,0.0,0.03239886,0.0,0.03474495,0.031185526,0.029729046000000002,0.026902061,0.0,0.03408421,0.03270025,0.038012773
0.03408421,0.0,0.033285294,0.03326462,0.03361305,0.026172532000000002,0.031578284,0.0,0.0,0.028580887000000006,0.029640475,0.028734816,0.02801198,0.027329361,0.030162783,0.0,0.0,0.029210947,0.0,0.0,0.03436627,0.03313066,0.0,0.03239886,0.0,0.03474495,0.031185526,0.029729046000000002,0.026902061,0.0,0.0,0.03270025,0.038012773,0.0
0.03270025,0.033285294,0.03326462,0.03361305,0.026172532000000002,0.031578284,0.0,0.0,0.028580887000000006,0.029640475,0.028734816,0.02801198,0.027329361,0.030162783,0.0,0.0,0.029210947,0.0,0.0,0.03436627,0.03313066,0.0,0.03239886,0.0,0.03474495,0.031185526,0.029729046000000002,0.026902061,0.0,0.0,0.03408421,0.038012773,0.0,0.0
0.038012773,0.03326462,0.03361305,0.026172532000000002,0.031578284,0.0,0.0,0.028580887000000006,0.029640475,0.028734816,0.02801198,0.027329361,0.030162783,0.0,0.0,0.029210947,0.0,0.0,0.03436627,0.03313066,0.0,0.03239886,0.0,0.03474495,0.031185526,0.029729046000000002,0.026902061,0.0,0.0,0.03408421,0.03270025,0.0,0.0,0.031977884
0.0,0.03361305,0.026172532000000002,0.031578284,0.0,0.0,0.028580887000000006,0.029640475,0.028734816,0.02801198,0.027329361,0.030162783,0.0,0.0,0.029210947,0.0,0.0,0.03436627,0.03313066,0.0,0.03239886,0.0,0.03474495,0.031185526,0.029729046000000002,0.026902061,0.0,0.0,0.03408421,0.03270025,0.038012773,0.0,0.031977884,0.0
0.0,0.026172532000000002,0.031578284,0.0,0.0,0.028580887000000006,0.029640475,0.028734816,0.02801198,0.027329361,0.030162783,0.0,0.0,0.029210947,0.0,0.0,0.03436627,0.03313066,0.0,0.03239886,0.0,0.03474495,0.031185526,0.029729046000000002,0.026902061,0.0,0.0,0.03408421,0.03270025,0.038012773,0.0,0.031977884,0.0,0.035898324
0.031977884,0.031578284,0.0,0.0,0.028580887000000006,0.029640475,0.028734816,0.02801198,0.027329361,0.030162783,0.0,0.0,0.029210947,0.0,0.0,0.03436627,0.03313066,0.0,0.03239886,0.0,0.03474495,0.031185526,0.029729046000000002,0.026902061,0.0,0.0,0.03408421,0.03270025,0.038012773,0.0,0.0,0.0,0.035898324,0.03288595
0.0,0.0,0.0,0.028580887000000006,0.029640475,0.028734816,0.02801198,0.027329361,0.030162783,0.0,0.0,0.029210947,0.0,0.0,0.03436627,0.03313066,0.0,0.03239886,0.0,0.03474495,0.031185526,0.029729046000000002,0.026902061,0.0,0.0,0.03408421,0.03270025,0.038012773,0.0,0.0,0.031977884,0.035898324,0.03288595,0.032125033
0.035898324,0.0,0.028580887000000006,0.029640475,0.028734816,0.02801198,0.027329361,0.030162783,0.0,0.0,0.029210947,0.0,0.0,0.03436627,0.03313066,0.0,0.03239886,0.0,0.03474495,0.031185526,0.029729046000000002,0.026902061,0.0,0.0,0.03408421,0.03270025,0.038012773,0.0,0.0,0.031977884,0.0,0.03288595,0.032125033,0.030286366000000002
0.03288595,0.028580887000000006,0.029640475,0.028734816,0.02801198,0.027329361,0.030162783,0.0,0.0,0.029210947,0.0,0.0,0.03436627,0.03313066,0.0,0.03239886,0.0,0.03474495,0.031185526,0.029729046000000002,0.026902061,0.0,0.0,0.03408421,0.03270025,0.038012773,0.0,0.0,0.031977884,0.0,0.035898324,0.032125033,0.030286366000000002,0.046996973
0.032125033,0.029640475,0.028734816,0.02801198,0.027329361,0.030162783,0.0,0.0,0.029210947,0.0,0.0,0.03436627,0.03313066,0.0,0.03239886,0.0,0.03474495,0.031185526,0.029729046000000002,0.026902061,0.0,0.0,0.03408421,0.03270025,0.038012773,0.0,0.0,0.031977884,0.0,0.035898324,0.03288595,0.030286366000000002,0.046996973,0.0
0.030286366000000002,0.028734816,0.02801198,0.027329361,0.030162783,0.0,0.0,0.029210947,0.0,0.0,0.03436627,0.03313066,0.0,0.03239886,0.0,0.03474495,0.031185526,0.029729046000000002,0.026902061,0.0,0.0,0.03408421,0.03270025,0.038012773,0.0,0.0,0.031977884,0.0,0.035898324,0.03288595,0.032125033,0.046996973,0.0,0.0
0.046996973,0.02801198,0.027329361,0.030162783,0.0,0.0,0.029210947,0.0,0.0,0.03436627,0.03313066,0.0,0.03239886,0.0,0.03474495,0.031185526,0.029729046000000002,0.026902061,0.0,0.0,0.03408421,0.03270025,0.038012773,0.0,0.0,0.031977884,0.0,0.035898324,0.03288595,0.032125033,0.030286366000000002,0.0,0.0,0.0
0.0,0.027329361,0.030162783,0.0,0.0,0.029210947,0.0,0.0,0.03436627,0.03313066,0.0,0.03239886,0.0,0.03474495,0.031185526,0.029729046000000002,0.026902061,0.0,0.0,0.03408421,0.03270025,0.038012773,0.0,0.0,0.031977884,0.0,0.035898324,0.03288595,0.032125033,0.030286366000000002,0.046996973,0.0,0.0,0.0
0.0,0.030162783,0.0,0.0,0.029210947,0.0,0.0,0.03436627,0.03313066,0.0,0.03239886,0.0,0.03474495,0.031185526,0.029729046000000002,0.026902061,0.0,0.0,0.03408421,0.03270025,0.038012773,0.0,0.0,0.031977884,0.0,0.035898324,0.03288595,0.032125033,0.030286366000000002,0.046996973,0.0,0.0,0.0,0.035105012000000005
0.0,0.0,0.0,0.029210947,0.0,0.0,0.03436627,0.03313066,0.0,0.03239886,0.0,0.03474495,0.031185526,0.029729046000000002,0.026902061,0.0,0.0,0.03408421,0.03270025,0.038012773,0.0,0.0,0.031977884,0.0,0.035898324,0.03288595,0.032125033,0.030286366000000002,0.046996973,0.0,0.0,0.0,0.035105012000000005,0.0
0.0,0.0,0.029210947,0.0,0.0,0.03436627,0.03313066,0.0,0.03239886,0.0,0.03474495,0.031185526,0.029729046000000002,0.026902061,0.0,0.0,0.03408421,0.03270025,0.038012773,0.0,0.0,0.031977884,0.0,0.035898324,0.03288595,0.032125033,0.030286366000000002,0.046996973,0.0,0.0,0.0,0.035105012000000005,0.0,0.0
0.035105012000000005,0.029210947,0.0,0.0,0.03436627,0.03313066,0.0,0.03239886,0.0,0.03474495,0.031185526,0.029729046000000002,0.026902061,0.0,0.0,0.03408421,0.03270025,0.038012773,0.0,0.0,0.031977884,0.0,0.035898324,0.03288595,0.032125033,0.030286366000000002,0.046996973,0.0,0.0,0.0,0.0,0.0,0.0,0.0
0.0,0.0,0.0,0.03436627,0.03313066,0.0,0.03239886,0.0,0.03474495,0.031185526,0.029729046000000002,0.026902061,0.0,0.0,0.03408421,0.03270025,0.038012773,0.0,0.0,0.031977884,0.0,0.035898324,0.03288595,0.032125033,0.030286366000000002,0.046996973,0.0,0.0,0.0,0.0,0.035105012000000005,0.0,0.0,0.0
0.0,0.0,0.03436627,0.03313066,0.0,0.03239886,0.0,0.03474495,0.031185526,0.029729046000000002,0.026902061,0.0,0.0,0.03408421,0.03270025,0.038012773,0.0,0.0,0.031977884,0.0,0.035898324,0.03288595,0.032125033,0.030286366000000002,0.046996973,0.0,0.0,0.0,0.0,0.035105012000000005,0.0,0.0,0.0,0.03159049
0.0,0.03436627,0.03313066,0.0,0.03239886,0.0,0.03474495,0.031185526,0.029729046000000002,0.026902061,0.0,0.0,0.03408421,0.03270025,0.038012773,0.0,0.0,0.031977884,0.0,0.035898324,0.03288595,0.032125033,0.030286366000000002,0.046996973,0.0,0.0,0.0,0.0,0.035105012000000005,0.0,0.0,0.0,0.03159049,0.0
0.0,0.03313066,0.0,0.03239886,0.0,0.03474495,0.031185526,0.029729046000000002,0.026902061,0.0,0.0,0.03408421,0.03270025,0.038012773,0.0,0.0,0.031977884,0.0,0.035898324,0.03288595,0.032125033,0.030286366000000002,0.046996973,0.0,0.0,0.0,0.0,0.035105012000000005,0.0,0.0,0.0,0.03159049,0.0,0.03388498
0.03159049,0.0,0.03239886,0.0,0.03474495,0.031185526,0.029729046000000002,0.026902061,0.0,0.0,0.03408421,0.03270025,0.038012773,0.0,0.0,0.031977884,0.0,0.035898324,0.03288595,0.032125033,0.030286366000000002,0.046996973,0.0,0.0,0.0,0.0,0.035105012000000005,0.0,0.0,0.0,0.0,0.0,0.03388498,0.03236502
