latitude,longitude,value
52.508251,4.49875125,0.03943741
52.508251,4.53346975,0.03943741
52.508251,4.56818825,0.03943741
52.508251,4.60290675,0.03943741
52.508251,4.63762525,0.03943741
52.508251,4.6723437500000005,0.037424635
52.508251,4.70706225,0.037424635
52.508251,4.74178075,0.037424635
52.48645500000001,4.49875125,0.039670736
52.48645500000001,4.53346975,0.039670736
52.48645500000001,4.56818825,0.039670736
52.48645500000001,4.60290675,0.039670736
52.48645500000001,4.63762525,0.039670736
52.48645500000001,4.6723437500000005,0.036756363
52.48645500000001,4.70706225,0.036756363
52.48645500000001,4.74178075,0.036756363
52.464659,4.49875125,0.039670736
52.464659,4.53346975,0.039670736
52.464659,4.56818825,0.039670736
52.464659,4.60290675,0.039670736
52.464659,4.63762525,0.039670736
52.464659,4.6723437500000005,0.036756363
52.464659,4.70706225,0.036756363
52.464659,4.74178075,0.036756363
52.442863,4.49875125,0.038728725
52.442863,4.53346975,0.038728725
52.442863,4.56818825,0.038728725
52.442863,4.60290675,0.038728725
52.442863,4.63762525,0.038728725
52.442863,4.6723437500000005,0.038012773
52.442863,4.70706225,0.038012773
52.442863,4.74178075,0.038012773
52.421067,4.49875125,0.038728725
52.421067,4.53346975,0.038728725
52.421067,4.56818825,0.038728725
52.421067,4.60290675,0.038728725
52.421067,4.63762525,0.038728725
52.421067,4.6723437500000005,0.038728725
52.421067,4.70706225,0.038012773
52.421067,4.74178075,0.038012773
52.399271,4.49875125,0.0
52.399271,4.53346975,0.03602306
52.399271,4.56818825,0.03602306
52.399271,4.60290675,0.038728725
52.399271,4.63762525,0.038728725
52.399271,4.6723437500000005,0.038728725
52.399271,4.70706225,0.038012773
52.399271,4.74178075,0.0
