latitude,longitude,value
52.49892840473542,4.550142288208009,0.030905787
52.49892840473542,4.614171981811523,0.02727868
52.49892840473542,4.67820167541504,0.02727868
52.49892840473542,4.7422313690185565,0.02851417
52.45880953866191,4.550142288208009,0.030905787
52.45880953866191,4.614171981811523,0.028841572000000003
52.45880953866191,4.67820167541504,0.028841572000000003
52.45880953866191,4.7422313690185565,0.02851417
52.4186906725884,4.550142288208009,0.028836174
52.4186906725884,4.614171981811523,0.028836174
52.4186906725884,4.67820167541504,0.028734816
52.4186906725884,4.7422313690185565,0.028734816
