52.508251,4.49875125,3342.6974
52.508251,4.53346975,3390.552
52.508251,4.56818825,3390.552
52.508251,4.60290675,3390.552
52.508251,4.63762525,3390.552
52.508251,4.6723437500000005,3280.4105
52.508251,4.70706225,3280.4105
52.508251,4.74178075,3280.4105
52.48645500000001,4.49875125,2999.7263
52.48645500000001,4.53346975,3318.1597
52.48645500000001,4.56818825,3318.1597
52.48645500000001,4.60290675,3318.1597
52.48645500000001,4.63762525,3318.1597
52.48645500000001,4.6723437500000005,3280.4105
52.48645500000001,4.70706225,3280.4105
52.48645500000001,4.74178075,3280.4105
52.464659,4.49875125,2999.7263
52.464659,4.53346975,2999.7263
52.464659,4.56818825,3318.1597
52.464659,4.60290675,3318.1597
52.464659,4.63762525,3318.1597
52.464659,4.6723437500000005,3280.4105
52.464659,4.70706225,3280.4105
52.464659,4.74178075,0.0
52.442863,4.49875125,2999.7263
52.442863,4.53346975,3026.9865
52.442863,4.56818825,3217.7113
52.442863,4.60290675,3217.7113
52.442863,4.63762525,3217.7113
52.442863,4.6723437500000005,3217.7113
52.442863,4.70706225,0.0
52.442863,4.74178075,0.0
52.421067,4.49875125,3026.9865
52.421067,4.53346975,3026.9865
52.421067,4.56818825,3217.7113
52.421067,4.60290675,3217.7113
52.421067,4.63762525,3217.7113
52.421067,4.6723437500000005,3217.7113
52.421067,4.70706225,0.0
52.421067,4.74178075,0.0
52.399271,4.49875125,0.0
52.399271,4.53346975,3026.9865
52.399271,4.56818825,3217.7113
52.399271,4.60290675,0.0
52.399271,4.63762525,0.0
52.399271,4.6723437500000005,0.0
52.399271,4.70706225,0.0
52.399271,4.74178075,0.0
