latitude,longitude,value
52.508251,4.49875125,0.03040128
52.508251,4.53346975,0.03040128
52.508251,4.56818825,0.03040128
52.508251,4.60290675,0.031813443
52.508251,4.63762525,0.031813443
52.508251,4.6723437500000005,0.031813443
52.508251,4.70706225,0.02991398
52.508251,4.74178075,0.02991398
52.48645500000001,4.49875125,0.03040128
52.48645500000001,4.53346975,0.03040128
52.48645500000001,4.56818825,0.03040128
52.48645500000001,4.60290675,0.03040128
52.48645500000001,4.63762525,0.033983417
52.48645500000001,4.6723437500000005,0.033983417
52.48645500000001,4.70706225,0.033983417
52.48645500000001,4.74178075,0.029142851
52.464659,4.49875125,0.0
52.464659,4.53346975,0.026999372999999997
52.464659,4.56818825,0.026999372999999997
52.464659,4.60290675,0.026999372999999997
52.464659,4.63762525,0.033983417
52.464659,4.6723437500000005,0.033983417
52.464659,4.70706225,0.033983417
52.464659,4.74178075,0.029142851
52.442863,4.49875125,0.030940767
52.442863,4.53346975,0.026999372999999997
52.442863,4.56818825,0.026999372999999997
52.442863,4.60290675,0.026999372999999997
52.442863,4.63762525,0.033983417
52.442863,4.6723437500000005,0.033983417
52.442863,4.70706225,0.031096505
52.442863,4.74178075,0.02974544
52.421067,4.49875125,0.030940767
52.421067,4.53346975,0.026999372999999997
52.421067,4.56818825,0.0265927
52.421067,4.60290675,0.0265927
52.421067,4.63762525,0.031096505
52.421067,4.6723437500000005,0.031096505
52.421067,4.70706225,0.031096505
52.421067,4.74178075,0.031096505
52.399271,4.49875125,0.0
52.399271,4.53346975,0.028664002
52.399271,4.56818825,0.0265927
52.399271,4.60290675,0.0265927
52.399271,4.63762525,0.0265927
52.399271,4.6723437500000005,0.031096505
52.399271,4.70706225,0.031096505
52.399271,4.74178075,0.0
