latitude,longitude,value
52.49892840473542,4.550142288208009,0.03026733
52.49892840473542,4.614171981811523,0.03026733
52.49892840473542,4.67820167541504,0.028300472000000004
52.49892840473542,4.7422313690185565,0.028941294
52.45880953866191,4.550142288208009,0.03129725
52.45880953866191,4.614171981811523,0.03129725
52.45880953866191,4.67820167541504,0.028300472000000004
52.45880953866191,4.7422313690185565,0.029271537
52.4186906725884,4.550142288208009,0.029602865
52.4186906725884,4.614171981811523,0.02969392
52.4186906725884,4.67820167541504,0.029271537
52.4186906725884,4.7422313690185565,0.029271537
