latitude,longitude,value
52.49892840473542,4.550142288208009,0.028049905
52.49892840473542,4.614171981811523,0.028049905
52.49892840473542,4.67820167541504,0.026233992
52.49892840473542,4.7422313690185565,0.026233992
52.45880953866191,4.550142288208009,0.03175038
52.45880953866191,4.614171981811523,0.03175038
52.45880953866191,4.67820167541504,0.02491781
52.45880953866191,4.7422313690185565,0.02491781
52.4186906725884,4.550142288208009,0.0
52.4186906725884,4.614171981811523,0.03175038
52.4186906725884,4.67820167541504,0.030654467999999997
52.4186906725884,4.7422313690185565,0.025365627999999998
