52.508251,4.49875125,2516.9399
52.508251,4.53346975,3038.414
52.508251,4.56818825,3038.414
52.508251,4.60290675,3038.414
52.508251,4.63762525,3038.414
52.508251,4.6723437500000005,3038.414
52.508251,4.70706225,2884.0566000000003
52.508251,4.74178075,2884.0566000000003
52.48645500000001,4.49875125,2516.9399
52.48645500000001,4.53346975,2516.9399
52.48645500000001,4.56818825,3038.414
52.48645500000001,4.60290675,3038.414
52.48645500000001,4.63762525,3038.414
52.48645500000001,4.6723437500000005,3038.414
52.48645500000001,4.70706225,2884.0566000000003
52.48645500000001,4.74178075,2884.0566000000003
52.464659,4.49875125,2516.9399
52.464659,4.53346975,2516.9399
52.464659,4.56818825,3115.0034
52.464659,4.60290675,3115.0034
52.464659,4.63762525,3115.0034
52.464659,4.6723437500000005,3115.0034
52.464659,4.70706225,0.0
52.464659,4.74178075,0.0
52.442863,4.49875125,2511.4343
52.442863,4.53346975,2511.4343
52.442863,4.56818825,3115.0034
52.442863,4.60290675,3115.0034
52.442863,4.63762525,3115.0034
52.442863,4.6723437500000005,3115.0034
52.442863,4.70706225,0.0
52.442863,4.74178075,0.0
52.421067,4.49875125,2511.4343
52.421067,4.53346975,2511.4343
52.421067,4.56818825,3115.0034
52.421067,4.60290675,3115.0034
52.421067,4.63762525,2810.06
52.421067,4.6723437500000005,2810.06
52.421067,4.70706225,0.0
52.421067,4.74178075,0.0
52.399271,4.49875125,0.0
52.399271,4.53346975,2746.1816
52.399271,4.56818825,2810.06
52.399271,4.60290675,2810.06
52.399271,4.63762525,2810.06
52.399271,4.6723437500000005,2810.06
52.399271,4.70706225,2810.06
52.399271,4.74178075,0.0
