52.508251,4.49875125,0.0
52.508251,4.53346975,2632.7958
52.508251,4.56818825,2632.7958
52.508251,4.60290675,2632.7958
52.508251,4.63762525,3085.4804
52.508251,4.6723437500000005,3085.4804
52.508251,4.70706225,3085.4804
52.508251,4.74178075,3085.4804
52.48645500000001,4.49875125,0.0
52.48645500000001,4.53346975,2632.7958
52.48645500000001,4.56818825,2632.7958
52.48645500000001,4.60290675,2632.7958
52.48645500000001,4.63762525,2632.7958
52.48645500000001,4.6723437500000005,3085.4804
52.48645500000001,4.70706225,3085.4804
52.48645500000001,4.74178075,3085.4804
52.464659,4.49875125,0.0
52.464659,4.53346975,2632.7958
52.464659,4.56818825,2632.7958
52.464659,4.60290675,2896.2977
52.464659,4.63762525,2896.2977
52.464659,4.6723437500000005,3163.2967000000003
52.464659,4.70706225,3163.2967000000003
52.464659,4.74178075,3163.2967000000003
52.442863,4.49875125,0.0
52.442863,4.53346975,0.0
52.442863,4.56818825,2896.2977
52.442863,4.60290675,2896.2977
52.442863,4.63762525,2896.2977
52.442863,4.6723437500000005,3163.2967000000003
52.442863,4.70706225,3163.2967000000003
52.442863,4.74178075,3163.2967000000003
52.421067,4.49875125,0.0
52.421067,4.53346975,0.0
52.421067,4.56818825,2896.2977
52.421067,4.60290675,2896.2977
52.421067,4.63762525,2896.2977
52.421067,4.6723437500000005,2990.5254
52.421067,4.70706225,2990.5254
52.421067,4.74178075,2990.5254
52.399271,4.49875125,0.0
52.399271,4.53346975,2543.0195
52.399271,4.56818825,3147.6025
52.399271,4.60290675,3147.6025
52.399271,4.63762525,3147.6025
52.399271,4.6723437500000005,3147.6025
52.399271,4.70706225,2990.5254
52.399271,4.74178075,0.0
