latitude,longitude,value
52.49892840473542,4.550142288208009,0.029793877000000003
52.49892840473542,4.614171981811523,0.029793877000000003
52.49892840473542,4.67820167541504,0.029793877000000003
52.49892840473542,4.7422313690185565,0.029793877000000003
52.45880953866191,4.550142288208009,0.028311249
52.45880953866191,4.614171981811523,0.028311249
52.45880953866191,4.67820167541504,0.028311249
52.45880953866191,4.7422313690185565,0.028311249
52.4186906725884,4.550142288208009,0.029210947
52.4186906725884,4.614171981811523,0.029210947
52.4186906725884,4.67820167541504,0.029210947
52.4186906725884,4.7422313690185565,0.029210947
