date,latitude,longitude,value
2020-06-01,52.508251,4.6723437500000005,0.0
2020-06-02,52.508251,4.6723437500000005,0.032049
2020-06-03,52.508251,4.6723437500000005,0.0
2020-06-04,52.508251,4.6723437500000005,0.026681837000000003
2020-06-05,52.508251,4.6723437500000005,0.0
2020-06-06,52.508251,4.6723437500000005,0.0
2020-06-07,52.508251,4.6723437500000005,0.0
2020-06-08,52.508251,4.6723437500000005,0.033557914
2020-06-09,52.508251,4.6723437500000005,0.0
2020-06-10,52.508251,4.6723437500000005,0.0
2020-06-11,52.508251,4.6723437500000005,0.0
2020-06-12,52.508251,4.6723437500000005,0.03027703
2020-06-13,52.508251,4.6723437500000005,0.030064462
2020-06-14,52.508251,4.6723437500000005,0.0
2020-06-15,52.508251,4.6723437500000005,0.0
2020-06-16,52.508251,4.6723437500000005,0.0
2020-06-17,52.508251,4.6723437500000005,0.03151536
2020-06-18,52.508251,4.6723437500000005,0.026933257
2020-06-19,52.508251,4.6723437500000005,0.030023066
2020-06-20,52.508251,4.6723437500000005,0.026059452
2020-06-21,52.508251,4.6723437500000005,0.0
2020-06-22,52.508251,4.6723437500000005,0.032476902
2020-06-23,52.508251,4.6723437500000005,0.031285528
2020-06-24,52.508251,4.6723437500000005,0.0
2020-06-25,52.508251,4.6723437500000005,0.029300166
2020-06-26,52.508251,4.6723437500000005,0.0
2020-06-27,52.508251,4.6723437500000005,0.031146334
2020-06-28,52.508251,4.6723437500000005,0.028286228
2020-06-29,52.508251,4.6723437500000005,0.0
2020-06-30,52.508251,4.6723437500000005,0.0
2020-07-01,52.508251,4.6723437500000005,0.029202892
2020-07-02,52.508251,4.6723437500000005,0.025928348
2020-07-03,52.508251,4.6723437500000005,0.02922301
2020-07-04,52.508251,4.6723437500000005,0.0
2020-07-05,52.508251,4.6723437500000005,0.0
2020-07-06,52.508251,4.6723437500000005,0.02573491
2020-07-07,52.508251,4.6723437500000005,0.0
2020-07-08,52.508251,4.6723437500000005,0.028724907
2020-07-09,52.508251,4.6723437500000005,0.03038414
2020-07-10,52.508251,4.6723437500000005,0.0
2020-07-11,52.508251,4.6723437500000005,0.024527721
2020-07-12,52.508251,4.6723437500000005,0.031994846
2020-07-13,52.508251,4.6723437500000005,0.03282359
2020-07-14,52.508251,4.6723437500000005,0.0
2020-07-15,52.508251,4.6723437500000005,0.030854804
2020-07-16,52.508251,4.6723437500000005,0.028711531
2020-07-17,52.508251,4.6723437500000005,0.028173767
2020-07-18,52.508251,4.6723437500000005,0.0
2020-07-19,52.508251,4.6723437500000005,0.0
2020-07-20,52.508251,4.6723437500000005,0.026233992
2020-07-21,52.508251,4.6723437500000005,0.028203351
2020-07-22,52.508251,4.6723437500000005,0.0
2020-07-23,52.508251,4.6723437500000005,0.0
2020-07-24,52.508251,4.6723437500000005,0.024670912000000003
2020-07-25,52.508251,4.6723437500000005,0.0
2020-07-26,52.508251,4.6723437500000005,0.03049781
2020-07-27,52.508251,4.6723437500000005,0.0
2020-07-28,52.508251,4.6723437500000005,0.021084003
2020-07-29,52.508251,4.6723437500000005,0.030026315
2020-07-30,52.508251,4.6723437500000005,0.030741204
2020-07-31,52.508251,4.6723437500000005,0.028856073
2020-08-02,52.508251,4.6723437500000005,0.0
2020-08-03,52.508251,4.6723437500000005,0.0
2020-08-04,52.508251,4.6723437500000005,0.032056708
2020-08-05,52.508251,4.6723437500000005,0.027807284
2020-08-06,52.508251,4.6723437500000005,0.031813443
2020-08-07,52.508251,4.6723437500000005,0.026658114
2020-08-08,52.508251,4.6723437500000005,0.0
2020-08-09,52.508251,4.6723437500000005,0.032410762999999995
2020-08-10,52.508251,4.6723437500000005,0.031192083
2020-08-11,52.508251,4.6723437500000005,0.03284454
2020-08-12,52.508251,4.6723437500000005,0.02608473
2020-08-13,52.508251,4.6723437500000005,0.0
2020-08-14,52.508251,4.6723437500000005,0.0
2020-08-15,52.508251,4.6723437500000005,0.03605427
2020-08-16,52.508251,4.6723437500000005,0.0325103
2020-08-17,52.508251,4.6723437500000005,0.0
2020-08-18,52.508251,4.6723437500000005,0.03217579
2020-08-19,52.508251,4.6723437500000005,0.0
2020-08-20,52.508251,4.6723437500000005,0.0
2020-08-21,52.508251,4.6723437500000005,0.030222587
2020-08-22,52.508251,4.6723437500000005,0.031694483
2020-08-23,52.508251,4.6723437500000005,0.02727868
2020-08-24,52.508251,4.6723437500000005,0.026925886
2020-08-25,52.508251,4.6723437500000005,0.028759463
2020-08-26,52.508251,4.6723437500000005,0.029510714
2020-08-27,52.508251,4.6723437500000005,0.0
2020-08-28,52.508251,4.6723437500000005,0.0
2020-08-29,52.508251,4.6723437500000005,0.029793877000000007
2020-08-30,52.508251,4.6723437500000005,0.0
2020-08-31,52.508251,4.6723437500000005,0.0
2020-09-01,52.508251,4.6723437500000005,0.031109134
2020-09-02,52.508251,4.6723437500000005,0.030389765
2020-09-03,52.508251,4.6723437500000005,0.0
2020-09-04,52.508251,4.6723437500000005,0.030081999
2020-09-05,52.508251,4.6723437500000005,0.0
2020-09-06,52.508251,4.6723437500000005,0.03406208
2020-09-07,52.508251,4.6723437500000005,0.03214582
2020-09-08,52.508251,4.6723437500000005,0.029494686000000006
2020-09-09,52.508251,4.6723437500000005,0.027266998
2020-09-10,52.508251,4.6723437500000005,0.035818199999999994
2020-09-11,52.508251,4.6723437500000005,0.04607521
2020-09-12,52.508251,4.6723437500000005,0.03464678
2020-09-13,52.508251,4.6723437500000005,0.03175871
2020-09-15,52.508251,4.6723437500000005,0.037424635
2020-09-16,52.508251,4.6723437500000005,0.0
2020-09-17,52.508251,4.6723437500000005,0.0
2020-09-18,52.508251,4.6723437500000005,0.03126101
2020-09-19,52.508251,4.6723437500000005,0.0
2020-09-20,52.508251,4.6723437500000005,0.030140063
2020-09-21,52.508251,4.6723437500000005,0.031907238
2020-09-22,52.508251,4.6723437500000005,0.033413064
2020-09-23,52.508251,4.6723437500000005,0.032016635
2020-09-24,52.508251,4.6723437500000005,0.046305872000000005
2020-09-25,52.508251,4.6723437500000005,0.0
2020-09-26,52.508251,4.6723437500000005,0.0
2020-09-27,52.508251,4.6723437500000005,0.0
2020-09-28,52.508251,4.6723437500000005,0.0
2020-09-29,52.508251,4.6723437500000005,0.031412397
2020-09-30,52.508251,4.6723437500000005,0.0
2020-10-01,52.508251,4.6723437500000005,0.0
2020-10-02,52.508251,4.6723437500000005,0.037596907
2020-10-03,52.508251,4.6723437500000005,0.0
2020-10-04,52.508251,4.6723437500000005,0.033527568
2020-10-05,52.508251,4.6723437500000005,0.0
2020-10-06,52.508251,4.6723437500000005,0.033145156
2020-10-07,52.508251,4.6723437500000005,0.031370226
2020-10-08,52.508251,4.6723437500000005,0.032804105
