52.508251,4.49875125,0.0
52.508251,4.53346975,0.0
52.508251,4.56818825,0.0
52.508251,4.60290675,3151.536
52.508251,4.63762525,3151.536
52.508251,4.6723437500000005,3151.536
52.508251,4.70706225,3151.536
52.508251,4.74178075,3151.536
52.48645500000001,4.49875125,0.0
52.48645500000001,4.53346975,0.0
52.48645500000001,4.56818825,0.0
52.48645500000001,4.60290675,3151.536
52.48645500000001,4.63762525,3151.536
52.48645500000001,4.6723437500000005,3151.536
52.48645500000001,4.70706225,3151.536
52.48645500000001,4.74178075,3151.536
52.464659,4.49875125,0.0
52.464659,4.53346975,0.0
52.464659,4.56818825,0.0
52.464659,4.60290675,3134.407
52.464659,4.63762525,3134.407
52.464659,4.6723437500000005,3134.407
52.464659,4.70706225,3134.407
52.464659,4.74178075,3134.407
52.442863,4.49875125,0.0
52.442863,4.53346975,0.0
52.442863,4.56818825,0.0
52.442863,4.60290675,3134.407
52.442863,4.63762525,3134.407
52.442863,4.6723437500000005,3134.407
52.442863,4.70706225,3134.407
52.442863,4.74178075,3134.407
52.421067,4.49875125,3063.3062000000004
52.421067,4.53346975,3063.3062000000004
52.421067,4.56818825,3063.3062000000004
52.421067,4.60290675,3138.0503999999996
52.421067,4.63762525,3138.0503999999996
52.421067,4.6723437500000005,3138.0503999999996
52.421067,4.70706225,3138.0503999999996
52.421067,4.74178075,3138.0503999999996
52.399271,4.49875125,0.0
52.399271,4.53346975,3063.3062000000004
52.399271,4.56818825,3063.3062000000004
52.399271,4.60290675,3138.0503999999996
52.399271,4.63762525,3138.0503999999996
52.399271,4.6723437500000005,3138.0503999999996
52.399271,4.70706225,3138.0503999999996
52.399271,4.74178075,0.0
