52.508251,4.49875125,0.0
52.508251,4.53346975,0.0
52.508251,4.56818825,0.0
52.508251,4.60290675,0.0
52.508251,4.63762525,3271.8360000000002
52.508251,4.6723437500000005,3119.2083
52.508251,4.70706225,3119.2083
52.508251,4.74178075,3119.2083
52.48645500000001,4.49875125,2965.3832
52.48645500000001,4.53346975,2965.3832
52.48645500000001,4.56818825,2965.3832
52.48645500000001,4.60290675,2965.3832
52.48645500000001,4.63762525,3119.2083
52.48645500000001,4.6723437500000005,3119.2083
52.48645500000001,4.70706225,3119.2083
52.48645500000001,4.74178075,3119.2083
52.464659,4.49875125,2965.3832
52.464659,4.53346975,2965.3832
52.464659,4.56818825,2965.3832
52.464659,4.60290675,2965.3832
52.464659,4.63762525,3119.2083
52.464659,4.6723437500000005,3119.2083
52.464659,4.70706225,3119.2083
52.464659,4.74178075,3119.2083
52.442863,4.49875125,2998.6234
52.442863,4.53346975,2998.6234
52.442863,4.56818825,2998.6234
52.442863,4.60290675,2998.6234
52.442863,4.63762525,2998.6234
52.442863,4.6723437500000005,3349.605
52.442863,4.70706225,3349.605
52.442863,4.74178075,3349.605
52.421067,4.49875125,0.0
52.421067,4.53346975,2998.6234
52.421067,4.56818825,2998.6234
52.421067,4.60290675,2998.6234
52.421067,4.63762525,2998.6234
52.421067,4.6723437500000005,3349.605
52.421067,4.70706225,3349.605
52.421067,4.74178075,3349.605
52.399271,4.49875125,0.0
52.399271,4.53346975,2998.6234
52.399271,4.56818825,0.0
52.399271,4.60290675,0.0
52.399271,4.63762525,0.0
52.399271,4.6723437500000005,3516.1674
52.399271,4.70706225,3516.1674
52.399271,4.74178075,0.0
