52.508251,4.49875125,0.0
52.508251,4.53346975,3630.0069999999996
52.508251,4.56818825,3630.0069999999996
52.508251,4.60290675,3630.0069999999996
52.508251,4.63762525,3630.0069999999996
52.508251,4.6723437500000005,0.0
52.508251,4.70706225,0.0
52.508251,4.74178075,0.0
52.48645500000001,4.49875125,3478.262
52.48645500000001,4.53346975,3646.8630000000003
52.48645500000001,4.56818825,3646.8630000000003
52.48645500000001,4.60290675,3646.8630000000003
52.48645500000001,4.63762525,3646.8630000000003
52.48645500000001,4.6723437500000005,3709.2827
52.48645500000001,4.70706225,3709.2827
52.48645500000001,4.74178075,3709.2827
52.464659,4.49875125,3478.262
52.464659,4.53346975,3646.8630000000003
52.464659,4.56818825,3646.8630000000003
52.464659,4.60290675,3646.8630000000003
52.464659,4.63762525,3646.8630000000003
52.464659,4.6723437500000005,3646.8630000000003
52.464659,4.70706225,3709.2827
52.464659,4.74178075,3709.2827
52.442863,4.49875125,3478.262
52.442863,4.53346975,3478.262
52.442863,4.56818825,3646.8630000000003
52.442863,4.60290675,3584.7377
52.442863,4.63762525,3584.7377
52.442863,4.6723437500000005,3584.7377
52.442863,4.70706225,0.0
52.442863,4.74178075,0.0
52.421067,4.49875125,3509.907
52.421067,4.53346975,3509.907
52.421067,4.56818825,3584.7377
52.421067,4.60290675,3584.7377
52.421067,4.63762525,3584.7377
52.421067,4.6723437500000005,3584.7377
52.421067,4.70706225,0.0
52.421067,4.74178075,0.0
52.399271,4.49875125,0.0
52.399271,4.53346975,3509.907
52.399271,4.56818825,3584.7377
52.399271,4.60290675,3584.7377
52.399271,4.63762525,3584.7377
52.399271,4.6723437500000005,0.0
52.399271,4.70706225,0.0
52.399271,4.74178075,0.0
