latitude,longitude,value
52.508251,4.49875125,0.029793877000000003
52.508251,4.53346975,0.029793877000000003
52.508251,4.56818825,0.029793877000000003
52.508251,4.60290675,0.029793877000000003
52.508251,4.63762525,0.029793877000000003
52.508251,4.6723437500000005,0.029793877000000003
52.508251,4.70706225,0.029793877000000003
52.508251,4.74178075,0.029793877000000003
52.48645500000001,4.49875125,0.028311249
52.48645500000001,4.53346975,0.028311249
52.48645500000001,4.56818825,0.028311249
52.48645500000001,4.60290675,0.028311249
52.48645500000001,4.63762525,0.028311249
52.48645500000001,4.6723437500000005,0.029793877000000003
52.48645500000001,4.70706225,0.029793877000000003
52.48645500000001,4.74178075,0.029793877000000003
52.464659,4.49875125,0.028311249
52.464659,4.53346975,0.028311249
52.464659,4.56818825,0.028311249
52.464659,4.60290675,0.028311249
52.464659,4.63762525,0.028311249
52.464659,4.6723437500000005,0.028311249
52.464659,4.70706225,0.028311249
52.464659,4.74178075,0.028311249
52.442863,4.49875125,0.029210947
52.442863,4.53346975,0.029210947
52.442863,4.56818825,0.029210947
52.442863,4.60290675,0.029210947
52.442863,4.63762525,0.028311249
52.442863,4.6723437500000005,0.028311249
52.442863,4.70706225,0.028311249
52.442863,4.74178075,0.028311249
52.421067,4.49875125,0.029210947
52.421067,4.53346975,0.029210947
52.421067,4.56818825,0.029210947
52.421067,4.60290675,0.029210947
52.421067,4.63762525,0.029210947
52.421067,4.6723437500000005,0.029210947
52.421067,4.70706225,0.029210947
52.421067,4.74178075,0.029210947
52.399271,4.49875125,0.0
52.399271,4.53346975,0.027897349
52.399271,4.56818825,0.029210947
52.399271,4.60290675,0.029210947
52.399271,4.63762525,0.029210947
52.399271,4.6723437500000005,0.029210947
52.399271,4.70706225,0.029210947
52.399271,4.74178075,0.0
