latitude,longitude,value
52.49892840473542,4.550142288208009,0.03085293
52.49892840473542,4.614171981811523,0.03085293
52.49892840473542,4.67820167541504,0.031109134
52.49892840473542,4.7422313690185565,0.031109134
52.45880953866191,4.550142288208009,0.027226318
52.45880953866191,4.614171981811523,0.027226318
52.45880953866191,4.67820167541504,0.031827233999999996
52.45880953866191,4.7422313690185565,0.031827233999999996
52.4186906725884,4.550142288208009,0.029222537000000003
52.4186906725884,4.614171981811523,0.029222537000000003
52.4186906725884,4.67820167541504,0.03436627
52.4186906725884,4.7422313690185565,0.03436627
