latitude,longitude,value
52.49892840473542,4.550142288208009,0.028350255
52.49892840473542,4.614171981811523,0.032090682999999995
52.49892840473542,4.67820167541504,0.032090682999999995
52.49892840473542,4.7422313690185565,0.033502374
52.45880953866191,4.550142288208009,0.030988012000000002
52.45880953866191,4.614171981811523,0.030988012000000002
52.45880953866191,4.67820167541504,0.032090682999999995
52.45880953866191,4.7422313690185565,0.033235006
52.4186906725884,4.550142288208009,0.028913462999999997
52.4186906725884,4.614171981811523,0.028913462999999997
52.4186906725884,4.67820167541504,0.02923092
52.4186906725884,4.7422313690185565,0.02923092
