latitude,longitude,value
52.508251,4.49875125,0.0
52.508251,4.53346975,0.0
52.508251,4.56818825,0.0
52.508251,4.60290675,0.030026315
52.508251,4.63762525,0.030026315
52.508251,4.6723437500000005,0.030026315
52.508251,4.70706225,0.030026315
52.508251,4.74178075,0.030026315
52.48645500000001,4.49875125,0.034367412
52.48645500000001,4.53346975,0.034367412
52.48645500000001,4.56818825,0.034367412
52.48645500000001,4.60290675,0.03214978
52.48645500000001,4.63762525,0.03214978
52.48645500000001,4.6723437500000005,0.03214978
52.48645500000001,4.70706225,0.03214978
52.48645500000001,4.74178075,0.03214978
52.464659,4.49875125,0.034367412
52.464659,4.53346975,0.034367412
52.464659,4.56818825,0.034367412
52.464659,4.60290675,0.03214978
52.464659,4.63762525,0.03214978
52.464659,4.6723437500000005,0.03214978
52.464659,4.70706225,0.03214978
52.464659,4.74178075,0.03214978
52.442863,4.49875125,0.035306957
52.442863,4.53346975,0.035306957
52.442863,4.56818825,0.035306957
52.442863,4.60290675,0.032046452
52.442863,4.63762525,0.032046452
52.442863,4.6723437500000005,0.032046452
52.442863,4.70706225,0.032046452
52.442863,4.74178075,0.032046452
52.421067,4.49875125,0.035306957
52.421067,4.53346975,0.035306957
52.421067,4.56818825,0.035306957
52.421067,4.60290675,0.032046452
52.421067,4.63762525,0.032046452
52.421067,4.6723437500000005,0.032046452
52.421067,4.70706225,0.032046452
52.421067,4.74178075,0.032046452
52.399271,4.49875125,0.0
52.399271,4.53346975,0.0
52.399271,4.56818825,0.0
52.399271,4.60290675,0.0
52.399271,4.63762525,0.032263115
52.399271,4.6723437500000005,0.032263115
52.399271,4.70706225,0.032263115
52.399271,4.74178075,0.0
