value,value-30,value-29,value-28,value-27,value-26,value-25,value-24,value-23,value-22,value-21,value-20,value-19,value-18,value-17,value-16,value-15,value-14,value-13,value-12,value-11,value-10,value-9,value-8,value-7,value-6,value-5,value-4,value-3,value-2,value-1,Prediction+1,Prediction+2,Prediction+3
0.029468426000000002,0.0,0.0,0.0,0.0,0.0,0.029726432999999997,0.0,0.031876028,0.031351954,0.0,0.0,0.032007422,0.0,0.0,0.0,0.0,0.0,0.032526605,0.03147652,0.02588413,0.0,0.03149755,0.03464796,0.0,0.03222478,0.0,0.028204566,0.024269098,0.0,0.0,0.023974143,0.02932329,0.0
0.023974143,0.0,0.0,0.0,0.0,0.029726432999999997,0.0,0.031876028,0.031351954,0.0,0.0,0.032007422,0.0,0.0,0.0,0.0,0.0,0.032526605,0.03147652,0.02588413,0.0,0.03149755,0.03464796,0.0,0.03222478,0.0,0.028204566,0.024269098,0.0,0.0,0.029468426000000002,0.02932329,0.0,0.026628386
0.02932329,0.0,0.0,0.0,0.029726432999999997,0.0,0.031876028,0.031351954,0.0,0.0,0.032007422,0.0,0.0,0.0,0.0,0.0,0.032526605,0.03147652,0.02588413,0.0,0.03149755,0.03464796,0.0,0.03222478,0.0,0.028204566,0.024269098,0.0,0.0,0.029468426000000002,0.023974143,0.0,0.026628386,0.0
0.0,0.0,0.0,0.029726432999999997,0.0,0.031876028,0.031351954,0.0,0.0,0.032007422,0.0,0.0,0.0,0.0,0.0,0.032526605,0.03147652,0.02588413,0.0,0.03149755,0.03464796,0.0,0.03222478,0.0,0.028204566,0.024269098,0.0,0.0,0.029468426000000002,0.023974143,0.02932329,0.026628386,0.0,0.0
0.026628386,0.0,0.029726432999999997,0.0,0.031876028,0.031351954,0.0,0.0,0.032007422,0.0,0.0,0.0,0.0,0.0,0.032526605,0.03147652,0.02588413,0.0,0.03149755,0.03464796,0.0,0.03222478,0.0,0.028204566,0.024269098,0.0,0.0,0.029468426000000002,0.023974143,0.02932329,0.0,0.0,0.0,0.0
0.0,0.029726432999999997,0.0,0.031876028,0.031351954,0.0,0.0,0.032007422,0.0,0.0,0.0,0.0,0.0,0.032526605,0.03147652,0.02588413,0.0,0.03149755,0.03464796,0.0,0.03222478,0.0,0.028204566,0.024269098,0.0,0.0,0.029468426000000002,0.023974143,0.02932329,0.0,0.026628386,0.0,0.0,0.025114342999999997
0.0,0.0,0.031876028,0.031351954,0.0,0.0,0.032007422,0.0,0.0,0.0,0.0,0.0,0.032526605,0.03147652,0.02588413,0.0,0.03149755,0.03464796,0.0,0.03222478,0.0,0.028204566,0.024269098,0.0,0.0,0.029468426000000002,0.023974143,0.02932329,0.0,0.026628386,0.0,0.0,0.025114342999999997,0.028911673
0.0,0.031876028,0.031351954,0.0,0.0,0.032007422,0.0,0.0,0.0,0.0,0.0,0.032526605,0.03147652,0.02588413,0.0,0.03149755,0.03464796,0.0,0.03222478,0.0,0.028204566,0.024269098,0.0,0.0,0.029468426000000002,0.023974143,0.02932329,0.0,0.026628386,0.0,0.0,0.025114342999999997,0.028911673,0.027539752
0.025114342999999997,0.031351954,0.0,0.0,0.032007422,0.0,0.0,0.0,0.0,0.0,0.032526605,0.03147652,0.02588413,0.0,0.03149755,0.03464796,0.0,0.03222478,0.0,0.028204566,0.024269098,0.0,0.0,0.029468426000000002,0.023974143,0.02932329,0.0,0.026628386,0.0,0.0,0.0,0.028911673,0.027539752,0.0
0.028911673,0.0,0.0,0.032007422,0.0,0.0,0.0,0.0,0.0,0.032526605,0.03147652,0.02588413,0.0,0.03149755,0.03464796,0.0,0.03222478,0.0,0.028204566,0.024269098,0.0,0.0,0.029468426000000002,0.023974143,0.02932329,0.0,0.026628386,0.0,0.0,0.0,0.025114342999999997,0.027539752,0.0,0.0
0.027539752,0.0,0.032007422,0.0,0.0,0.0,0.0,0.0,0.032526605,0.03147652,0.02588413,0.0,0.03149755,0.03464796,0.0,0.03222478,0.0,0.028204566,0.024269098,0.0,0.0,0.029468426000000002,0.023974143,0.02932329,0.0,0.026628386,0.0,0.0,0.0,0.025114342999999997,0.028911673,0.0,0.0,0.0
0.0,0.032007422,0.0,0.0,0.0,0.0,0.0,0.032526605,0.03147652,0.02588413,0.0,0.03149755,0.03464796,0.0,0.03222478,0.0,0.028204566,0.024269098,0.0,0.0,0.029468426000000002,0.023974143,0.02932329,0.0,0.026628386,0.0,0.0,0.0,0.025114342999999997,0.028911673,0.027539752,0.0,0.0,0.0
0.0,0.0,0.0,0.0,0.0,0.0,0.032526605,0.03147652,0.02588413,0.0,0.03149755,0.03464796,0.0,0.03222478,0.0,0.028204566,0.024269098,0.0,0.0,0.029468426000000002,0.023974143,0.02932329,0.0,0.026628386,0.0,0.0,0.0,0.025114342999999997,0.028911673,0.027539752,0.0,0.0,0.0,0.033310506000000004
0.0,0.0,0.0,0.0,0.0,0.032526605,0.03147652,0.02588413,0.0,0.03149755,0.03464796,0.0,0.03222478,0.0,0.028204566,0.024269098,0.0,0.0,0.029468426000000002,0.023974143,0.02932329,0.0,0.026628386,0.0,0.0,0.0,0.025114342999999997,0.028911673,0.027539752,0.0,0.0,0.0,0.033310506000000004,0.030435007000000007
0.0,0.0,0.0,0.0,0.032526605,0.03147652,0.02588413,0.0,0.03149755,0.03464796,0.0,0.03222478,0.0,0.028204566,0.024269098,0.0,0.0,0.029468426000000002,0.023974143,0.02932329,0.0,0.026628386,0.0,0.0,0.0,0.025114342999999997,0.028911673,0.027539752,0.0,0.0,0.0,0.033310506000000004,0.030435007000000007,0.02604433
0.033310506000000004,0.0,0.0,0.032526605,0.03147652,0.02588413,0.0,0.03149755,0.03464796,0.0,0.03222478,0.0,0.028204566,0.024269098,0.0,0.0,0.029468426000000002,0.023974143,0.02932329,0.0,0.026628386,0.0,0.0,0.0,0.025114342999999997,0.028911673,0.027539752,0.0,0.0,0.0,0.0,0.030435007000000007,0.02604433,0.0
0.030435007000000007,0.0,0.032526605,0.03147652,0.02588413,0.0,0.03149755,0.03464796,0.0,0.03222478,0.0,0.028204566,0.024269098,0.0,0.0,0.029468426000000002,0.023974143,0.02932329,0.0,0.026628386,0.0,0.0,0.0,0.025114342999999997,0.028911673,0.027539752,0.0,0.0,0.0,0.0,0.033310506000000004,0.02604433,0.0,0.0
0.02604433,0.032526605,0.03147652,0.02588413,0.0,0.03149755,0.03464796,0.0,0.03222478,0.0,0.028204566,0.024269098,0.0,0.0,0.029468426000000002,0.023974143,0.02932329,0.0,0.026628386,0.0,0.0,0.0,0.025114342999999997,0.028911673,0.027539752,0.0,0.0,0.0,0.0,0.033310506000000004,0.030435007000000007,0.0,0.0,0.028013559
0.0,0.03147652,0.02588413,0.0,0.03149755,0.03464796,0.0,0.03222478,0.0,0.028204566,0.024269098,0.0,0.0,0.029468426000000002,0.023974143,0.02932329,0.0,0.026628386,0.0,0.0,0.0,0.025114342999999997,0.028911673,0.027539752,0.0,0.0,0.0,0.0,0.033310506000000004,0.030435007000000007,0.02604433,0.0,0.028013559,0.0
0.0,0.02588413,0.0,0.03149755,0.03464796,0.0,0.03222478,0.0,0.028204566,0.024269098,0.0,0.0,0.029468426000000002,0.023974143,0.02932329,0.0,0.026628386,0.0,0.0,0.0,0.025114342999999997,0.028911673,0.027539752,0.0,0.0,0.0,0.0,0.033310506000000004,0.030435007000000007,0.02604433,0.0,0.028013559,0.0,0.0
0.028013559,0.0,0.03149755,0.03464796,0.0,0.03222478,0.0,0.028204566,0.024269098,0.0,0.0,0.029468426000000002,0.023974143,0.02932329,0.0,0.026628386,0.0,0.0,0.0,0.025114342999999997,0.028911673,0.027539752,0.0,0.0,0.0,0.0,0.033310506000000004,0.030435007000000007,0.02604433,0.0,0.0,0.0,0.0,0.02613773
0.0,0.03149755,0.03464796,0.0,0.03222478,0.0,0.028204566,0.024269098,0.0,0.0,0.029468426000000002,0.023974143,0.02932329,0.0,0.026628386,0.0,0.0,0.0,0.025114342999999997,0.028911673,0.027539752,0.0,0.0,0.0,0.0,0.033310506000000004,0.030435007000000007,0.02604433,0.0,0.0,0.028013559,0.0,0.02613773,0.0
0.0,0.03464796,0.0,0.03222478,0.0,0.028204566,0.024269098,0.0,0.0,0.029468426000000002,0.023974143,0.02932329,0.0,0.026628386,0.0,0.0,0.0,0.025114342999999997,0.028911673,0.027539752,0.0,0.0,0.0,0.0,0.033310506000000004,0.030435007000000007,0.02604433,0.0,0.0,0.028013559,0.0,0.02613773,0.0,0.026715278999999998
0.02613773,0.0,0.03222478,0.0,0.028204566,0.024269098,0.0,0.0,0.029468426000000002,0.023974143,0.02932329,0.0,0.026628386,0.0,0.0,0.0,0.025114342999999997,0.028911673,0.027539752,0.0,0.0,0.0,0.0,0.033310506000000004,0.030435007000000007,0.02604433,0.0,0.0,0.028013559,0.0,0.0,0.0,0.026715278999999998,0.0
0.0,0.03222478,0.0,0.028204566,0.024269098,0.0,0.0,0.029468426000000002,0.023974143,0.02932329,0.0,0.026628386,0.0,0.0,0.0,0.025114342999999997,0.028911673,0.027539752,0.0,0.0,0.0,0.0,0.033310506000000004,0.030435007000000007,0.02604433,0.0,0.0,0.028013559,0.0,0.0,0.02613773,0.026715278999999998,0.0,0.019181255
0.026715278999999998,0.0,0.028204566,0.024269098,0.0,0.0,0.029468426000000002,0.023974143,0.02932329,0.0,0.026628386,0.0,0.0,0.0,0.025114342999999997,0.028911673,0.027539752,0.0,0.0,0.0,0.0,0.033310506000000004,0.030435007000000007,0.02604433,0.0,0.0,0.028013559,0.0,0.0,0.02613773,0.0,0.0,0.019181255,0.035306957
0.0,0.028204566,0.024269098,0.0,0.0,0.029468426000000002,0.023974143,0.02932329,0.0,0.026628386,0.0,0.0,0.0,0.025114342999999997,0.028911673,0.027539752,0.0,0.0,0.0,0.0,0.033310506000000004,0.030435007000000007,0.02604433,0.0,0.0,0.028013559,0.0,0.0,0.02613773,0.0,0.026715278999999998,0.019181255,0.035306957,0.0
0.019181255,0.024269098,0.0,0.0,0.029468426000000002,0.023974143,0.02932329,0.0,0.026628386,0.0,0.0,0.0,0.025114342999999997,0.028911673,0.027539752,0.0,0.0,0.0,0.0,0.033310506000000004,0.030435007000000007,0.02604433,0.0,0.0,0.028013559,0.0,0.0,0.02613773,0.0,0.026715278999999998,0.0,0.035306957,0.0,0.025411487000000003
0.035306957,0.0,0.0,0.029468426000000002,0.023974143,0.02932329,0.0,0.026628386,0.0,0.0,0.0,0.025114342999999997,0.028911673,0.027539752,0.0,0.0,0.0,0.0,0.033310506000000004,0.030435007000000007,0.02604433,0.0,0.0,0.028013559,0.0,0.0,0.02613773,0.0,0.026715278999999998,0.0,0.019181255,0.0,0.025411487000000003,0.03695634
0.0,0.0,0.029468426000000002,0.023974143,0.02932329,0.0,0.026628386,0.0,0.0,0.0,0.025114342999999997,0.028911673,0.027539752,0.0,0.0,0.0,0.0,0.033310506000000004,0.030435007000000007,0.02604433,0.0,0.0,0.028013559,0.0,0.0,0.02613773,0.0,0.026715278999999998,0.0,0.019181255,0.035306957,0.025411487000000003,0.03695634,0.0
0.025411487000000003,0.029468426000000002,0.023974143,0.02932329,0.0,0.026628386,0.0,0.0,0.0,0.025114342999999997,0.028911673,0.027539752,0.0,0.0,0.0,0.0,0.033310506000000004,0.030435007000000007,0.02604433,0.0,0.0,0.028013559,0.0,0.0,0.02613773,0.0,0.026715278999999998,0.0,0.019181255,0.035306957,0.0,0.03695634,0.0,0.031500667
0.03695634,0.023974143,0.02932329,0.0,0.026628386,0.0,0.0,0.0,0.025114342999999997,0.028911673,0.027539752,0.0,0.0,0.0,0.0,0.033310506000000004,0.030435007000000007,0.02604433,0.0,0.0,0.028013559,0.0,0.0,0.02613773,0.0,0.026715278999999998,0.0,0.019181255,0.035306957,0.0,0.025411487000000003,0.0,0.031500667,0.024199286
0.0,0.02932329,0.0,0.026628386,0.0,0.0,0.0,0.025114342999999997,0.028911673,0.027539752,0.0,0.0,0.0,0.0,0.033310506000000004,0.030435007000000007,0.02604433,0.0,0.0,0.028013559,0.0,0.0,0.02613773,0.0,0.026715278999999998,0.0,0.019181255,0.035306957,0.0,0.025411487000000003,0.03695634,0.031500667,0.024199286,0.026999372999999997
0.031500667,0.0,0.026628386,0.0,0.0,0.0,0.025114342999999997,0.028911673,0.027539752,0.0,0.0,0.0,0.0,0.033310506000000004,0.030435007000000007,0.02604433,0.0,0.0,0.028013559,0.0,0.0,0.02613773,0.0,0.026715278999999998,0.0,0.019181255,0.035306957,0.0,0.025411487000000003,0.03695634,0.0,0.024199286,0.026999372999999997,0.0
0.024199286,0.026628386,0.0,0.0,0.0,0.025114342999999997,0.028911673,0.027539752,0.0,0.0,0.0,0.0,0.033310506000000004,0.030435007000000007,0.02604433,0.0,0.0,0.028013559,0.0,0.0,0.02613773,0.0,0.026715278999999998,0.0,0.019181255,0.035306957,0.0,0.025411487000000003,0.03695634,0.0,0.031500667,0.026999372999999997,0.0,0.0
0.026999372999999997,0.0,0.0,0.0,0.025114342999999997,0.028911673,0.027539752,0.0,0.0,0.0,0.0,0.033310506000000004,0.030435007000000007,0.02604433,0.0,0.0,0.028013559,0.0,0.0,0.02613773,0.0,0.026715278999999998,0.0,0.019181255,0.035306957,0.0,0.025411487000000003,0.03695634,0.0,0.031500667,0.024199286,0.0,0.0,0.0
0.0,0.0,0.0,0.025114342999999997,0.028911673,0.027539752,0.0,0.0,0.0,0.0,0.033310506000000004,0.030435007000000007,0.02604433,0.0,0.0,0.028013559,0.0,0.0,0.02613773,0.0,0.026715278999999998,0.0,0.019181255,0.035306957,0.0,0.025411487000000003,0.03695634,0.0,0.031500667,0.024199286,0.026999372999999997,0.0,0.0,0.029986234
0.0,0.0,0.025114342999999997,0.028911673,0.027539752,0.0,0.0,0.0,0.0,0.033310506000000004,0.030435007000000007,0.02604433,0.0,0.0,0.028013559,0.0,0.0,0.02613773,0.0,0.026715278999999998,0.0,0.019181255,0.035306957,0.0,0.025411487000000003,0.03695634,0.0,0.031500667,0.024199286,0.026999372999999997,0.0,0.0,0.029986234,0.028617281
0.0,0.025114342999999997,0.028911673,0.027539752,0.0,0.0,0.0,0.0,0.033310506000000004,0.030435007000000007,0.02604433,0.0,0.0,0.028013559,0.0,0.0,0.02613773,0.0,0.026715278999999998,0.0,0.019181255,0.035306957,0.0,0.025411487000000003,0.03695634,0.0,0.031500667,0.024199286,0.026999372999999997,0.0,0.0,0.029986234,0.028617281,0.02844978
0.029986234,0.028911673,0.027539752,0.0,0.0,0.0,0.0,0.033310506000000004,0.030435007000000007,0.02604433,0.0,0.0,0.028013559,0.0,0.0,0.02613773,0.0,0.026715278999999998,0.0,0.019181255,0.035306957,0.0,0.025411487000000003,0.03695634,0.0,0.031500667,0.024199286,0.026999372999999997,0.0,0.0,0.0,0.028617281,0.02844978,0.0
0.028617281,0.027539752,0.0,0.0,0.0,0.0,0.033310506000000004,0.030435007000000007,0.02604433,0.0,0.0,0.028013559,0.0,0.0,0.02613773,0.0,0.026715278999999998,0.0,0.019181255,0.035306957,0.0,0.025411487000000003,0.03695634,0.0,0.031500667,0.024199286,0.026999372999999997,0.0,0.0,0.0,0.029986234,0.02844978,0.0,0.0
0.02844978,0.0,0.0,0.0,0.0,0.033310506000000004,0.030435007000000007,0.02604433,0.0,0.0,0.028013559,0.0,0.0,0.02613773,0.0,0.026715278999999998,0.0,0.019181255,0.035306957,0.0,0.025411487000000003,0.03695634,0.0,0.031500667,0.024199286,0.026999372999999997,0.0,0.0,0.0,0.029986234,0.028617281,0.0,0.0,0.030284437999999997
0.0,0.0,0.0,0.0,0.033310506000000004,0.030435007000000007,0.02604433,0.0,0.0,0.028013559,0.0,0.0,0.02613773,0.0,0.026715278999999998,0.0,0.019181255,0.035306957,0.0,0.025411487000000003,0.03695634,0.0,0.031500667,0.024199286,0.026999372999999997,0.0,0.0,0.0,0.029986234,0.028617281,0.02844978,0.0,0.030284437999999997,0.030988012000000002
0.0,0.0,0.0,0.033310506000000004,0.030435007000000007,0.02604433,0.0,0.0,0.028013559,0.0,0.0,0.02613773,0.0,0.026715278999999998,0.0,0.019181255,0.035306957,0.0,0.025411487000000003,0.03695634,0.0,0.031500667,0.024199286,0.026999372999999997,0.0,0.0,0.0,0.029986234,0.028617281,0.02844978,0.0,0.030284437999999997,0.030988012000000002,0.0
0.030284437999999997,0.0,0.033310506000000004,0.030435007000000007,0.02604433,0.0,0.0,0.028013559,0.0,0.0,0.02613773,0.0,0.026715278999999998,0.0,0.019181255,0.035306957,0.0,0.025411487000000003,0.03695634,0.0,0.031500667,0.024199286,0.026999372999999997,0.0,0.0,0.0,0.029986234,0.028617281,0.02844978,0.0,0.0,0.030988012000000002,0.0,0.031578284
0.030988012000000002,0.033310506000000004,0.030435007000000007,0.02604433,0.0,0.0,0.028013559,0.0,0.0,0.02613773,0.0,0.026715278999999998,0.0,0.019181255,0.035306957,0.0,0.025411487000000003,0.03695634,0.0,0.031500667,0.024199286,0.026999372999999997,0.0,0.0,0.0,0.029986234,0.028617281,0.02844978,0.0,0.0,0.030284437999999997,0.0,0.031578284,0.0
0.0,0.030435007000000007,0.02604433,0.0,0.0,0.028013559,0.0,0.0,0.02613773,0.0,0.026715278999999998,0.0,0.019181255,0.035306957,0.0,0.025411487000000003,0.03695634,0.0,0.031500667,0.024199286,0.026999372999999997,0.0,0.0,0.0,0.029986234,0.028617281,0.02844978,0.0,0.0,0.030284437999999997,0.030988012000000002,0.031578284,0.0,0.0
0.031578284,0.02604433,0.0,0.0,0.028013559,0.0,0.0,0.02613773,0.0,0.026715278999999998,0.0,0.019181255,0.035306957,0.0,0.025411487000000003,0.03695634,0.0,0.031500667,0.024199286,0.026999372999999997,0.0,0.0,0.0,0.029986234,0.028617281,0.02844978,0.0,0.0,0.030284437999999997,0.030988012000000002,0.0,0.0,0.0,0.030884118999999998
0.0,0.0,0.0,0.028013559,0.0,0.0,0.02613773,0.0,0.026715278999999998,0.0,0.019181255,0.035306957,0.0,0.025411487000000003,0.03695634,0.0,0.031500667,0.024199286,0.026999372999999997,0.0,0.0,0.0,0.029986234,0.028617281,0.02844978,0.0,0.0,0.030284437999999997,0.030988012000000002,0.0,0.031578284,0.0,0.030884118999999998,0.028989814
0.0,0.0,0.028013559,0.0,0.0,0.02613773,0.0,0.026715278999999998,0.0,0.019181255,0.035306957,0.0,0.025411487000000003,0.03695634,0.0,0.031500667,0.024199286,0.026999372999999997,0.0,0.0,0.0,0.029986234,0.028617281,0.02844978,0.0,0.0,0.030284437999999997,0.030988012000000002,0.0,0.031578284,0.0,0.030884118999999998,0.028989814,0.028836174
0.030884118999999998,0.028013559,0.0,0.0,0.02613773,0.0,0.026715278999999998,0.0,0.019181255,0.035306957,0.0,0.025411487000000003,0.03695634,0.0,0.031500667,0.024199286,0.026999372999999997,0.0,0.0,0.0,0.029986234,0.028617281,0.02844978,0.0,0.0,0.030284437999999997,0.030988012000000002,0.0,0.031578284,0.0,0.0,0.028989814,0.028836174,0.027326051
0.028989814,0.0,0.0,0.02613773,0.0,0.026715278999999998,0.0,0.019181255,0.035306957,0.0,0.025411487000000003,0.03695634,0.0,0.031500667,0.024199286,0.026999372999999997,0.0,0.0,0.0,0.029986234,0.028617281,0.02844978,0.0,0.0,0.030284437999999997,0.030988012000000002,0.0,0.031578284,0.0,0.0,0.030884118999999998,0.028836174,0.027326051,0.03070344
0.028836174,0.0,0.02613773,0.0,0.026715278999999998,0.0,0.019181255,0.035306957,0.0,0.025411487000000003,0.03695634,0.0,0.031500667,0.024199286,0.026999372999999997,0.0,0.0,0.0,0.029986234,0.028617281,0.02844978,0.0,0.0,0.030284437999999997,0.030988012000000002,0.0,0.031578284,0.0,0.0,0.030884118999999998,0.028989814,0.027326051,0.03070344,0.0
0.027326051,0.02613773,0.0,0.026715278999999998,0.0,0.019181255,0.035306957,0.0,0.025411487000000003,0.03695634,0.0,0.031500667,0.024199286,0.026999372999999997,0.0,0.0,0.0,0.029986234,0.028617281,0.02844978,0.0,0.0,0.030284437999999997,0.030988012000000002,0.0,0.031578284,0.0,0.0,0.030884118999999998,0.028989814,0.028836174,0.03070344,0.0,0.0
0.03070344,0.0,0.026715278999999998,0.0,0.019181255,0.035306957,0.0,0.025411487000000003,0.03695634,0.0,0.031500667,0.024199286,0.026999372999999997,0.0,0.0,0.0,0.029986234,0.028617281,0.02844978,0.0,0.0,0.030284437999999997,0.030988012000000002,0.0,0.031578284,0.0,0.0,0.030884118999999998,0.028989814,0.028836174,0.027326051,0.0,0.0,0.0
0.0,0.026715278999999998,0.0,0.019181255,0.035306957,0.0,0.025411487000000003,0.03695634,0.0,0.031500667,0.024199286,0.026999372999999997,0.0,0.0,0.0,0.029986234,0.028617281,0.02844978,0.0,0.0,0.030284437999999997,0.030988012000000002,0.0,0.031578284,0.0,0.0,0.030884118999999998,0.028989814,0.028836174,0.027326051,0.03070344,0.0,0.0,0.029210947
0.0,0.0,0.019181255,0.035306957,0.0,0.025411487000000003,0.03695634,0.0,0.031500667,0.024199286,0.026999372999999997,0.0,0.0,0.0,0.029986234,0.028617281,0.02844978,0.0,0.0,0.030284437999999997,0.030988012000000002,0.0,0.031578284,0.0,0.0,0.030884118999999998,0.028989814,0.028836174,0.027326051,0.03070344,0.0,0.0,0.029210947,0.0
0.0,0.019181255,0.035306957,0.0,0.025411487000000003,0.03695634,0.0,0.031500667,0.024199286,0.026999372999999997,0.0,0.0,0.0,0.029986234,0.028617281,0.02844978,0.0,0.0,0.030284437999999997,0.030988012000000002,0.0,0.031578284,0.0,0.0,0.030884118999999998,0.028989814,0.028836174,0.027326051,0.03070344,0.0,0.0,0.029210947,0.0,0.03162768
0.029210947,0.035306957,0.0,0.025411487000000003,0.03695634,0.0,0.031500667,0.024199286,0.026999372999999997,0.0,0.0,0.0,0.029986234,0.028617281,0.02844978,0.0,0.0,0.030284437999999997,0.030988012000000002,0.0,0.031578284,0.0,0.0,0.030884118999999998,0.028989814,0.028836174,0.027326051,0.03070344,0.0,0.0,0.0,0.0,0.03162768,0.03129939
0.0,0.0,0.025411487000000003,0.03695634,0.0,0.031500667,0.024199286,0.026999372999999997,0.0,0.0,0.0,0.029986234,0.028617281,0.02844978,0.0,0.0,0.030284437999999997,0.030988012000000002,0.0,0.031578284,0.0,0.0,0.030884118999999998,0.028989814,0.028836174,0.027326051,0.03070344,0.0,0.0,0.0,0.029210947,0.03162768,0.03129939,0.0
0.03162768,0.025411487000000003,0.03695634,0.0,0.031500667,0.024199286,0.026999372999999997,0.0,0.0,0.0,0.029986234,0.028617281,0.02844978,0.0,0.0,0.030284437999999997,0.030988012000000002,0.0,0.031578284,0.0,0.0,0.030884118999999998,0.028989814,0.028836174,0.027326051,0.03070344,0.0,0.0,0.0,0.029210947,0.0,0.03129939,0.0,0.0
0.03129939,0.03695634,0.0,0.031500667,0.024199286,0.026999372999999997,0.0,0.0,0.0,0.029986234,0.028617281,0.02844978,0.0,0.0,0.030284437999999997,0.030988012000000002,0.0,0.031578284,0.0,0.0,0.030884118999999998,0.028989814,0.028836174,0.027326051,0.03070344,0.0,0.0,0.0,0.029210947,0.0,0.03162768,0.0,0.0,0.028890343
0.0,0.0,0.031500667,0.024199286,0.026999372999999997,0.0,0.0,0.0,0.029986234,0.028617281,0.02844978,0.0,0.0,0.030284437999999997,0.030988012000000002,0.0,0.031578284,0.0,0.0,0.030884118999999998,0.028989814,0.028836174,0.027326051,0.03070344,0.0,0.0,0.0,0.029210947,0.0,0.03162768,0.03129939,0.0,0.028890343,0.0
0.0,0.031500667,0.024199286,0.026999372999999997,0.0,0.0,0.0,0.029986234,0.028617281,0.02844978,0.0,0.0,0.030284437999999997,0.030988012000000002,0.0,0.031578284,0.0,0.0,0.030884118999999998,0.028989814,0.028836174,0.027326051,0.03070344,0.0,0.0,0.0,0.029210947,0.0,0.03162768,0.03129939,0.0,0.028890343,0.0,0.033673834
0.028890343,0.024199286,0.026999372999999997,0.0,0.0,0.0,0.029986234,0.028617281,0.02844978,0.0,0.0,0.030284437999999997,0.030988012000000002,0.0,0.031578284,0.0,0.0,0.030884118999999998,0.028989814,0.028836174,0.027326051,0.03070344,0.0,0.0,0.0,0.029210947,0.0,0.03162768,0.03129939,0.0,0.0,0.0,0.033673834,0.027273827999999996
0.0,0.026999372999999997,0.0,0.0,0.0,0.029986234,0.028617281,0.02844978,0.0,0.0,0.030284437999999997,0.030988012000000002,0.0,0.031578284,0.0,0.0,0.030884118999999998,0.028989814,0.028836174,0.027326051,0.03070344,0.0,0.0,0.0,0.029210947,0.0,0.03162768,0.03129939,0.0,0.0,0.028890343,0.033673834,0.027273827999999996,0.033234645
0.033673834,0.0,0.0,0.0,0.029986234,0.028617281,0.02844978,0.0,0.0,0.030284437999999997,0.030988012000000002,0.0,0.031578284,0.0,0.0,0.030884118999999998,0.028989814,0.028836174,0.027326051,0.03070344,0.0,0.0,0.0,0.029210947,0.0,0.03162768,0.03129939,0.0,0.0,0.028890343,0.0,0.027273827999999996,0.033234645,0.02680844
0.027273827999999996,0.0,0.0,0.029986234,0.028617281,0.02844978,0.0,0.0,0.030284437999999997,0.030988012000000002,0.0,0.031578284,0.0,0.0,0.030884118999999998,0.028989814,0.028836174,0.027326051,0.03070344,0.0,0.0,0.0,0.029210947,0.0,0.03162768,0.03129939,0.0,0.0,0.028890343,0.0,0.033673834,0.033234645,0.02680844,0.0
0.033234645,0.0,0.029986234,0.028617281,0.02844978,0.0,0.0,0.030284437999999997,0.030988012000000002,0.0,0.031578284,0.0,0.0,0.030884118999999998,0.028989814,0.028836174,0.027326051,0.03070344,0.0,0.0,0.0,0.029210947,0.0,0.03162768,0.03129939,0.0,0.0,0.028890343,0.0,0.033673834,0.027273827999999996,0.02680844,0.0,0.05047475
0.02680844,0.029986234,0.028617281,0.02844978,0.0,0.0,0.030284437999999997,0.030988012000000002,0.0,0.031578284,0.0,0.0,0.030884118999999998,0.028989814,0.028836174,0.027326051,0.03070344,0.0,0.0,0.0,0.029210947,0.0,0.03162768,0.03129939,0.0,0.0,0.028890343,0.0,0.033673834,0.027273827999999996,0.033234645,0.0,0.05047475,0.032797456
0.0,0.028617281,0.02844978,0.0,0.0,0.030284437999999997,0.030988012000000002,0.0,0.031578284,0.0,0.0,0.030884118999999998,0.028989814,0.028836174,0.027326051,0.03070344,0.0,0.0,0.0,0.029210947,0.0,0.03162768,0.03129939,0.0,0.0,0.028890343,0.0,0.033673834,0.027273827999999996,0.033234645,0.02680844,0.05047475,0.032797456,0.0
0.05047475,0.02844978,0.0,0.0,0.030284437999999997,0.030988012000000002,0.0,0.031578284,0.0,0.0,0.030884118999999998,0.028989814,0.028836174,0.027326051,0.03070344,0.0,0.0,0.0,0.029210947,0.0,0.03162768,0.03129939,0.0,0.0,0.028890343,0.0,0.033673834,0.027273827999999996,0.033234645,0.02680844,0.0,0.032797456,0.0,0.038728725
0.032797456,0.0,0.0,0.030284437999999997,0.030988012000000002,0.0,0.031578284,0.0,0.0,0.030884118999999998,0.028989814,0.028836174,0.027326051,0.03070344,0.0,0.0,0.0,0.029210947,0.0,0.03162768,0.03129939,0.0,0.0,0.028890343,0.0,0.033673834,0.027273827999999996,0.033234645,0.02680844,0.0,0.05047475,0.0,0.038728725,0.03278623
0.0,0.0,0.030284437999999997,0.030988012000000002,0.0,0.031578284,0.0,0.0,0.030884118999999998,0.028989814,0.028836174,0.027326051,0.03070344,0.0,0.0,0.0,0.029210947,0.0,0.03162768,0.03129939,0.0,0.0,0.028890343,0.0,0.033673834,0.027273827999999996,0.033234645,0.02680844,0.0,0.05047475,0.032797456,0.038728725,0.03278623,0.0
0.038728725,0.030284437999999997,0.030988012000000002,0.0,0.031578284,0.0,0.0,0.030884118999999998,0.028989814,0.028836174,0.027326051,0.03070344,0.0,0.0,0.0,0.029210947,0.0,0.03162768,0.03129939,0.0,0.0,0.028890343,0.0,0.033673834,0.027273827999999996,0.033234645,0.02680844,0.0,0.05047475,0.032797456,0.0,0.03278623,0.0,0.0
0.03278623,0.030988012000000002,0.0,0.031578284,0.0,0.0,0.030884118999999998,0.028989814,0.028836174,0.027326051,0.03070344,0.0,0.0,0.0,0.029210947,0.0,0.03162768,0.03129939,0.0,0.0,0.028890343,0.0,0.033673834,0.027273827999999996,0.033234645,0.02680844,0.0,0.05047475,0.032797456,0.0,0.038728725,0.0,0.0,0.0
0.0,0.0,0.031578284,0.0,0.0,0.030884118999999998,0.028989814,0.028836174,0.027326051,0.03070344,0.0,0.0,0.0,0.029210947,0.0,0.03162768,0.03129939,0.0,0.0,0.028890343,0.0,0.033673834,0.027273827999999996,0.033234645,0.02680844,0.0,0.05047475,0.032797456,0.0,0.038728725,0.03278623,0.0,0.0,0.03362348
0.0,0.031578284,0.0,0.0,0.030884118999999998,0.028989814,0.028836174,0.027326051,0.03070344,0.0,0.0,0.0,0.029210947,0.0,0.03162768,0.03129939,0.0,0.0,0.028890343,0.0,0.033673834,0.027273827999999996,0.033234645,0.02680844,0.0,0.05047475,0.032797456,0.0,0.038728725,0.03278623,0.0,0.0,0.03362348,0.027911885
0.0,0.0,0.0,0.030884118999999998,0.028989814,0.028836174,0.027326051,0.03070344,0.0,0.0,0.0,0.029210947,0.0,0.03162768,0.03129939,0.0,0.0,0.028890343,0.0,0.033673834,0.027273827999999996,0.033234645,0.02680844,0.0,0.05047475,0.032797456,0.0,0.038728725,0.03278623,0.0,0.0,0.03362348,0.027911885,0.0310205
0.03362348,0.0,0.030884118999999998,0.028989814,0.028836174,0.027326051,0.03070344,0.0,0.0,0.0,0.029210947,0.0,0.03162768,0.03129939,0.0,0.0,0.028890343,0.0,0.033673834,0.027273827999999996,0.033234645,0.02680844,0.0,0.05047475,0.032797456,0.0,0.038728725,0.03278623,0.0,0.0,0.0,0.027911885,0.0310205,0.029495143999999997
0.027911885,0.030884118999999998,0.028989814,0.028836174,0.027326051,0.03070344,0.0,0.0,0.0,0.029210947,0.0,0.03162768,0.03129939,0.0,0.0,0.028890343,0.0,0.033673834,0.027273827999999996,0.033234645,0.02680844,0.0,0.05047475,0.032797456,0.0,0.038728725,0.03278623,0.0,0.0,0.0,0.03362348,0.0310205,0.029495143999999997,0.048903435
0.0310205,0.028989814,0.028836174,0.027326051,0.03070344,0.0,0.0,0.0,0.029210947,0.0,0.03162768,0.03129939,0.0,0.0,0.028890343,0.0,0.033673834,0.027273827999999996,0.033234645,0.02680844,0.0,0.05047475,0.032797456,0.0,0.038728725,0.03278623,0.0,0.0,0.0,0.03362348,0.027911885,0.029495143999999997,0.048903435,0.0
0.029495143999999997,0.028836174,0.027326051,0.03070344,0.0,0.0,0.0,0.029210947,0.0,0.03162768,0.03129939,0.0,0.0,0.028890343,0.0,0.033673834,0.027273827999999996,0.033234645,0.02680844,0.0,0.05047475,0.032797456,0.0,0.038728725,0.03278623,0.0,0.0,0.0,0.03362348,0.027911885,0.0310205,0.048903435,0.0,0.0
0.048903435,0.027326051,0.03070344,0.0,0.0,0.0,0.029210947,0.0,0.03162768,0.03129939,0.0,0.0,0.028890343,0.0,0.033673834,0.027273827999999996,0.033234645,0.02680844,0.0,0.05047475,0.032797456,0.0,0.038728725,0.03278623,0.0,0.0,0.0,0.03362348,0.027911885,0.0310205,0.029495143999999997,0.0,0.0,0.03478262
0.0,0.03070344,0.0,0.0,0.0,0.029210947,0.0,0.03162768,0.03129939,0.0,0.0,0.028890343,0.0,0.033673834,0.027273827999999996,0.033234645,0.02680844,0.0,0.05047475,0.032797456,0.0,0.038728725,0.03278623,0.0,0.0,0.0,0.03362348,0.027911885,0.0310205,0.029495143999999997,0.048903435,0.0,0.03478262,0.0
0.0,0.0,0.0,0.0,0.029210947,0.0,0.03162768,0.03129939,0.0,0.0,0.028890343,0.0,0.033673834,0.027273827999999996,0.033234645,0.02680844,0.0,0.05047475,0.032797456,0.0,0.038728725,0.03278623,0.0,0.0,0.0,0.03362348,0.027911885,0.0310205,0.029495143999999997,0.048903435,0.0,0.03478262,0.0,0.032012206
0.03478262,0.0,0.0,0.029210947,0.0,0.03162768,0.03129939,0.0,0.0,0.028890343,0.0,0.033673834,0.027273827999999996,0.033234645,0.02680844,0.0,0.05047475,0.032797456,0.0,0.038728725,0.03278623,0.0,0.0,0.0,0.03362348,0.027911885,0.0310205,0.029495143999999997,0.048903435,0.0,0.0,0.0,0.032012206,0.0
0.0,0.0,0.029210947,0.0,0.03162768,0.03129939,0.0,0.0,0.028890343,0.0,0.033673834,0.027273827999999996,0.033234645,0.02680844,0.0,0.05047475,0.032797456,0.0,0.038728725,0.03278623,0.0,0.0,0.0,0.03362348,0.027911885,0.0310205,0.029495143999999997,0.048903435,0.0,0.0,0.03478262,0.032012206,0.0,0.0
0.032012206,0.029210947,0.0,0.03162768,0.03129939,0.0,0.0,0.028890343,0.0,0.033673834,0.027273827999999996,0.033234645,0.02680844,0.0,0.05047475,0.032797456,0.0,0.038728725,0.03278623,0.0,0.0,0.0,0.03362348,0.027911885,0.0310205,0.029495143999999997,0.048903435,0.0,0.0,0.03478262,0.0,0.0,0.0,0.0
0.0,0.0,0.03162768,0.03129939,0.0,0.0,0.028890343,0.0,0.033673834,0.027273827999999996,0.033234645,0.02680844,0.0,0.05047475,0.032797456,0.0,0.038728725,0.03278623,0.0,0.0,0.0,0.03362348,0.027911885,0.0310205,0.029495143999999997,0.048903435,0.0,0.0,0.03478262,0.0,0.032012206,0.0,0.0,0.0
0.0,0.03162768,0.03129939,0.0,0.0,0.028890343,0.0,0.033673834,0.027273827999999996,0.033234645,0.02680844,0.0,0.05047475,0.032797456,0.0,0.038728725,0.03278623,0.0,0.0,0.0,0.03362348,0.027911885,0.0310205,0.029495143999999997,0.048903435,0.0,0.0,0.03478262,0.0,0.032012206,0.0,0.0,0.0,0.034242764
0.0,0.03129939,0.0,0.0,0.028890343,0.0,0.033673834,0.027273827999999996,0.033234645,0.02680844,0.0,0.05047475,0.032797456,0.0,0.038728725,0.03278623,0.0,0.0,0.0,0.03362348,0.027911885,0.0310205,0.029495143999999997,0.048903435,0.0,0.0,0.03478262,0.0,0.032012206,0.0,0.0,0.0,0.034242764,0.03205923
0.0,0.0,0.0,0.028890343,0.0,0.033673834,0.027273827999999996,0.033234645,0.02680844,0.0,0.05047475,0.032797456,0.0,0.038728725,0.03278623,0.0,0.0,0.0,0.03362348,0.027911885,0.0310205,0.029495143999999997,0.048903435,0.0,0.0,0.03478262,0.0,0.032012206,0.0,0.0,0.0,0.034242764,0.03205923,0.03520709
0.034242764,0.0,0.028890343,0.0,0.033673834,0.027273827999999996,0.033234645,0.02680844,0.0,0.05047475,0.032797456,0.0,0.038728725,0.03278623,0.0,0.0,0.0,0.03362348,0.027911885,0.0310205,0.029495143999999997,0.048903435,0.0,0.0,0.03478262,0.0,0.032012206,0.0,0.0,0.0,0.0,0.03205923,0.03520709,0.033102627999999995
