value,value-30,value-29,value-28,value-27,value-26,value-25,value-24,value-23,value-22,value-21,value-20,value-19,value-18,value-17,value-16,value-15,value-14,value-13,value-12,value-11,value-10,value-9,value-8,value-7,value-6,value-5,value-4,value-3,value-2,value-1,Prediction+1,Prediction+2,Prediction+3
0.029468426000000002,0.0,0.0,0.0,0.0,0.0,0.029726432999999997,0.0,0.031876028,0.032943845,0.0,0.0,0.032007422,0.0,0.0,0.0,0.0,0.0,0.032526605,0.03147652,0.0,0.0,0.028616041000000002,0.033073552,0.0,0.03222478,0.0,0.028204566,0.024269098,0.0,0.027969248999999998,0.023974143,0.027190383999999998,0.0
0.023974143,0.0,0.0,0.0,0.0,0.029726432999999997,0.0,0.031876028,0.032943845,0.0,0.0,0.032007422,0.0,0.0,0.0,0.0,0.0,0.032526605,0.03147652,0.0,0.0,0.028616041000000002,0.033073552,0.0,0.03222478,0.0,0.028204566,0.024269098,0.0,0.027969248999999998,0.029468426000000002,0.027190383999999998,0.0,0.03129725
0.027190383999999998,0.0,0.0,0.0,0.029726432999999997,0.0,0.031876028,0.032943845,0.0,0.0,0.032007422,0.0,0.0,0.0,0.0,0.0,0.032526605,0.03147652,0.0,0.0,0.028616041000000002,0.033073552,0.0,0.03222478,0.0,0.028204566,0.024269098,0.0,0.027969248999999998,0.029468426000000002,0.023974143,0.0,0.03129725,0.026624534
0.0,0.0,0.0,0.029726432999999997,0.0,0.031876028,0.032943845,0.0,0.0,0.032007422,0.0,0.0,0.0,0.0,0.0,0.032526605,0.03147652,0.0,0.0,0.028616041000000002,0.033073552,0.0,0.03222478,0.0,0.028204566,0.024269098,0.0,0.027969248999999998,0.029468426000000002,0.023974143,0.027190383999999998,0.03129725,0.026624534,0.0
0.03129725,0.0,0.029726432999999997,0.0,0.031876028,0.032943845,0.0,0.0,0.032007422,0.0,0.0,0.0,0.0,0.0,0.032526605,0.03147652,0.0,0.0,0.028616041000000002,0.033073552,0.0,0.03222478,0.0,0.028204566,0.024269098,0.0,0.027969248999999998,0.029468426000000002,0.023974143,0.027190383999999998,0.0,0.026624534,0.0,0.0
0.026624534,0.029726432999999997,0.0,0.031876028,0.032943845,0.0,0.0,0.032007422,0.0,0.0,0.0,0.0,0.0,0.032526605,0.03147652,0.0,0.0,0.028616041000000002,0.033073552,0.0,0.03222478,0.0,0.028204566,0.024269098,0.0,0.027969248999999998,0.029468426000000002,0.023974143,0.027190383999999998,0.0,0.03129725,0.0,0.0,0.025169399
0.0,0.0,0.031876028,0.032943845,0.0,0.0,0.032007422,0.0,0.0,0.0,0.0,0.0,0.032526605,0.03147652,0.0,0.0,0.028616041000000002,0.033073552,0.0,0.03222478,0.0,0.028204566,0.024269098,0.0,0.027969248999999998,0.029468426000000002,0.023974143,0.027190383999999998,0.0,0.03129725,0.026624534,0.0,0.025169399,0.028911673
0.0,0.031876028,0.032943845,0.0,0.0,0.032007422,0.0,0.0,0.0,0.0,0.0,0.032526605,0.03147652,0.0,0.0,0.028616041000000002,0.033073552,0.0,0.03222478,0.0,0.028204566,0.024269098,0.0,0.027969248999999998,0.029468426000000002,0.023974143,0.027190383999999998,0.0,0.03129725,0.026624534,0.0,0.025169399,0.028911673,0.024382597000000002
0.025169399,0.032943845,0.0,0.0,0.032007422,0.0,0.0,0.0,0.0,0.0,0.032526605,0.03147652,0.0,0.0,0.028616041000000002,0.033073552,0.0,0.03222478,0.0,0.028204566,0.024269098,0.0,0.027969248999999998,0.029468426000000002,0.023974143,0.027190383999999998,0.0,0.03129725,0.026624534,0.0,0.0,0.028911673,0.024382597000000002,0.0
0.028911673,0.0,0.0,0.032007422,0.0,0.0,0.0,0.0,0.0,0.032526605,0.03147652,0.0,0.0,0.028616041000000002,0.033073552,0.0,0.03222478,0.0,0.028204566,0.024269098,0.0,0.027969248999999998,0.029468426000000002,0.023974143,0.027190383999999998,0.0,0.03129725,0.026624534,0.0,0.0,0.025169399,0.024382597000000002,0.0,0.0
0.024382597000000002,0.0,0.032007422,0.0,0.0,0.0,0.0,0.0,0.032526605,0.03147652,0.0,0.0,0.028616041000000002,0.033073552,0.0,0.03222478,0.0,0.028204566,0.024269098,0.0,0.027969248999999998,0.029468426000000002,0.023974143,0.027190383999999998,0.0,0.03129725,0.026624534,0.0,0.0,0.025169399,0.028911673,0.0,0.0,0.0
0.0,0.032007422,0.0,0.0,0.0,0.0,0.0,0.032526605,0.03147652,0.0,0.0,0.028616041000000002,0.033073552,0.0,0.03222478,0.0,0.028204566,0.024269098,0.0,0.027969248999999998,0.029468426000000002,0.023974143,0.027190383999999998,0.0,0.03129725,0.026624534,0.0,0.0,0.025169399,0.028911673,0.024382597000000002,0.0,0.0,0.026327958
0.0,0.0,0.0,0.0,0.0,0.0,0.032526605,0.03147652,0.0,0.0,0.028616041000000002,0.033073552,0.0,0.03222478,0.0,0.028204566,0.024269098,0.0,0.027969248999999998,0.029468426000000002,0.023974143,0.027190383999999998,0.0,0.03129725,0.026624534,0.0,0.0,0.025169399,0.028911673,0.024382597000000002,0.0,0.0,0.026327958,0.033310506000000004
0.0,0.0,0.0,0.0,0.0,0.032526605,0.03147652,0.0,0.0,0.028616041000000002,0.033073552,0.0,0.03222478,0.0,0.028204566,0.024269098,0.0,0.027969248999999998,0.029468426000000002,0.023974143,0.027190383999999998,0.0,0.03129725,0.026624534,0.0,0.0,0.025169399,0.028911673,0.024382597000000002,0.0,0.0,0.026327958,0.033310506000000004,0.030435007000000007
0.026327958,0.0,0.0,0.0,0.032526605,0.03147652,0.0,0.0,0.028616041000000002,0.033073552,0.0,0.03222478,0.0,0.028204566,0.024269098,0.0,0.027969248999999998,0.029468426000000002,0.023974143,0.027190383999999998,0.0,0.03129725,0.026624534,0.0,0.0,0.025169399,0.028911673,0.024382597000000002,0.0,0.0,0.0,0.033310506000000004,0.030435007000000007,0.02604433
0.033310506000000004,0.0,0.0,0.032526605,0.03147652,0.0,0.0,0.028616041000000002,0.033073552,0.0,0.03222478,0.0,0.028204566,0.024269098,0.0,0.027969248999999998,0.029468426000000002,0.023974143,0.027190383999999998,0.0,0.03129725,0.026624534,0.0,0.0,0.025169399,0.028911673,0.024382597000000002,0.0,0.0,0.0,0.026327958,0.030435007000000007,0.02604433,0.0
0.030435007000000007,0.0,0.032526605,0.03147652,0.0,0.0,0.028616041000000002,0.033073552,0.0,0.03222478,0.0,0.028204566,0.024269098,0.0,0.027969248999999998,0.029468426000000002,0.023974143,0.027190383999999998,0.0,0.03129725,0.026624534,0.0,0.0,0.025169399,0.028911673,0.024382597000000002,0.0,0.0,0.0,0.026327958,0.033310506000000004,0.02604433,0.0,0.0
0.02604433,0.032526605,0.03147652,0.0,0.0,0.028616041000000002,0.033073552,0.0,0.03222478,0.0,0.028204566,0.024269098,0.0,0.027969248999999998,0.029468426000000002,0.023974143,0.027190383999999998,0.0,0.03129725,0.026624534,0.0,0.0,0.025169399,0.028911673,0.024382597000000002,0.0,0.0,0.0,0.026327958,0.033310506000000004,0.030435007000000007,0.0,0.0,0.028013559
0.0,0.03147652,0.0,0.0,0.028616041000000002,0.033073552,0.0,0.03222478,0.0,0.028204566,0.024269098,0.0,0.027969248999999998,0.029468426000000002,0.023974143,0.027190383999999998,0.0,0.03129725,0.026624534,0.0,0.0,0.025169399,0.028911673,0.024382597000000002,0.0,0.0,0.0,0.026327958,0.033310506000000004,0.030435007000000007,0.02604433,0.0,0.028013559,0.0
0.0,0.0,0.0,0.028616041000000002,0.033073552,0.0,0.03222478,0.0,0.028204566,0.024269098,0.0,0.027969248999999998,0.029468426000000002,0.023974143,0.027190383999999998,0.0,0.03129725,0.026624534,0.0,0.0,0.025169399,0.028911673,0.024382597000000002,0.0,0.0,0.0,0.026327958,0.033310506000000004,0.030435007000000007,0.02604433,0.0,0.028013559,0.0,0.0
0.028013559,0.0,0.028616041000000002,0.033073552,0.0,0.03222478,0.0,0.028204566,0.024269098,0.0,0.027969248999999998,0.029468426000000002,0.023974143,0.027190383999999998,0.0,0.03129725,0.026624534,0.0,0.0,0.025169399,0.028911673,0.024382597000000002,0.0,0.0,0.0,0.026327958,0.033310506000000004,0.030435007000000007,0.02604433,0.0,0.0,0.0,0.0,0.02613773
0.0,0.028616041000000002,0.033073552,0.0,0.03222478,0.0,0.028204566,0.024269098,0.0,0.027969248999999998,0.029468426000000002,0.023974143,0.027190383999999998,0.0,0.03129725,0.026624534,0.0,0.0,0.025169399,0.028911673,0.024382597000000002,0.0,0.0,0.0,0.026327958,0.033310506000000004,0.030435007000000007,0.02604433,0.0,0.0,0.028013559,0.0,0.02613773,0.0
0.0,0.033073552,0.0,0.03222478,0.0,0.028204566,0.024269098,0.0,0.027969248999999998,0.029468426000000002,0.023974143,0.027190383999999998,0.0,0.03129725,0.026624534,0.0,0.0,0.025169399,0.028911673,0.024382597000000002,0.0,0.0,0.0,0.026327958,0.033310506000000004,0.030435007000000007,0.02604433,0.0,0.0,0.028013559,0.0,0.02613773,0.0,0.026715278999999998
0.02613773,0.0,0.03222478,0.0,0.028204566,0.024269098,0.0,0.027969248999999998,0.029468426000000002,0.023974143,0.027190383999999998,0.0,0.03129725,0.026624534,0.0,0.0,0.025169399,0.028911673,0.024382597000000002,0.0,0.0,0.0,0.026327958,0.033310506000000004,0.030435007000000007,0.02604433,0.0,0.0,0.028013559,0.0,0.0,0.0,0.026715278999999998,0.0
0.0,0.03222478,0.0,0.028204566,0.024269098,0.0,0.027969248999999998,0.029468426000000002,0.023974143,0.027190383999999998,0.0,0.03129725,0.026624534,0.0,0.0,0.025169399,0.028911673,0.024382597000000002,0.0,0.0,0.0,0.026327958,0.033310506000000004,0.030435007000000007,0.02604433,0.0,0.0,0.028013559,0.0,0.0,0.02613773,0.026715278999999998,0.0,0.019181255
0.026715278999999998,0.0,0.028204566,0.024269098,0.0,0.027969248999999998,0.029468426000000002,0.023974143,0.027190383999999998,0.0,0.03129725,0.026624534,0.0,0.0,0.025169399,0.028911673,0.024382597000000002,0.0,0.0,0.0,0.026327958,0.033310506000000004,0.030435007000000007,0.02604433,0.0,0.0,0.028013559,0.0,0.0,0.02613773,0.0,0.0,0.019181255,0.034367412
0.0,0.028204566,0.024269098,0.0,0.027969248999999998,0.029468426000000002,0.023974143,0.027190383999999998,0.0,0.03129725,0.026624534,0.0,0.0,0.025169399,0.028911673,0.024382597000000002,0.0,0.0,0.0,0.026327958,0.033310506000000004,0.030435007000000007,0.02604433,0.0,0.0,0.028013559,0.0,0.0,0.02613773,0.0,0.026715278999999998,0.019181255,0.034367412,0.032984603
0.019181255,0.024269098,0.0,0.027969248999999998,0.029468426000000002,0.023974143,0.027190383999999998,0.0,0.03129725,0.026624534,0.0,0.0,0.025169399,0.028911673,0.024382597000000002,0.0,0.0,0.0,0.026327958,0.033310506000000004,0.030435007000000007,0.02604433,0.0,0.0,0.028013559,0.0,0.0,0.02613773,0.0,0.026715278999999998,0.0,0.034367412,0.032984603,0.0
0.034367412,0.0,0.027969248999999998,0.029468426000000002,0.023974143,0.027190383999999998,0.0,0.03129725,0.026624534,0.0,0.0,0.025169399,0.028911673,0.024382597000000002,0.0,0.0,0.0,0.026327958,0.033310506000000004,0.030435007000000007,0.02604433,0.0,0.0,0.028013559,0.0,0.0,0.02613773,0.0,0.026715278999999998,0.0,0.019181255,0.032984603,0.0,0.03683098
0.032984603,0.027969248999999998,0.029468426000000002,0.023974143,0.027190383999999998,0.0,0.03129725,0.026624534,0.0,0.0,0.025169399,0.028911673,0.024382597000000002,0.0,0.0,0.0,0.026327958,0.033310506000000004,0.030435007000000007,0.02604433,0.0,0.0,0.028013559,0.0,0.0,0.02613773,0.0,0.026715278999999998,0.0,0.019181255,0.034367412,0.0,0.03683098,0.0
0.0,0.029468426000000002,0.023974143,0.027190383999999998,0.0,0.03129725,0.026624534,0.0,0.0,0.025169399,0.028911673,0.024382597000000002,0.0,0.0,0.0,0.026327958,0.033310506000000004,0.030435007000000007,0.02604433,0.0,0.0,0.028013559,0.0,0.0,0.02613773,0.0,0.026715278999999998,0.0,0.019181255,0.034367412,0.032984603,0.03683098,0.0,0.03204436
0.03683098,0.023974143,0.027190383999999998,0.0,0.03129725,0.026624534,0.0,0.0,0.025169399,0.028911673,0.024382597000000002,0.0,0.0,0.0,0.026327958,0.033310506000000004,0.030435007000000007,0.02604433,0.0,0.0,0.028013559,0.0,0.0,0.02613773,0.0,0.026715278999999998,0.0,0.019181255,0.034367412,0.032984603,0.0,0.0,0.03204436,0.0
0.0,0.027190383999999998,0.0,0.03129725,0.026624534,0.0,0.0,0.025169399,0.028911673,0.024382597000000002,0.0,0.0,0.0,0.026327958,0.033310506000000004,0.030435007000000007,0.02604433,0.0,0.0,0.028013559,0.0,0.0,0.02613773,0.0,0.026715278999999998,0.0,0.019181255,0.034367412,0.032984603,0.0,0.03683098,0.03204436,0.0,0.026999372999999997
0.03204436,0.0,0.03129725,0.026624534,0.0,0.0,0.025169399,0.028911673,0.024382597000000002,0.0,0.0,0.0,0.026327958,0.033310506000000004,0.030435007000000007,0.02604433,0.0,0.0,0.028013559,0.0,0.0,0.02613773,0.0,0.026715278999999998,0.0,0.019181255,0.034367412,0.032984603,0.0,0.03683098,0.0,0.0,0.026999372999999997,0.0
0.0,0.03129725,0.026624534,0.0,0.0,0.025169399,0.028911673,0.024382597000000002,0.0,0.0,0.0,0.026327958,0.033310506000000004,0.030435007000000007,0.02604433,0.0,0.0,0.028013559,0.0,0.0,0.02613773,0.0,0.026715278999999998,0.0,0.019181255,0.034367412,0.032984603,0.0,0.03683098,0.0,0.03204436,0.026999372999999997,0.0,0.0
0.026999372999999997,0.026624534,0.0,0.0,0.025169399,0.028911673,0.024382597000000002,0.0,0.0,0.0,0.026327958,0.033310506000000004,0.030435007000000007,0.02604433,0.0,0.0,0.028013559,0.0,0.0,0.02613773,0.0,0.026715278999999998,0.0,0.019181255,0.034367412,0.032984603,0.0,0.03683098,0.0,0.03204436,0.0,0.0,0.0,0.0
0.0,0.0,0.0,0.025169399,0.028911673,0.024382597000000002,0.0,0.0,0.0,0.026327958,0.033310506000000004,0.030435007000000007,0.02604433,0.0,0.0,0.028013559,0.0,0.0,0.02613773,0.0,0.026715278999999998,0.0,0.019181255,0.034367412,0.032984603,0.0,0.03683098,0.0,0.03204436,0.0,0.026999372999999997,0.0,0.0,0.029653832
0.0,0.0,0.025169399,0.028911673,0.024382597000000002,0.0,0.0,0.0,0.026327958,0.033310506000000004,0.030435007000000007,0.02604433,0.0,0.0,0.028013559,0.0,0.0,0.02613773,0.0,0.026715278999999998,0.0,0.019181255,0.034367412,0.032984603,0.0,0.03683098,0.0,0.03204436,0.0,0.026999372999999997,0.0,0.0,0.029653832,0.028617281
0.0,0.025169399,0.028911673,0.024382597000000002,0.0,0.0,0.0,0.026327958,0.033310506000000004,0.030435007000000007,0.02604433,0.0,0.0,0.028013559,0.0,0.0,0.02613773,0.0,0.026715278999999998,0.0,0.019181255,0.034367412,0.032984603,0.0,0.03683098,0.0,0.03204436,0.0,0.026999372999999997,0.0,0.0,0.029653832,0.028617281,0.03372392
0.029653832,0.028911673,0.024382597000000002,0.0,0.0,0.0,0.026327958,0.033310506000000004,0.030435007000000007,0.02604433,0.0,0.0,0.028013559,0.0,0.0,0.02613773,0.0,0.026715278999999998,0.0,0.019181255,0.034367412,0.032984603,0.0,0.03683098,0.0,0.03204436,0.0,0.026999372999999997,0.0,0.0,0.0,0.028617281,0.03372392,0.0
0.028617281,0.024382597000000002,0.0,0.0,0.0,0.026327958,0.033310506000000004,0.030435007000000007,0.02604433,0.0,0.0,0.028013559,0.0,0.0,0.02613773,0.0,0.026715278999999998,0.0,0.019181255,0.034367412,0.032984603,0.0,0.03683098,0.0,0.03204436,0.0,0.026999372999999997,0.0,0.0,0.0,0.029653832,0.03372392,0.0,0.0
0.03372392,0.0,0.0,0.0,0.026327958,0.033310506000000004,0.030435007000000007,0.02604433,0.0,0.0,0.028013559,0.0,0.0,0.02613773,0.0,0.026715278999999998,0.0,0.019181255,0.034367412,0.032984603,0.0,0.03683098,0.0,0.03204436,0.0,0.026999372999999997,0.0,0.0,0.0,0.029653832,0.028617281,0.0,0.0,0.0
0.0,0.0,0.0,0.026327958,0.033310506000000004,0.030435007000000007,0.02604433,0.0,0.0,0.028013559,0.0,0.0,0.02613773,0.0,0.026715278999999998,0.0,0.019181255,0.034367412,0.032984603,0.0,0.03683098,0.0,0.03204436,0.0,0.026999372999999997,0.0,0.0,0.0,0.029653832,0.028617281,0.03372392,0.0,0.0,0.030988012000000002
0.0,0.0,0.026327958,0.033310506000000004,0.030435007000000007,0.02604433,0.0,0.0,0.028013559,0.0,0.0,0.02613773,0.0,0.026715278999999998,0.0,0.019181255,0.034367412,0.032984603,0.0,0.03683098,0.0,0.03204436,0.0,0.026999372999999997,0.0,0.0,0.0,0.029653832,0.028617281,0.03372392,0.0,0.0,0.030988012000000002,0.0
0.0,0.026327958,0.033310506000000004,0.030435007000000007,0.02604433,0.0,0.0,0.028013559,0.0,0.0,0.02613773,0.0,0.026715278999999998,0.0,0.019181255,0.034367412,0.032984603,0.0,0.03683098,0.0,0.03204436,0.0,0.026999372999999997,0.0,0.0,0.0,0.029653832,0.028617281,0.03372392,0.0,0.0,0.030988012000000002,0.0,0.0
0.030988012000000002,0.033310506000000004,0.030435007000000007,0.02604433,0.0,0.0,0.028013559,0.0,0.0,0.02613773,0.0,0.026715278999999998,0.0,0.019181255,0.034367412,0.032984603,0.0,0.03683098,0.0,0.03204436,0.0,0.026999372999999997,0.0,0.0,0.0,0.029653832,0.028617281,0.03372392,0.0,0.0,0.0,0.0,0.0,0.0
0.0,0.030435007000000007,0.02604433,0.0,0.0,0.028013559,0.0,0.0,0.02613773,0.0,0.026715278999999998,0.0,0.019181255,0.034367412,0.032984603,0.0,0.03683098,0.0,0.03204436,0.0,0.026999372999999997,0.0,0.0,0.0,0.029653832,0.028617281,0.03372392,0.0,0.0,0.0,0.030988012000000002,0.0,0.0,0.0
0.0,0.02604433,0.0,0.0,0.028013559,0.0,0.0,0.02613773,0.0,0.026715278999999998,0.0,0.019181255,0.034367412,0.032984603,0.0,0.03683098,0.0,0.03204436,0.0,0.026999372999999997,0.0,0.0,0.0,0.029653832,0.028617281,0.03372392,0.0,0.0,0.0,0.030988012000000002,0.0,0.0,0.0,0.026663145
0.0,0.0,0.0,0.028013559,0.0,0.0,0.02613773,0.0,0.026715278999999998,0.0,0.019181255,0.034367412,0.032984603,0.0,0.03683098,0.0,0.03204436,0.0,0.026999372999999997,0.0,0.0,0.0,0.029653832,0.028617281,0.03372392,0.0,0.0,0.0,0.030988012000000002,0.0,0.0,0.0,0.026663145,0.028989814
0.0,0.0,0.028013559,0.0,0.0,0.02613773,0.0,0.026715278999999998,0.0,0.019181255,0.034367412,0.032984603,0.0,0.03683098,0.0,0.03204436,0.0,0.026999372999999997,0.0,0.0,0.0,0.029653832,0.028617281,0.03372392,0.0,0.0,0.0,0.030988012000000002,0.0,0.0,0.0,0.026663145,0.028989814,0.030905787
0.026663145,0.028013559,0.0,0.0,0.02613773,0.0,0.026715278999999998,0.0,0.019181255,0.034367412,0.032984603,0.0,0.03683098,0.0,0.03204436,0.0,0.026999372999999997,0.0,0.0,0.0,0.029653832,0.028617281,0.03372392,0.0,0.0,0.0,0.030988012000000002,0.0,0.0,0.0,0.0,0.028989814,0.030905787,0.027326051
0.028989814,0.0,0.0,0.02613773,0.0,0.026715278999999998,0.0,0.019181255,0.034367412,0.032984603,0.0,0.03683098,0.0,0.03204436,0.0,0.026999372999999997,0.0,0.0,0.0,0.029653832,0.028617281,0.03372392,0.0,0.0,0.0,0.030988012000000002,0.0,0.0,0.0,0.0,0.026663145,0.030905787,0.027326051,0.030373154
0.030905787,0.0,0.02613773,0.0,0.026715278999999998,0.0,0.019181255,0.034367412,0.032984603,0.0,0.03683098,0.0,0.03204436,0.0,0.026999372999999997,0.0,0.0,0.0,0.029653832,0.028617281,0.03372392,0.0,0.0,0.0,0.030988012000000002,0.0,0.0,0.0,0.0,0.026663145,0.028989814,0.027326051,0.030373154,0.0
0.027326051,0.02613773,0.0,0.026715278999999998,0.0,0.019181255,0.034367412,0.032984603,0.0,0.03683098,0.0,0.03204436,0.0,0.026999372999999997,0.0,0.0,0.0,0.029653832,0.028617281,0.03372392,0.0,0.0,0.0,0.030988012000000002,0.0,0.0,0.0,0.0,0.026663145,0.028989814,0.030905787,0.030373154,0.0,0.0
0.030373154,0.0,0.026715278999999998,0.0,0.019181255,0.034367412,0.032984603,0.0,0.03683098,0.0,0.03204436,0.0,0.026999372999999997,0.0,0.0,0.0,0.029653832,0.028617281,0.03372392,0.0,0.0,0.0,0.030988012000000002,0.0,0.0,0.0,0.0,0.026663145,0.028989814,0.030905787,0.027326051,0.0,0.0,0.0
0.0,0.026715278999999998,0.0,0.019181255,0.034367412,0.032984603,0.0,0.03683098,0.0,0.03204436,0.0,0.026999372999999997,0.0,0.0,0.0,0.029653832,0.028617281,0.03372392,0.0,0.0,0.0,0.030988012000000002,0.0,0.0,0.0,0.0,0.026663145,0.028989814,0.030905787,0.027326051,0.030373154,0.0,0.0,0.028311249
0.0,0.0,0.019181255,0.034367412,0.032984603,0.0,0.03683098,0.0,0.03204436,0.0,0.026999372999999997,0.0,0.0,0.0,0.029653832,0.028617281,0.03372392,0.0,0.0,0.0,0.030988012000000002,0.0,0.0,0.0,0.0,0.026663145,0.028989814,0.030905787,0.027326051,0.030373154,0.0,0.0,0.028311249,0.0
0.0,0.019181255,0.034367412,0.032984603,0.0,0.03683098,0.0,0.03204436,0.0,0.026999372999999997,0.0,0.0,0.0,0.029653832,0.028617281,0.03372392,0.0,0.0,0.0,0.030988012000000002,0.0,0.0,0.0,0.0,0.026663145,0.028989814,0.030905787,0.027326051,0.030373154,0.0,0.0,0.028311249,0.0,0.03330343
0.028311249,0.034367412,0.032984603,0.0,0.03683098,0.0,0.03204436,0.0,0.026999372999999997,0.0,0.0,0.0,0.029653832,0.028617281,0.03372392,0.0,0.0,0.0,0.030988012000000002,0.0,0.0,0.0,0.0,0.026663145,0.028989814,0.030905787,0.027326051,0.030373154,0.0,0.0,0.0,0.0,0.03330343,0.027226318
0.0,0.032984603,0.0,0.03683098,0.0,0.03204436,0.0,0.026999372999999997,0.0,0.0,0.0,0.029653832,0.028617281,0.03372392,0.0,0.0,0.0,0.030988012000000002,0.0,0.0,0.0,0.0,0.026663145,0.028989814,0.030905787,0.027326051,0.030373154,0.0,0.0,0.0,0.028311249,0.03330343,0.027226318,0.0
0.03330343,0.0,0.03683098,0.0,0.03204436,0.0,0.026999372999999997,0.0,0.0,0.0,0.029653832,0.028617281,0.03372392,0.0,0.0,0.0,0.030988012000000002,0.0,0.0,0.0,0.0,0.026663145,0.028989814,0.030905787,0.027326051,0.030373154,0.0,0.0,0.0,0.028311249,0.0,0.027226318,0.0,0.030155612000000002
0.027226318,0.03683098,0.0,0.03204436,0.0,0.026999372999999997,0.0,0.0,0.0,0.029653832,0.028617281,0.03372392,0.0,0.0,0.0,0.030988012000000002,0.0,0.0,0.0,0.0,0.026663145,0.028989814,0.030905787,0.027326051,0.030373154,0.0,0.0,0.0,0.028311249,0.0,0.03330343,0.0,0.030155612000000002,0.028890343
0.0,0.0,0.03204436,0.0,0.026999372999999997,0.0,0.0,0.0,0.029653832,0.028617281,0.03372392,0.0,0.0,0.0,0.030988012000000002,0.0,0.0,0.0,0.0,0.026663145,0.028989814,0.030905787,0.027326051,0.030373154,0.0,0.0,0.0,0.028311249,0.0,0.03330343,0.027226318,0.030155612000000002,0.028890343,0.0
0.030155612000000002,0.03204436,0.0,0.026999372999999997,0.0,0.0,0.0,0.029653832,0.028617281,0.03372392,0.0,0.0,0.0,0.030988012000000002,0.0,0.0,0.0,0.0,0.026663145,0.028989814,0.030905787,0.027326051,0.030373154,0.0,0.0,0.0,0.028311249,0.0,0.03330343,0.027226318,0.0,0.028890343,0.0,0.033673834
0.028890343,0.0,0.026999372999999997,0.0,0.0,0.0,0.029653832,0.028617281,0.03372392,0.0,0.0,0.0,0.030988012000000002,0.0,0.0,0.0,0.0,0.026663145,0.028989814,0.030905787,0.027326051,0.030373154,0.0,0.0,0.0,0.028311249,0.0,0.03330343,0.027226318,0.0,0.030155612000000002,0.0,0.033673834,0.027273827999999996
0.0,0.026999372999999997,0.0,0.0,0.0,0.029653832,0.028617281,0.03372392,0.0,0.0,0.0,0.030988012000000002,0.0,0.0,0.0,0.0,0.026663145,0.028989814,0.030905787,0.027326051,0.030373154,0.0,0.0,0.0,0.028311249,0.0,0.03330343,0.027226318,0.0,0.030155612000000002,0.028890343,0.033673834,0.027273827999999996,0.033234645
0.033673834,0.0,0.0,0.0,0.029653832,0.028617281,0.03372392,0.0,0.0,0.0,0.030988012000000002,0.0,0.0,0.0,0.0,0.026663145,0.028989814,0.030905787,0.027326051,0.030373154,0.0,0.0,0.0,0.028311249,0.0,0.03330343,0.027226318,0.0,0.030155612000000002,0.028890343,0.0,0.027273827999999996,0.033234645,0.02680844
0.027273827999999996,0.0,0.0,0.029653832,0.028617281,0.03372392,0.0,0.0,0.0,0.030988012000000002,0.0,0.0,0.0,0.0,0.026663145,0.028989814,0.030905787,0.027326051,0.030373154,0.0,0.0,0.0,0.028311249,0.0,0.03330343,0.027226318,0.0,0.030155612000000002,0.028890343,0.0,0.033673834,0.033234645,0.02680844,0.0
0.033234645,0.0,0.029653832,0.028617281,0.03372392,0.0,0.0,0.0,0.030988012000000002,0.0,0.0,0.0,0.0,0.026663145,0.028989814,0.030905787,0.027326051,0.030373154,0.0,0.0,0.0,0.028311249,0.0,0.03330343,0.027226318,0.0,0.030155612000000002,0.028890343,0.0,0.033673834,0.027273827999999996,0.02680844,0.0,0.05047475
0.02680844,0.029653832,0.028617281,0.03372392,0.0,0.0,0.0,0.030988012000000002,0.0,0.0,0.0,0.0,0.026663145,0.028989814,0.030905787,0.027326051,0.030373154,0.0,0.0,0.0,0.028311249,0.0,0.03330343,0.027226318,0.0,0.030155612000000002,0.028890343,0.0,0.033673834,0.027273827999999996,0.033234645,0.0,0.05047475,0.032797456
0.0,0.028617281,0.03372392,0.0,0.0,0.0,0.030988012000000002,0.0,0.0,0.0,0.0,0.026663145,0.028989814,0.030905787,0.027326051,0.030373154,0.0,0.0,0.0,0.028311249,0.0,0.03330343,0.027226318,0.0,0.030155612000000002,0.028890343,0.0,0.033673834,0.027273827999999996,0.033234645,0.02680844,0.05047475,0.032797456,0.0
0.05047475,0.03372392,0.0,0.0,0.0,0.030988012000000002,0.0,0.0,0.0,0.0,0.026663145,0.028989814,0.030905787,0.027326051,0.030373154,0.0,0.0,0.0,0.028311249,0.0,0.03330343,0.027226318,0.0,0.030155612000000002,0.028890343,0.0,0.033673834,0.027273827999999996,0.033234645,0.02680844,0.0,0.032797456,0.0,0.039670736
0.032797456,0.0,0.0,0.0,0.030988012000000002,0.0,0.0,0.0,0.0,0.026663145,0.028989814,0.030905787,0.027326051,0.030373154,0.0,0.0,0.0,0.028311249,0.0,0.03330343,0.027226318,0.0,0.030155612000000002,0.028890343,0.0,0.033673834,0.027273827999999996,0.033234645,0.02680844,0.0,0.05047475,0.0,0.039670736,0.031300493
0.0,0.0,0.0,0.030988012000000002,0.0,0.0,0.0,0.0,0.026663145,0.028989814,0.030905787,0.027326051,0.030373154,0.0,0.0,0.0,0.028311249,0.0,0.03330343,0.027226318,0.0,0.030155612000000002,0.028890343,0.0,0.033673834,0.027273827999999996,0.033234645,0.02680844,0.0,0.05047475,0.032797456,0.039670736,0.031300493,0.0
0.039670736,0.0,0.030988012000000002,0.0,0.0,0.0,0.0,0.026663145,0.028989814,0.030905787,0.027326051,0.030373154,0.0,0.0,0.0,0.028311249,0.0,0.03330343,0.027226318,0.0,0.030155612000000002,0.028890343,0.0,0.033673834,0.027273827999999996,0.033234645,0.02680844,0.0,0.05047475,0.032797456,0.0,0.031300493,0.0,0.0
0.031300493,0.030988012000000002,0.0,0.0,0.0,0.0,0.026663145,0.028989814,0.030905787,0.027326051,0.030373154,0.0,0.0,0.0,0.028311249,0.0,0.03330343,0.027226318,0.0,0.030155612000000002,0.028890343,0.0,0.033673834,0.027273827999999996,0.033234645,0.02680844,0.0,0.05047475,0.032797456,0.0,0.039670736,0.0,0.0,0.0
0.0,0.0,0.0,0.0,0.0,0.026663145,0.028989814,0.030905787,0.027326051,0.030373154,0.0,0.0,0.0,0.028311249,0.0,0.03330343,0.027226318,0.0,0.030155612000000002,0.028890343,0.0,0.033673834,0.027273827999999996,0.033234645,0.02680844,0.0,0.05047475,0.032797456,0.0,0.039670736,0.031300493,0.0,0.0,0.03362348
0.0,0.0,0.0,0.0,0.026663145,0.028989814,0.030905787,0.027326051,0.030373154,0.0,0.0,0.0,0.028311249,0.0,0.03330343,0.027226318,0.0,0.030155612000000002,0.028890343,0.0,0.033673834,0.027273827999999996,0.033234645,0.02680844,0.0,0.05047475,0.032797456,0.0,0.039670736,0.031300493,0.0,0.0,0.03362348,0.0
0.0,0.0,0.0,0.026663145,0.028989814,0.030905787,0.027326051,0.030373154,0.0,0.0,0.0,0.028311249,0.0,0.03330343,0.027226318,0.0,0.030155612000000002,0.028890343,0.0,0.033673834,0.027273827999999996,0.033234645,0.02680844,0.0,0.05047475,0.032797456,0.0,0.039670736,0.031300493,0.0,0.0,0.03362348,0.0,0.0310205
0.03362348,0.0,0.026663145,0.028989814,0.030905787,0.027326051,0.030373154,0.0,0.0,0.0,0.028311249,0.0,0.03330343,0.027226318,0.0,0.030155612000000002,0.028890343,0.0,0.033673834,0.027273827999999996,0.033234645,0.02680844,0.0,0.05047475,0.032797456,0.0,0.039670736,0.031300493,0.0,0.0,0.0,0.0,0.0310205,0.030006874
0.0,0.026663145,0.028989814,0.030905787,0.027326051,0.030373154,0.0,0.0,0.0,0.028311249,0.0,0.03330343,0.027226318,0.0,0.030155612000000002,0.028890343,0.0,0.033673834,0.027273827999999996,0.033234645,0.02680844,0.0,0.05047475,0.032797456,0.0,0.039670736,0.031300493,0.0,0.0,0.0,0.03362348,0.0310205,0.030006874,0.048903435
0.0310205,0.028989814,0.030905787,0.027326051,0.030373154,0.0,0.0,0.0,0.028311249,0.0,0.03330343,0.027226318,0.0,0.030155612000000002,0.028890343,0.0,0.033673834,0.027273827999999996,0.033234645,0.02680844,0.0,0.05047475,0.032797456,0.0,0.039670736,0.031300493,0.0,0.0,0.0,0.03362348,0.0,0.030006874,0.048903435,0.0
0.030006874,0.030905787,0.027326051,0.030373154,0.0,0.0,0.0,0.028311249,0.0,0.03330343,0.027226318,0.0,0.030155612000000002,0.028890343,0.0,0.033673834,0.027273827999999996,0.033234645,0.02680844,0.0,0.05047475,0.032797456,0.0,0.039670736,0.031300493,0.0,0.0,0.0,0.03362348,0.0,0.0310205,0.048903435,0.0,0.0
0.048903435,0.027326051,0.030373154,0.0,0.0,0.0,0.028311249,0.0,0.03330343,0.027226318,0.0,0.030155612000000002,0.028890343,0.0,0.033673834,0.027273827999999996,0.033234645,0.02680844,0.0,0.05047475,0.032797456,0.0,0.039670736,0.031300493,0.0,0.0,0.0,0.03362348,0.0,0.0310205,0.030006874,0.0,0.0,0.03646863
0.0,0.030373154,0.0,0.0,0.0,0.028311249,0.0,0.03330343,0.027226318,0.0,0.030155612000000002,0.028890343,0.0,0.033673834,0.027273827999999996,0.033234645,0.02680844,0.0,0.05047475,0.032797456,0.0,0.039670736,0.031300493,0.0,0.0,0.0,0.03362348,0.0,0.0310205,0.030006874,0.048903435,0.0,0.03646863,0.0
0.0,0.0,0.0,0.0,0.028311249,0.0,0.03330343,0.027226318,0.0,0.030155612000000002,0.028890343,0.0,0.033673834,0.027273827999999996,0.033234645,0.02680844,0.0,0.05047475,0.032797456,0.0,0.039670736,0.031300493,0.0,0.0,0.0,0.03362348,0.0,0.0310205,0.030006874,0.048903435,0.0,0.03646863,0.0,0.03283358
0.03646863,0.0,0.0,0.028311249,0.0,0.03330343,0.027226318,0.0,0.030155612000000002,0.028890343,0.0,0.033673834,0.027273827999999996,0.033234645,0.02680844,0.0,0.05047475,0.032797456,0.0,0.039670736,0.031300493,0.0,0.0,0.0,0.03362348,0.0,0.0310205,0.030006874,0.048903435,0.0,0.0,0.0,0.03283358,0.0
0.0,0.0,0.028311249,0.0,0.03330343,0.027226318,0.0,0.030155612000000002,0.028890343,0.0,0.033673834,0.027273827999999996,0.033234645,0.02680844,0.0,0.05047475,0.032797456,0.0,0.039670736,0.031300493,0.0,0.0,0.0,0.03362348,0.0,0.0310205,0.030006874,0.048903435,0.0,0.0,0.03646863,0.03283358,0.0,0.0
0.03283358,0.028311249,0.0,0.03330343,0.027226318,0.0,0.030155612000000002,0.028890343,0.0,0.033673834,0.027273827999999996,0.033234645,0.02680844,0.0,0.05047475,0.032797456,0.0,0.039670736,0.031300493,0.0,0.0,0.0,0.03362348,0.0,0.0310205,0.030006874,0.048903435,0.0,0.0,0.03646863,0.0,0.0,0.0,0.03847526
0.0,0.0,0.03330343,0.027226318,0.0,0.030155612000000002,0.028890343,0.0,0.033673834,0.027273827999999996,0.033234645,0.02680844,0.0,0.05047475,0.032797456,0.0,0.039670736,0.031300493,0.0,0.0,0.0,0.03362348,0.0,0.0310205,0.030006874,0.048903435,0.0,0.0,0.03646863,0.0,0.03283358,0.0,0.03847526,0.0
0.0,0.03330343,0.027226318,0.0,0.030155612000000002,0.028890343,0.0,0.033673834,0.027273827999999996,0.033234645,0.02680844,0.0,0.05047475,0.032797456,0.0,0.039670736,0.031300493,0.0,0.0,0.0,0.03362348,0.0,0.0310205,0.030006874,0.048903435,0.0,0.0,0.03646863,0.0,0.03283358,0.0,0.03847526,0.0,0.0
0.03847526,0.027226318,0.0,0.030155612000000002,0.028890343,0.0,0.033673834,0.027273827999999996,0.033234645,0.02680844,0.0,0.05047475,0.032797456,0.0,0.039670736,0.031300493,0.0,0.0,0.0,0.03362348,0.0,0.0310205,0.030006874,0.048903435,0.0,0.0,0.03646863,0.0,0.03283358,0.0,0.0,0.0,0.0,0.034608826
0.0,0.0,0.030155612000000002,0.028890343,0.0,0.033673834,0.027273827999999996,0.033234645,0.02680844,0.0,0.05047475,0.032797456,0.0,0.039670736,0.031300493,0.0,0.0,0.0,0.03362348,0.0,0.0310205,0.030006874,0.048903435,0.0,0.0,0.03646863,0.0,0.03283358,0.0,0.0,0.03847526,0.0,0.034608826,0.03520709
0.0,0.030155612000000002,0.028890343,0.0,0.033673834,0.027273827999999996,0.033234645,0.02680844,0.0,0.05047475,0.032797456,0.0,0.039670736,0.031300493,0.0,0.0,0.0,0.03362348,0.0,0.0310205,0.030006874,0.048903435,0.0,0.0,0.03646863,0.0,0.03283358,0.0,0.0,0.03847526,0.0,0.034608826,0.03520709,0.033102627999999995
