value,value-30,value-29,value-28,value-27,value-26,value-25,value-24,value-23,value-22,value-21,value-20,value-19,value-18,value-17,value-16,value-15,value-14,value-13,value-12,value-11,value-10,value-9,value-8,value-7,value-6,value-5,value-4,value-3,value-2,value-1,Prediction+1,Prediction+2,Prediction+3
0.029202892,0.0,0.0,0.0,0.0,0.0,0.029726432999999997,0.0,0.03254177,0.032943845,0.0,0.0,0.024613198,0.0,0.0,0.0,0.0,0.0,0.0,0.03147652,0.0,0.0,0.028616041000000002,0.033073552,0.0,0.034754135,0.0,0.031146333999999998,0.023079613,0.0,0.027969248999999998,0.0,0.027190383999999998,0.0
0.0,0.0,0.0,0.0,0.0,0.029726432999999997,0.0,0.03254177,0.032943845,0.0,0.0,0.024613198,0.0,0.0,0.0,0.0,0.0,0.0,0.03147652,0.0,0.0,0.028616041000000002,0.033073552,0.0,0.034754135,0.0,0.031146333999999998,0.023079613,0.0,0.027969248999999998,0.029202892,0.027190383999999998,0.0,0.03026733
0.027190383999999998,0.0,0.0,0.0,0.029726432999999997,0.0,0.03254177,0.032943845,0.0,0.0,0.024613198,0.0,0.0,0.0,0.0,0.0,0.0,0.03147652,0.0,0.0,0.028616041000000002,0.033073552,0.0,0.034754135,0.0,0.031146333999999998,0.023079613,0.0,0.027969248999999998,0.029202892,0.0,0.0,0.03026733,0.026624534
0.0,0.0,0.0,0.029726432999999997,0.0,0.03254177,0.032943845,0.0,0.0,0.024613198,0.0,0.0,0.0,0.0,0.0,0.0,0.03147652,0.0,0.0,0.028616041000000002,0.033073552,0.0,0.034754135,0.0,0.031146333999999998,0.023079613,0.0,0.027969248999999998,0.029202892,0.0,0.027190383999999998,0.03026733,0.026624534,0.0
0.03026733,0.0,0.029726432999999997,0.0,0.03254177,0.032943845,0.0,0.0,0.024613198,0.0,0.0,0.0,0.0,0.0,0.0,0.03147652,0.0,0.0,0.028616041000000002,0.033073552,0.0,0.034754135,0.0,0.031146333999999998,0.023079613,0.0,0.027969248999999998,0.029202892,0.0,0.027190383999999998,0.0,0.026624534,0.0,0.0
0.026624534,0.029726432999999997,0.0,0.03254177,0.032943845,0.0,0.0,0.024613198,0.0,0.0,0.0,0.0,0.0,0.0,0.03147652,0.0,0.0,0.028616041000000002,0.033073552,0.0,0.034754135,0.0,0.031146333999999998,0.023079613,0.0,0.027969248999999998,0.029202892,0.0,0.027190383999999998,0.0,0.03026733,0.0,0.0,0.025169399
0.0,0.0,0.03254177,0.032943845,0.0,0.0,0.024613198,0.0,0.0,0.0,0.0,0.0,0.0,0.03147652,0.0,0.0,0.028616041000000002,0.033073552,0.0,0.034754135,0.0,0.031146333999999998,0.023079613,0.0,0.027969248999999998,0.029202892,0.0,0.027190383999999998,0.0,0.03026733,0.026624534,0.0,0.025169399,0.024945036
0.0,0.03254177,0.032943845,0.0,0.0,0.024613198,0.0,0.0,0.0,0.0,0.0,0.0,0.03147652,0.0,0.0,0.028616041000000002,0.033073552,0.0,0.034754135,0.0,0.031146333999999998,0.023079613,0.0,0.027969248999999998,0.029202892,0.0,0.027190383999999998,0.0,0.03026733,0.026624534,0.0,0.025169399,0.024945036,0.024382597000000002
0.025169399,0.032943845,0.0,0.0,0.024613198,0.0,0.0,0.0,0.0,0.0,0.0,0.03147652,0.0,0.0,0.028616041000000002,0.033073552,0.0,0.034754135,0.0,0.031146333999999998,0.023079613,0.0,0.027969248999999998,0.029202892,0.0,0.027190383999999998,0.0,0.03026733,0.026624534,0.0,0.0,0.024945036,0.024382597000000002,0.0
0.024945036,0.0,0.0,0.024613198,0.0,0.0,0.0,0.0,0.0,0.0,0.03147652,0.0,0.0,0.028616041000000002,0.033073552,0.0,0.034754135,0.0,0.031146333999999998,0.023079613,0.0,0.027969248999999998,0.029202892,0.0,0.027190383999999998,0.0,0.03026733,0.026624534,0.0,0.0,0.025169399,0.024382597000000002,0.0,0.0
0.024382597000000002,0.0,0.024613198,0.0,0.0,0.0,0.0,0.0,0.0,0.03147652,0.0,0.0,0.028616041000000002,0.033073552,0.0,0.034754135,0.0,0.031146333999999998,0.023079613,0.0,0.027969248999999998,0.029202892,0.0,0.027190383999999998,0.0,0.03026733,0.026624534,0.0,0.0,0.025169399,0.024945036,0.0,0.0,0.0
0.0,0.024613198,0.0,0.0,0.0,0.0,0.0,0.0,0.03147652,0.0,0.0,0.028616041000000002,0.033073552,0.0,0.034754135,0.0,0.031146333999999998,0.023079613,0.0,0.027969248999999998,0.029202892,0.0,0.027190383999999998,0.0,0.03026733,0.026624534,0.0,0.0,0.025169399,0.024945036,0.024382597000000002,0.0,0.0,0.026327958
0.0,0.0,0.0,0.0,0.0,0.0,0.0,0.03147652,0.0,0.0,0.028616041000000002,0.033073552,0.0,0.034754135,0.0,0.031146333999999998,0.023079613,0.0,0.027969248999999998,0.029202892,0.0,0.027190383999999998,0.0,0.03026733,0.026624534,0.0,0.0,0.025169399,0.024945036,0.024382597000000002,0.0,0.0,0.026327958,0.03280834
0.0,0.0,0.0,0.0,0.0,0.0,0.03147652,0.0,0.0,0.028616041000000002,0.033073552,0.0,0.034754135,0.0,0.031146333999999998,0.023079613,0.0,0.027969248999999998,0.029202892,0.0,0.027190383999999998,0.0,0.03026733,0.026624534,0.0,0.0,0.025169399,0.024945036,0.024382597000000002,0.0,0.0,0.026327958,0.03280834,0.028173767000000002
0.026327958,0.0,0.0,0.0,0.0,0.03147652,0.0,0.0,0.028616041000000002,0.033073552,0.0,0.034754135,0.0,0.031146333999999998,0.023079613,0.0,0.027969248999999998,0.029202892,0.0,0.027190383999999998,0.0,0.03026733,0.026624534,0.0,0.0,0.025169399,0.024945036,0.024382597000000002,0.0,0.0,0.0,0.03280834,0.028173767000000002,0.027587226
0.03280834,0.0,0.0,0.0,0.03147652,0.0,0.0,0.028616041000000002,0.033073552,0.0,0.034754135,0.0,0.031146333999999998,0.023079613,0.0,0.027969248999999998,0.029202892,0.0,0.027190383999999998,0.0,0.03026733,0.026624534,0.0,0.0,0.025169399,0.024945036,0.024382597000000002,0.0,0.0,0.0,0.026327958,0.028173767000000002,0.027587226,0.0
0.028173767000000002,0.0,0.0,0.03147652,0.0,0.0,0.028616041000000002,0.033073552,0.0,0.034754135,0.0,0.031146333999999998,0.023079613,0.0,0.027969248999999998,0.029202892,0.0,0.027190383999999998,0.0,0.03026733,0.026624534,0.0,0.0,0.025169399,0.024945036,0.024382597000000002,0.0,0.0,0.0,0.026327958,0.03280834,0.027587226,0.0,0.0
0.027587226,0.0,0.03147652,0.0,0.0,0.028616041000000002,0.033073552,0.0,0.034754135,0.0,0.031146333999999998,0.023079613,0.0,0.027969248999999998,0.029202892,0.0,0.027190383999999998,0.0,0.03026733,0.026624534,0.0,0.0,0.025169399,0.024945036,0.024382597000000002,0.0,0.0,0.0,0.026327958,0.03280834,0.028173767000000002,0.0,0.0,0.028579727000000006
0.0,0.03147652,0.0,0.0,0.028616041000000002,0.033073552,0.0,0.034754135,0.0,0.031146333999999998,0.023079613,0.0,0.027969248999999998,0.029202892,0.0,0.027190383999999998,0.0,0.03026733,0.026624534,0.0,0.0,0.025169399,0.024945036,0.024382597000000002,0.0,0.0,0.0,0.026327958,0.03280834,0.028173767000000002,0.027587226,0.0,0.028579727000000006,0.0
0.0,0.0,0.0,0.028616041000000002,0.033073552,0.0,0.034754135,0.0,0.031146333999999998,0.023079613,0.0,0.027969248999999998,0.029202892,0.0,0.027190383999999998,0.0,0.03026733,0.026624534,0.0,0.0,0.025169399,0.024945036,0.024382597000000002,0.0,0.0,0.0,0.026327958,0.03280834,0.028173767000000002,0.027587226,0.0,0.028579727000000006,0.0,0.0
0.028579727000000006,0.0,0.028616041000000002,0.033073552,0.0,0.034754135,0.0,0.031146333999999998,0.023079613,0.0,0.027969248999999998,0.029202892,0.0,0.027190383999999998,0.0,0.03026733,0.026624534,0.0,0.0,0.025169399,0.024945036,0.024382597000000002,0.0,0.0,0.0,0.026327958,0.03280834,0.028173767000000002,0.027587226,0.0,0.0,0.0,0.0,0.024670912000000003
0.0,0.028616041000000002,0.033073552,0.0,0.034754135,0.0,0.031146333999999998,0.023079613,0.0,0.027969248999999998,0.029202892,0.0,0.027190383999999998,0.0,0.03026733,0.026624534,0.0,0.0,0.025169399,0.024945036,0.024382597000000002,0.0,0.0,0.0,0.026327958,0.03280834,0.028173767000000002,0.027587226,0.0,0.0,0.028579727000000006,0.0,0.024670912000000003,0.0
0.0,0.033073552,0.0,0.034754135,0.0,0.031146333999999998,0.023079613,0.0,0.027969248999999998,0.029202892,0.0,0.027190383999999998,0.0,0.03026733,0.026624534,0.0,0.0,0.025169399,0.024945036,0.024382597000000002,0.0,0.0,0.0,0.026327958,0.03280834,0.028173767000000002,0.027587226,0.0,0.0,0.028579727000000006,0.0,0.024670912000000003,0.0,0.026715278999999998
0.024670912000000003,0.0,0.034754135,0.0,0.031146333999999998,0.023079613,0.0,0.027969248999999998,0.029202892,0.0,0.027190383999999998,0.0,0.03026733,0.026624534,0.0,0.0,0.025169399,0.024945036,0.024382597000000002,0.0,0.0,0.0,0.026327958,0.03280834,0.028173767000000002,0.027587226,0.0,0.0,0.028579727000000006,0.0,0.0,0.0,0.026715278999999998,0.0
0.0,0.034754135,0.0,0.031146333999999998,0.023079613,0.0,0.027969248999999998,0.029202892,0.0,0.027190383999999998,0.0,0.03026733,0.026624534,0.0,0.0,0.025169399,0.024945036,0.024382597000000002,0.0,0.0,0.0,0.026327958,0.03280834,0.028173767000000002,0.027587226,0.0,0.0,0.028579727000000006,0.0,0.0,0.024670912000000003,0.026715278999999998,0.0,0.021084002999999997
0.026715278999999998,0.0,0.031146333999999998,0.023079613,0.0,0.027969248999999998,0.029202892,0.0,0.027190383999999998,0.0,0.03026733,0.026624534,0.0,0.0,0.025169399,0.024945036,0.024382597000000002,0.0,0.0,0.0,0.026327958,0.03280834,0.028173767000000002,0.027587226,0.0,0.0,0.028579727000000006,0.0,0.0,0.024670912000000003,0.0,0.0,0.021084002999999997,0.034367412
0.0,0.031146333999999998,0.023079613,0.0,0.027969248999999998,0.029202892,0.0,0.027190383999999998,0.0,0.03026733,0.026624534,0.0,0.0,0.025169399,0.024945036,0.024382597000000002,0.0,0.0,0.0,0.026327958,0.03280834,0.028173767000000002,0.027587226,0.0,0.0,0.028579727000000006,0.0,0.0,0.024670912000000003,0.0,0.026715278999999998,0.021084002999999997,0.034367412,0.030741203999999998
0.021084002999999997,0.023079613,0.0,0.027969248999999998,0.029202892,0.0,0.027190383999999998,0.0,0.03026733,0.026624534,0.0,0.0,0.025169399,0.024945036,0.024382597000000002,0.0,0.0,0.0,0.026327958,0.03280834,0.028173767000000002,0.027587226,0.0,0.0,0.028579727000000006,0.0,0.0,0.024670912000000003,0.0,0.026715278999999998,0.0,0.034367412,0.030741203999999998,0.0
0.034367412,0.0,0.027969248999999998,0.029202892,0.0,0.027190383999999998,0.0,0.03026733,0.026624534,0.0,0.0,0.025169399,0.024945036,0.024382597000000002,0.0,0.0,0.0,0.026327958,0.03280834,0.028173767000000002,0.027587226,0.0,0.0,0.028579727000000006,0.0,0.0,0.024670912000000003,0.0,0.026715278999999998,0.0,0.021084002999999997,0.030741203999999998,0.0,0.03683098
0.030741203999999998,0.027969248999999998,0.029202892,0.0,0.027190383999999998,0.0,0.03026733,0.026624534,0.0,0.0,0.025169399,0.024945036,0.024382597000000002,0.0,0.0,0.0,0.026327958,0.03280834,0.028173767000000002,0.027587226,0.0,0.0,0.028579727000000006,0.0,0.0,0.024670912000000003,0.0,0.026715278999999998,0.0,0.021084002999999997,0.034367412,0.0,0.03683098,0.0
0.0,0.029202892,0.0,0.027190383999999998,0.0,0.03026733,0.026624534,0.0,0.0,0.025169399,0.024945036,0.024382597000000002,0.0,0.0,0.0,0.026327958,0.03280834,0.028173767000000002,0.027587226,0.0,0.0,0.028579727000000006,0.0,0.0,0.024670912000000003,0.0,0.026715278999999998,0.0,0.021084002999999997,0.034367412,0.030741203999999998,0.03683098,0.0,0.03204436
0.03683098,0.0,0.027190383999999998,0.0,0.03026733,0.026624534,0.0,0.0,0.025169399,0.024945036,0.024382597000000002,0.0,0.0,0.0,0.026327958,0.03280834,0.028173767000000002,0.027587226,0.0,0.0,0.028579727000000006,0.0,0.0,0.024670912000000003,0.0,0.026715278999999998,0.0,0.021084002999999997,0.034367412,0.030741203999999998,0.0,0.0,0.03204436,0.0
0.0,0.027190383999999998,0.0,0.03026733,0.026624534,0.0,0.0,0.025169399,0.024945036,0.024382597000000002,0.0,0.0,0.0,0.026327958,0.03280834,0.028173767000000002,0.027587226,0.0,0.0,0.028579727000000006,0.0,0.0,0.024670912000000003,0.0,0.026715278999999998,0.0,0.021084002999999997,0.034367412,0.030741203999999998,0.0,0.03683098,0.03204436,0.0,0.03040128
0.03204436,0.0,0.03026733,0.026624534,0.0,0.0,0.025169399,0.024945036,0.024382597000000002,0.0,0.0,0.0,0.026327958,0.03280834,0.028173767000000002,0.027587226,0.0,0.0,0.028579727000000006,0.0,0.0,0.024670912000000003,0.0,0.026715278999999998,0.0,0.021084002999999997,0.034367412,0.030741203999999998,0.0,0.03683098,0.0,0.0,0.03040128,0.0
0.0,0.03026733,0.026624534,0.0,0.0,0.025169399,0.024945036,0.024382597000000002,0.0,0.0,0.0,0.026327958,0.03280834,0.028173767000000002,0.027587226,0.0,0.0,0.028579727000000006,0.0,0.0,0.024670912000000003,0.0,0.026715278999999998,0.0,0.021084002999999997,0.034367412,0.030741203999999998,0.0,0.03683098,0.0,0.03204436,0.03040128,0.0,0.0
0.03040128,0.026624534,0.0,0.0,0.025169399,0.024945036,0.024382597000000002,0.0,0.0,0.0,0.026327958,0.03280834,0.028173767000000002,0.027587226,0.0,0.0,0.028579727000000006,0.0,0.0,0.024670912000000003,0.0,0.026715278999999998,0.0,0.021084002999999997,0.034367412,0.030741203999999998,0.0,0.03683098,0.0,0.03204436,0.0,0.0,0.0,0.0
0.0,0.0,0.0,0.025169399,0.024945036,0.024382597000000002,0.0,0.0,0.0,0.026327958,0.03280834,0.028173767000000002,0.027587226,0.0,0.0,0.028579727000000006,0.0,0.0,0.024670912000000003,0.0,0.026715278999999998,0.0,0.021084002999999997,0.034367412,0.030741203999999998,0.0,0.03683098,0.0,0.03204436,0.0,0.03040128,0.0,0.0,0.029653832
0.0,0.0,0.025169399,0.024945036,0.024382597000000002,0.0,0.0,0.0,0.026327958,0.03280834,0.028173767000000002,0.027587226,0.0,0.0,0.028579727000000006,0.0,0.0,0.024670912000000003,0.0,0.026715278999999998,0.0,0.021084002999999997,0.034367412,0.030741203999999998,0.0,0.03683098,0.0,0.03204436,0.0,0.03040128,0.0,0.0,0.029653832,0.0
0.0,0.025169399,0.024945036,0.024382597000000002,0.0,0.0,0.0,0.026327958,0.03280834,0.028173767000000002,0.027587226,0.0,0.0,0.028579727000000006,0.0,0.0,0.024670912000000003,0.0,0.026715278999999998,0.0,0.021084002999999997,0.034367412,0.030741203999999998,0.0,0.03683098,0.0,0.03204436,0.0,0.03040128,0.0,0.0,0.029653832,0.0,0.03372392
0.029653832,0.024945036,0.024382597000000002,0.0,0.0,0.0,0.026327958,0.03280834,0.028173767000000002,0.027587226,0.0,0.0,0.028579727000000006,0.0,0.0,0.024670912000000003,0.0,0.026715278999999998,0.0,0.021084002999999997,0.034367412,0.030741203999999998,0.0,0.03683098,0.0,0.03204436,0.0,0.03040128,0.0,0.0,0.0,0.0,0.03372392,0.0
0.0,0.024382597000000002,0.0,0.0,0.0,0.026327958,0.03280834,0.028173767000000002,0.027587226,0.0,0.0,0.028579727000000006,0.0,0.0,0.024670912000000003,0.0,0.026715278999999998,0.0,0.021084002999999997,0.034367412,0.030741203999999998,0.0,0.03683098,0.0,0.03204436,0.0,0.03040128,0.0,0.0,0.0,0.029653832,0.03372392,0.0,0.0
0.03372392,0.0,0.0,0.0,0.026327958,0.03280834,0.028173767000000002,0.027587226,0.0,0.0,0.028579727000000006,0.0,0.0,0.024670912000000003,0.0,0.026715278999999998,0.0,0.021084002999999997,0.034367412,0.030741203999999998,0.0,0.03683098,0.0,0.03204436,0.0,0.03040128,0.0,0.0,0.0,0.029653832,0.0,0.0,0.0,0.0
0.0,0.0,0.0,0.026327958,0.03280834,0.028173767000000002,0.027587226,0.0,0.0,0.028579727000000006,0.0,0.0,0.024670912000000003,0.0,0.026715278999999998,0.0,0.021084002999999997,0.034367412,0.030741203999999998,0.0,0.03683098,0.0,0.03204436,0.0,0.03040128,0.0,0.0,0.0,0.029653832,0.0,0.03372392,0.0,0.0,0.030988012000000002
0.0,0.0,0.026327958,0.03280834,0.028173767000000002,0.027587226,0.0,0.0,0.028579727000000006,0.0,0.0,0.024670912000000003,0.0,0.026715278999999998,0.0,0.021084002999999997,0.034367412,0.030741203999999998,0.0,0.03683098,0.0,0.03204436,0.0,0.03040128,0.0,0.0,0.0,0.029653832,0.0,0.03372392,0.0,0.0,0.030988012000000002,0.0
0.0,0.026327958,0.03280834,0.028173767000000002,0.027587226,0.0,0.0,0.028579727000000006,0.0,0.0,0.024670912000000003,0.0,0.026715278999999998,0.0,0.021084002999999997,0.034367412,0.030741203999999998,0.0,0.03683098,0.0,0.03204436,0.0,0.03040128,0.0,0.0,0.0,0.029653832,0.0,0.03372392,0.0,0.0,0.030988012000000002,0.0,0.0
0.030988012000000002,0.03280834,0.028173767000000002,0.027587226,0.0,0.0,0.028579727000000006,0.0,0.0,0.024670912000000003,0.0,0.026715278999999998,0.0,0.021084002999999997,0.034367412,0.030741203999999998,0.0,0.03683098,0.0,0.03204436,0.0,0.03040128,0.0,0.0,0.0,0.029653832,0.0,0.03372392,0.0,0.0,0.0,0.0,0.0,0.0
0.0,0.028173767000000002,0.027587226,0.0,0.0,0.028579727000000006,0.0,0.0,0.024670912000000003,0.0,0.026715278999999998,0.0,0.021084002999999997,0.034367412,0.030741203999999998,0.0,0.03683098,0.0,0.03204436,0.0,0.03040128,0.0,0.0,0.0,0.029653832,0.0,0.03372392,0.0,0.0,0.0,0.030988012000000002,0.0,0.0,0.0
0.0,0.027587226,0.0,0.0,0.028579727000000006,0.0,0.0,0.024670912000000003,0.0,0.026715278999999998,0.0,0.021084002999999997,0.034367412,0.030741203999999998,0.0,0.03683098,0.0,0.03204436,0.0,0.03040128,0.0,0.0,0.0,0.029653832,0.0,0.03372392,0.0,0.0,0.0,0.030988012000000002,0.0,0.0,0.0,0.026663145
0.0,0.0,0.0,0.028579727000000006,0.0,0.0,0.024670912000000003,0.0,0.026715278999999998,0.0,0.021084002999999997,0.034367412,0.030741203999999998,0.0,0.03683098,0.0,0.03204436,0.0,0.03040128,0.0,0.0,0.0,0.029653832,0.0,0.03372392,0.0,0.0,0.0,0.030988012000000002,0.0,0.0,0.0,0.026663145,0.029688664
0.0,0.0,0.028579727000000006,0.0,0.0,0.024670912000000003,0.0,0.026715278999999998,0.0,0.021084002999999997,0.034367412,0.030741203999999998,0.0,0.03683098,0.0,0.03204436,0.0,0.03040128,0.0,0.0,0.0,0.029653832,0.0,0.03372392,0.0,0.0,0.0,0.030988012000000002,0.0,0.0,0.0,0.026663145,0.029688664,0.030905787
0.026663145,0.028579727000000006,0.0,0.0,0.024670912000000003,0.0,0.026715278999999998,0.0,0.021084002999999997,0.034367412,0.030741203999999998,0.0,0.03683098,0.0,0.03204436,0.0,0.03040128,0.0,0.0,0.0,0.029653832,0.0,0.03372392,0.0,0.0,0.0,0.030988012000000002,0.0,0.0,0.0,0.0,0.029688664,0.030905787,0.027326051
0.029688664,0.0,0.0,0.024670912000000003,0.0,0.026715278999999998,0.0,0.021084002999999997,0.034367412,0.030741203999999998,0.0,0.03683098,0.0,0.03204436,0.0,0.03040128,0.0,0.0,0.0,0.029653832,0.0,0.03372392,0.0,0.0,0.0,0.030988012000000002,0.0,0.0,0.0,0.0,0.026663145,0.030905787,0.027326051,0.030373154
0.030905787,0.0,0.024670912000000003,0.0,0.026715278999999998,0.0,0.021084002999999997,0.034367412,0.030741203999999998,0.0,0.03683098,0.0,0.03204436,0.0,0.03040128,0.0,0.0,0.0,0.029653832,0.0,0.03372392,0.0,0.0,0.0,0.030988012000000002,0.0,0.0,0.0,0.0,0.026663145,0.029688664,0.027326051,0.030373154,0.0
0.027326051,0.024670912000000003,0.0,0.026715278999999998,0.0,0.021084002999999997,0.034367412,0.030741203999999998,0.0,0.03683098,0.0,0.03204436,0.0,0.03040128,0.0,0.0,0.0,0.029653832,0.0,0.03372392,0.0,0.0,0.0,0.030988012000000002,0.0,0.0,0.0,0.0,0.026663145,0.029688664,0.030905787,0.030373154,0.0,0.0
0.030373154,0.0,0.026715278999999998,0.0,0.021084002999999997,0.034367412,0.030741203999999998,0.0,0.03683098,0.0,0.03204436,0.0,0.03040128,0.0,0.0,0.0,0.029653832,0.0,0.03372392,0.0,0.0,0.0,0.030988012000000002,0.0,0.0,0.0,0.0,0.026663145,0.029688664,0.030905787,0.027326051,0.0,0.0,0.0
0.0,0.026715278999999998,0.0,0.021084002999999997,0.034367412,0.030741203999999998,0.0,0.03683098,0.0,0.03204436,0.0,0.03040128,0.0,0.0,0.0,0.029653832,0.0,0.03372392,0.0,0.0,0.0,0.030988012000000002,0.0,0.0,0.0,0.0,0.026663145,0.029688664,0.030905787,0.027326051,0.030373154,0.0,0.0,0.028311249
0.0,0.0,0.021084002999999997,0.034367412,0.030741203999999998,0.0,0.03683098,0.0,0.03204436,0.0,0.03040128,0.0,0.0,0.0,0.029653832,0.0,0.03372392,0.0,0.0,0.0,0.030988012000000002,0.0,0.0,0.0,0.0,0.026663145,0.029688664,0.030905787,0.027326051,0.030373154,0.0,0.0,0.028311249,0.0
0.0,0.021084002999999997,0.034367412,0.030741203999999998,0.0,0.03683098,0.0,0.03204436,0.0,0.03040128,0.0,0.0,0.0,0.029653832,0.0,0.03372392,0.0,0.0,0.0,0.030988012000000002,0.0,0.0,0.0,0.0,0.026663145,0.029688664,0.030905787,0.027326051,0.030373154,0.0,0.0,0.028311249,0.0,0.03330343
0.028311249,0.034367412,0.030741203999999998,0.0,0.03683098,0.0,0.03204436,0.0,0.03040128,0.0,0.0,0.0,0.029653832,0.0,0.03372392,0.0,0.0,0.0,0.030988012000000002,0.0,0.0,0.0,0.0,0.026663145,0.029688664,0.030905787,0.027326051,0.030373154,0.0,0.0,0.0,0.0,0.03330343,0.03085293
0.0,0.030741203999999998,0.0,0.03683098,0.0,0.03204436,0.0,0.03040128,0.0,0.0,0.0,0.029653832,0.0,0.03372392,0.0,0.0,0.0,0.030988012000000002,0.0,0.0,0.0,0.0,0.026663145,0.029688664,0.030905787,0.027326051,0.030373154,0.0,0.0,0.0,0.028311249,0.03330343,0.03085293,0.0
0.03330343,0.0,0.03683098,0.0,0.03204436,0.0,0.03040128,0.0,0.0,0.0,0.029653832,0.0,0.03372392,0.0,0.0,0.0,0.030988012000000002,0.0,0.0,0.0,0.0,0.026663145,0.029688664,0.030905787,0.027326051,0.030373154,0.0,0.0,0.0,0.028311249,0.0,0.03085293,0.0,0.030155612000000002
0.03085293,0.03683098,0.0,0.03204436,0.0,0.03040128,0.0,0.0,0.0,0.029653832,0.0,0.03372392,0.0,0.0,0.0,0.030988012000000002,0.0,0.0,0.0,0.0,0.026663145,0.029688664,0.030905787,0.027326051,0.030373154,0.0,0.0,0.0,0.028311249,0.0,0.03330343,0.0,0.030155612000000002,0.030081998999999998
0.0,0.0,0.03204436,0.0,0.03040128,0.0,0.0,0.0,0.029653832,0.0,0.03372392,0.0,0.0,0.0,0.030988012000000002,0.0,0.0,0.0,0.0,0.026663145,0.029688664,0.030905787,0.027326051,0.030373154,0.0,0.0,0.0,0.028311249,0.0,0.03330343,0.03085293,0.030155612000000002,0.030081998999999998,0.0
0.030155612000000002,0.03204436,0.0,0.03040128,0.0,0.0,0.0,0.029653832,0.0,0.03372392,0.0,0.0,0.0,0.030988012000000002,0.0,0.0,0.0,0.0,0.026663145,0.029688664,0.030905787,0.027326051,0.030373154,0.0,0.0,0.0,0.028311249,0.0,0.03330343,0.03085293,0.0,0.030081998999999998,0.0,0.030477196
0.030081998999999998,0.0,0.03040128,0.0,0.0,0.0,0.029653832,0.0,0.03372392,0.0,0.0,0.0,0.030988012000000002,0.0,0.0,0.0,0.0,0.026663145,0.029688664,0.030905787,0.027326051,0.030373154,0.0,0.0,0.0,0.028311249,0.0,0.03330343,0.03085293,0.0,0.030155612000000002,0.0,0.030477196,0.027273827999999996
0.0,0.03040128,0.0,0.0,0.0,0.029653832,0.0,0.03372392,0.0,0.0,0.0,0.030988012000000002,0.0,0.0,0.0,0.0,0.026663145,0.029688664,0.030905787,0.027326051,0.030373154,0.0,0.0,0.0,0.028311249,0.0,0.03330343,0.03085293,0.0,0.030155612000000002,0.030081998999999998,0.030477196,0.027273827999999996,0.031328373
0.030477196,0.0,0.0,0.0,0.029653832,0.0,0.03372392,0.0,0.0,0.0,0.030988012000000002,0.0,0.0,0.0,0.0,0.026663145,0.029688664,0.030905787,0.027326051,0.030373154,0.0,0.0,0.0,0.028311249,0.0,0.03330343,0.03085293,0.0,0.030155612000000002,0.030081998999999998,0.0,0.027273827999999996,0.031328373,0.027266997999999997
0.027273827999999996,0.0,0.0,0.029653832,0.0,0.03372392,0.0,0.0,0.0,0.030988012000000002,0.0,0.0,0.0,0.0,0.026663145,0.029688664,0.030905787,0.027326051,0.030373154,0.0,0.0,0.0,0.028311249,0.0,0.03330343,0.03085293,0.0,0.030155612000000002,0.030081998999999998,0.0,0.030477196,0.031328373,0.027266997999999997,0.0
0.031328373,0.0,0.029653832,0.0,0.03372392,0.0,0.0,0.0,0.030988012000000002,0.0,0.0,0.0,0.0,0.026663145,0.029688664,0.030905787,0.027326051,0.030373154,0.0,0.0,0.0,0.028311249,0.0,0.03330343,0.03085293,0.0,0.030155612000000002,0.030081998999999998,0.0,0.030477196,0.027273827999999996,0.027266997999999997,0.0,0.04942116
0.027266997999999997,0.029653832,0.0,0.03372392,0.0,0.0,0.0,0.030988012000000002,0.0,0.0,0.0,0.0,0.026663145,0.029688664,0.030905787,0.027326051,0.030373154,0.0,0.0,0.0,0.028311249,0.0,0.03330343,0.03085293,0.0,0.030155612000000002,0.030081998999999998,0.0,0.030477196,0.027273827999999996,0.031328373,0.0,0.04942116,0.027844483
0.0,0.0,0.03372392,0.0,0.0,0.0,0.030988012000000002,0.0,0.0,0.0,0.0,0.026663145,0.029688664,0.030905787,0.027326051,0.030373154,0.0,0.0,0.0,0.028311249,0.0,0.03330343,0.03085293,0.0,0.030155612000000002,0.030081998999999998,0.0,0.030477196,0.027273827999999996,0.031328373,0.027266997999999997,0.04942116,0.027844483,0.03481418
0.04942116,0.03372392,0.0,0.0,0.0,0.030988012000000002,0.0,0.0,0.0,0.0,0.026663145,0.029688664,0.030905787,0.027326051,0.030373154,0.0,0.0,0.0,0.028311249,0.0,0.03330343,0.03085293,0.0,0.030155612000000002,0.030081998999999998,0.0,0.030477196,0.027273827999999996,0.031328373,0.027266997999999997,0.0,0.027844483,0.03481418,0.039670736
0.027844483,0.0,0.0,0.0,0.030988012000000002,0.0,0.0,0.0,0.0,0.026663145,0.029688664,0.030905787,0.027326051,0.030373154,0.0,0.0,0.0,0.028311249,0.0,0.03330343,0.03085293,0.0,0.030155612000000002,0.030081998999999998,0.0,0.030477196,0.027273827999999996,0.031328373,0.027266997999999997,0.0,0.04942116,0.03481418,0.039670736,0.031300493
0.03481418,0.0,0.0,0.030988012000000002,0.0,0.0,0.0,0.0,0.026663145,0.029688664,0.030905787,0.027326051,0.030373154,0.0,0.0,0.0,0.028311249,0.0,0.03330343,0.03085293,0.0,0.030155612000000002,0.030081998999999998,0.0,0.030477196,0.027273827999999996,0.031328373,0.027266997999999997,0.0,0.04942116,0.027844483,0.039670736,0.031300493,0.0
0.039670736,0.0,0.030988012000000002,0.0,0.0,0.0,0.0,0.026663145,0.029688664,0.030905787,0.027326051,0.030373154,0.0,0.0,0.0,0.028311249,0.0,0.03330343,0.03085293,0.0,0.030155612000000002,0.030081998999999998,0.0,0.030477196,0.027273827999999996,0.031328373,0.027266997999999997,0.0,0.04942116,0.027844483,0.03481418,0.031300493,0.0,0.0
0.031300493,0.030988012000000002,0.0,0.0,0.0,0.0,0.026663145,0.029688664,0.030905787,0.027326051,0.030373154,0.0,0.0,0.0,0.028311249,0.0,0.03330343,0.03085293,0.0,0.030155612000000002,0.030081998999999998,0.0,0.030477196,0.027273827999999996,0.031328373,0.027266997999999997,0.0,0.04942116,0.027844483,0.03481418,0.039670736,0.0,0.0,0.0
0.0,0.0,0.0,0.0,0.0,0.026663145,0.029688664,0.030905787,0.027326051,0.030373154,0.0,0.0,0.0,0.028311249,0.0,0.03330343,0.03085293,0.0,0.030155612000000002,0.030081998999999998,0.0,0.030477196,0.027273827999999996,0.031328373,0.027266997999999997,0.0,0.04942116,0.027844483,0.03481418,0.039670736,0.031300493,0.0,0.0,0.030140062999999998
0.0,0.0,0.0,0.0,0.026663145,0.029688664,0.030905787,0.027326051,0.030373154,0.0,0.0,0.0,0.028311249,0.0,0.03330343,0.03085293,0.0,0.030155612000000002,0.030081998999999998,0.0,0.030477196,0.027273827999999996,0.031328373,0.027266997999999997,0.0,0.04942116,0.027844483,0.03481418,0.039670736,0.031300493,0.0,0.0,0.030140062999999998,0.0
0.0,0.0,0.0,0.026663145,0.029688664,0.030905787,0.027326051,0.030373154,0.0,0.0,0.0,0.028311249,0.0,0.03330343,0.03085293,0.0,0.030155612000000002,0.030081998999999998,0.0,0.030477196,0.027273827999999996,0.031328373,0.027266997999999997,0.0,0.04942116,0.027844483,0.03481418,0.039670736,0.031300493,0.0,0.0,0.030140062999999998,0.0,0.0
0.030140062999999998,0.0,0.026663145,0.029688664,0.030905787,0.027326051,0.030373154,0.0,0.0,0.0,0.028311249,0.0,0.03330343,0.03085293,0.0,0.030155612000000002,0.030081998999999998,0.0,0.030477196,0.027273827999999996,0.031328373,0.027266997999999997,0.0,0.04942116,0.027844483,0.03481418,0.039670736,0.031300493,0.0,0.0,0.0,0.0,0.0,0.030006874
0.0,0.026663145,0.029688664,0.030905787,0.027326051,0.030373154,0.0,0.0,0.0,0.028311249,0.0,0.03330343,0.03085293,0.0,0.030155612000000002,0.030081998999999998,0.0,0.030477196,0.027273827999999996,0.031328373,0.027266997999999997,0.0,0.04942116,0.027844483,0.03481418,0.039670736,0.031300493,0.0,0.0,0.0,0.030140062999999998,0.0,0.030006874,0.048903435
0.0,0.029688664,0.030905787,0.027326051,0.030373154,0.0,0.0,0.0,0.028311249,0.0,0.03330343,0.03085293,0.0,0.030155612000000002,0.030081998999999998,0.0,0.030477196,0.027273827999999996,0.031328373,0.027266997999999997,0.0,0.04942116,0.027844483,0.03481418,0.039670736,0.031300493,0.0,0.0,0.0,0.030140062999999998,0.0,0.030006874,0.048903435,0.0
0.030006874,0.030905787,0.027326051,0.030373154,0.0,0.0,0.0,0.028311249,0.0,0.03330343,0.03085293,0.0,0.030155612000000002,0.030081998999999998,0.0,0.030477196,0.027273827999999996,0.031328373,0.027266997999999997,0.0,0.04942116,0.027844483,0.03481418,0.039670736,0.031300493,0.0,0.0,0.0,0.030140062999999998,0.0,0.0,0.048903435,0.0,0.0
0.048903435,0.027326051,0.030373154,0.0,0.0,0.0,0.028311249,0.0,0.03330343,0.03085293,0.0,0.030155612000000002,0.030081998999999998,0.0,0.030477196,0.027273827999999996,0.031328373,0.027266997999999997,0.0,0.04942116,0.027844483,0.03481418,0.039670736,0.031300493,0.0,0.0,0.0,0.030140062999999998,0.0,0.0,0.030006874,0.0,0.0,0.03646863
0.0,0.030373154,0.0,0.0,0.0,0.028311249,0.0,0.03330343,0.03085293,0.0,0.030155612000000002,0.030081998999999998,0.0,0.030477196,0.027273827999999996,0.031328373,0.027266997999999997,0.0,0.04942116,0.027844483,0.03481418,0.039670736,0.031300493,0.0,0.0,0.0,0.030140062999999998,0.0,0.0,0.030006874,0.048903435,0.0,0.03646863,0.0
0.0,0.0,0.0,0.0,0.028311249,0.0,0.03330343,0.03085293,0.0,0.030155612000000002,0.030081998999999998,0.0,0.030477196,0.027273827999999996,0.031328373,0.027266997999999997,0.0,0.04942116,0.027844483,0.03481418,0.039670736,0.031300493,0.0,0.0,0.0,0.030140062999999998,0.0,0.0,0.030006874,0.048903435,0.0,0.03646863,0.0,0.036828566
0.03646863,0.0,0.0,0.028311249,0.0,0.03330343,0.03085293,0.0,0.030155612000000002,0.030081998999999998,0.0,0.030477196,0.027273827999999996,0.031328373,0.027266997999999997,0.0,0.04942116,0.027844483,0.03481418,0.039670736,0.031300493,0.0,0.0,0.0,0.030140062999999998,0.0,0.0,0.030006874,0.048903435,0.0,0.0,0.0,0.036828566,0.0
0.0,0.0,0.028311249,0.0,0.03330343,0.03085293,0.0,0.030155612000000002,0.030081998999999998,0.0,0.030477196,0.027273827999999996,0.031328373,0.027266997999999997,0.0,0.04942116,0.027844483,0.03481418,0.039670736,0.031300493,0.0,0.0,0.0,0.030140062999999998,0.0,0.0,0.030006874,0.048903435,0.0,0.0,0.03646863,0.036828566,0.0,0.0
0.036828566,0.028311249,0.0,0.03330343,0.03085293,0.0,0.030155612000000002,0.030081998999999998,0.0,0.030477196,0.027273827999999996,0.031328373,0.027266997999999997,0.0,0.04942116,0.027844483,0.03481418,0.039670736,0.031300493,0.0,0.0,0.0,0.030140062999999998,0.0,0.0,0.030006874,0.048903435,0.0,0.0,0.03646863,0.0,0.0,0.0,0.03847526
0.0,0.0,0.03330343,0.03085293,0.0,0.030155612000000002,0.030081998999999998,0.0,0.030477196,0.027273827999999996,0.031328373,0.027266997999999997,0.0,0.04942116,0.027844483,0.03481418,0.039670736,0.031300493,0.0,0.0,0.0,0.030140062999999998,0.0,0.0,0.030006874,0.048903435,0.0,0.0,0.03646863,0.0,0.036828566,0.0,0.03847526,0.0
0.0,0.03330343,0.03085293,0.0,0.030155612000000002,0.030081998999999998,0.0,0.030477196,0.027273827999999996,0.031328373,0.027266997999999997,0.0,0.04942116,0.027844483,0.03481418,0.039670736,0.031300493,0.0,0.0,0.0,0.030140062999999998,0.0,0.0,0.030006874,0.048903435,0.0,0.0,0.03646863,0.0,0.036828566,0.0,0.03847526,0.0,0.0
0.03847526,0.03085293,0.0,0.030155612000000002,0.030081998999999998,0.0,0.030477196,0.027273827999999996,0.031328373,0.027266997999999997,0.0,0.04942116,0.027844483,0.03481418,0.039670736,0.031300493,0.0,0.0,0.0,0.030140062999999998,0.0,0.0,0.030006874,0.048903435,0.0,0.0,0.03646863,0.0,0.036828566,0.0,0.0,0.0,0.0,0.034608826
0.0,0.0,0.030155612000000002,0.030081998999999998,0.0,0.030477196,0.027273827999999996,0.031328373,0.027266997999999997,0.0,0.04942116,0.027844483,0.03481418,0.039670736,0.031300493,0.0,0.0,0.0,0.030140062999999998,0.0,0.0,0.030006874,0.048903435,0.0,0.0,0.03646863,0.0,0.036828566,0.0,0.0,0.03847526,0.0,0.034608826,0.03520709
0.0,0.030155612000000002,0.030081998999999998,0.0,0.030477196,0.027273827999999996,0.031328373,0.027266997999999997,0.0,0.04942116,0.027844483,0.03481418,0.039670736,0.031300493,0.0,0.0,0.0,0.030140062999999998,0.0,0.0,0.030006874,0.048903435,0.0,0.0,0.03646863,0.0,0.036828566,0.0,0.0,0.03847526,0.0,0.034608826,0.03520709,0.033102627999999995
