date,latitude,longitude,value
2020-06-01,52.508251,4.53346975,0.0
2020-06-02,52.508251,4.53346975,0.0
2020-06-03,52.508251,4.53346975,0.0
2020-06-04,52.508251,4.53346975,0.0
2020-06-05,52.508251,4.53346975,0.0
2020-06-06,52.508251,4.53346975,0.0
2020-06-07,52.508251,4.53346975,0.0
2020-06-08,52.508251,4.53346975,0.03254177
2020-06-09,52.508251,4.53346975,0.032943845
2020-06-10,52.508251,4.53346975,0.0
2020-06-11,52.508251,4.53346975,0.0
2020-06-12,52.508251,4.53346975,0.024613198
2020-06-13,52.508251,4.53346975,0.0
2020-06-14,52.508251,4.53346975,0.0
2020-06-15,52.508251,4.53346975,0.0
2020-06-16,52.508251,4.53346975,0.0
2020-06-17,52.508251,4.53346975,0.0
2020-06-18,52.508251,4.53346975,0.0
2020-06-19,52.508251,4.53346975,0.0
2020-06-20,52.508251,4.53346975,0.02938687
2020-06-21,52.508251,4.53346975,0.0
2020-06-22,52.508251,4.53346975,0.028167183
2020-06-23,52.508251,4.53346975,0.0
2020-06-24,52.508251,4.53346975,0.0
2020-06-25,52.508251,4.53346975,0.034754135
2020-06-26,52.508251,4.53346975,0.0
2020-06-27,52.508251,4.53346975,0.031146334
2020-06-28,52.508251,4.53346975,0.023079613
2020-06-29,52.508251,4.53346975,0.0
2020-06-30,52.508251,4.53346975,0.0
2020-07-01,52.508251,4.53346975,0.029202892
2020-07-02,52.508251,4.53346975,0.0
2020-07-03,52.508251,4.53346975,0.0288241
2020-07-04,52.508251,4.53346975,0.0
2020-07-05,52.508251,4.53346975,0.03026733
2020-07-06,52.508251,4.53346975,0.026624534
2020-07-07,52.508251,4.53346975,0.0
2020-07-08,52.508251,4.53346975,0.028724907
2020-07-09,52.508251,4.53346975,0.03038414
2020-07-10,52.508251,4.53346975,0.024945036
2020-07-11,52.508251,4.53346975,0.024382597
2020-07-12,52.508251,4.53346975,0.0
2020-07-13,52.508251,4.53346975,0.0
2020-07-14,52.508251,4.53346975,0.0
2020-07-15,52.508251,4.53346975,0.026327958
2020-07-16,52.508251,4.53346975,0.03280834
2020-07-17,52.508251,4.53346975,0.028173767
2020-07-18,52.508251,4.53346975,0.027587226
2020-07-19,52.508251,4.53346975,0.0
2020-07-20,52.508251,4.53346975,0.028049905
2020-07-21,52.508251,4.53346975,0.028579727000000006
2020-07-22,52.508251,4.53346975,0.0
2020-07-23,52.508251,4.53346975,0.0
2020-07-24,52.508251,4.53346975,0.024670912000000003
2020-07-25,52.508251,4.53346975,0.0
2020-07-26,52.508251,4.53346975,0.029781675
2020-07-27,52.508251,4.53346975,0.0
2020-07-28,52.508251,4.53346975,0.021084003
2020-07-29,52.508251,4.53346975,0.0
2020-07-30,52.508251,4.53346975,0.030741204
2020-07-31,52.508251,4.53346975,0.0
2020-08-02,52.508251,4.53346975,0.0
2020-08-03,52.508251,4.53346975,0.0
2020-08-04,52.508251,4.53346975,0.032056708
2020-08-05,52.508251,4.53346975,0.0
2020-08-06,52.508251,4.53346975,0.03040128
2020-08-07,52.508251,4.53346975,0.029110588
2020-08-08,52.508251,4.53346975,0.0
2020-08-09,52.508251,4.53346975,0.0
2020-08-10,52.508251,4.53346975,0.0
2020-08-11,52.508251,4.53346975,0.0
2020-08-12,52.508251,4.53346975,0.03372392
2020-08-13,52.508251,4.53346975,0.0
2020-08-14,52.508251,4.53346975,0.0
2020-08-15,52.508251,4.53346975,0.0
2020-08-16,52.508251,4.53346975,0.028350255
2020-08-17,52.508251,4.53346975,0.0
2020-08-18,52.508251,4.53346975,0.03217579
2020-08-19,52.508251,4.53346975,0.0
2020-08-20,52.508251,4.53346975,0.0
2020-08-21,52.508251,4.53346975,0.0
2020-08-22,52.508251,4.53346975,0.028613677
2020-08-23,52.508251,4.53346975,0.028876577
2020-08-24,52.508251,4.53346975,0.026925886
2020-08-25,52.508251,4.53346975,0.030711472000000007
2020-08-26,52.508251,4.53346975,0.0
2020-08-27,52.508251,4.53346975,0.0
2020-08-28,52.508251,4.53346975,0.0
2020-08-29,52.508251,4.53346975,0.029793877000000007
2020-08-30,52.508251,4.53346975,0.0
2020-08-31,52.508251,4.53346975,0.034424107999999995
2020-09-01,52.508251,4.53346975,0.03085293
2020-09-02,52.508251,4.53346975,0.0
2020-09-03,52.508251,4.53346975,0.0
2020-09-04,52.508251,4.53346975,0.030081999
2020-09-05,52.508251,4.53346975,0.0
2020-09-06,52.508251,4.53346975,0.030477196
2020-09-07,52.508251,4.53346975,0.028809462
2020-09-08,52.508251,4.53346975,0.031328373
2020-09-09,52.508251,4.53346975,0.027266998
2020-09-10,52.508251,4.53346975,0.0
2020-09-11,52.508251,4.53346975,0.04942116
2020-09-12,52.508251,4.53346975,0.027844483
2020-09-13,52.508251,4.53346975,0.03481418
2020-09-15,52.508251,4.53346975,0.03943741
2020-09-16,52.508251,4.53346975,0.032928902999999995
2020-09-17,52.508251,4.53346975,0.0
2020-09-18,52.508251,4.53346975,0.0
2020-09-19,52.508251,4.53346975,0.0
2020-09-20,52.508251,4.53346975,0.030140063
2020-09-21,52.508251,4.53346975,0.0
2020-09-22,52.508251,4.53346975,0.0
2020-09-23,52.508251,4.53346975,0.030006874
2020-09-24,52.508251,4.53346975,0.04920044
2020-09-25,52.508251,4.53346975,0.0
2020-09-26,52.508251,4.53346975,0.0
2020-09-27,52.508251,4.53346975,0.03630007
2020-09-28,52.508251,4.53346975,0.0
2020-09-29,52.508251,4.53346975,0.036828566
2020-09-30,52.508251,4.53346975,0.0
2020-10-01,52.508251,4.53346975,0.0
2020-10-02,52.508251,4.53346975,0.0
2020-10-03,52.508251,4.53346975,0.0
2020-10-04,52.508251,4.53346975,0.0
2020-10-05,52.508251,4.53346975,0.032226842
2020-10-06,52.508251,4.53346975,0.033145156
2020-10-07,52.508251,4.53346975,0.03384529
2020-10-08,52.508251,4.53346975,0.03390552
