52.508251,4.49875125,0.0
52.508251,4.53346975,2784.4483
52.508251,4.56818825,2784.4483
52.508251,4.60290675,2784.4483
52.508251,4.63762525,3464.6780000000003
52.508251,4.6723437500000005,3464.6780000000003
52.508251,4.70706225,3464.6780000000003
52.508251,4.74178075,3400.997
52.48645500000001,4.49875125,0.0
52.48645500000001,4.53346975,2784.4483
52.48645500000001,4.56818825,2784.4483
52.48645500000001,4.60290675,3279.7456
52.48645500000001,4.63762525,3453.4622
52.48645500000001,4.6723437500000005,3453.4622
52.48645500000001,4.70706225,3453.4622
52.48645500000001,4.74178075,3400.997
52.464659,4.49875125,0.0
52.464659,4.53346975,3279.7456
52.464659,4.56818825,3279.7456
52.464659,4.60290675,3279.7456
52.464659,4.63762525,3453.4622
52.464659,4.6723437500000005,3453.4622
52.464659,4.70706225,3453.4622
52.464659,4.74178075,3453.4622
52.442863,4.49875125,0.0
52.442863,4.53346975,3279.7456
52.442863,4.56818825,3279.7456
52.442863,4.60290675,3279.7456
52.442863,4.63762525,3279.7456
52.442863,4.6723437500000005,3235.5946000000004
52.442863,4.70706225,3235.5946000000004
52.442863,4.74178075,3235.5946000000004
52.421067,4.49875125,0.0
52.421067,4.53346975,0.0
52.421067,4.56818825,3089.0978999999998
52.421067,4.60290675,3089.0978999999998
52.421067,4.63762525,3089.0978999999998
52.421067,4.6723437500000005,3235.5946000000004
52.421067,4.70706225,3235.5946000000004
52.421067,4.74178075,3235.5946000000004
52.399271,4.49875125,0.0
52.399271,4.53346975,0.0
52.399271,4.56818825,3089.0978999999998
52.399271,4.60290675,3089.0978999999998
52.399271,4.63762525,3089.0978999999998
52.399271,4.6723437500000005,3235.5946000000004
52.399271,4.70706225,3408.421
52.399271,4.74178075,0.0
