latitude,longitude,value
52.508251,4.49875125,0.034754135
52.508251,4.53346975,0.034754135
52.508251,4.56818825,0.034754135
52.508251,4.60290675,0.029300166000000002
52.508251,4.63762525,0.029300166000000002
52.508251,4.6723437500000005,0.029300166000000002
52.508251,4.70706225,0.02757314
52.508251,4.74178075,0.02757314
52.48645500000001,4.49875125,0.034754135
52.48645500000001,4.53346975,0.034754135
52.48645500000001,4.56818825,0.034754135
52.48645500000001,4.60290675,0.029544208
52.48645500000001,4.63762525,0.029544208
52.48645500000001,4.6723437500000005,0.029544208
52.48645500000001,4.70706225,0.029544208
52.48645500000001,4.74178075,0.02757314
52.464659,4.49875125,0.03222478
52.464659,4.53346975,0.03222478
52.464659,4.56818825,0.03222478
52.464659,4.60290675,0.03222478
52.464659,4.63762525,0.029544208
52.464659,4.6723437500000005,0.029544208
52.464659,4.70706225,0.029544208
52.464659,4.74178075,0.028335997999999998
52.442863,4.49875125,0.030524855
52.442863,4.53346975,0.03222478
52.442863,4.56818825,0.03222478
52.442863,4.60290675,0.03222478
52.442863,4.63762525,0.029612036
52.442863,4.6723437500000005,0.029612036
52.442863,4.70706225,0.029612036
52.442863,4.74178075,0.028335997999999998
52.421067,4.49875125,0.030524855
52.421067,4.53346975,0.03222478
52.421067,4.56818825,0.028303462999999997
52.421067,4.60290675,0.028303462999999997
52.421067,4.63762525,0.029612036
52.421067,4.6723437500000005,0.029612036
52.421067,4.70706225,0.029612036
52.421067,4.74178075,0.029612036
52.399271,4.49875125,0.0
52.399271,4.53346975,0.028303462999999997
52.399271,4.56818825,0.028303462999999997
52.399271,4.60290675,0.028303462999999997
52.399271,4.63762525,0.028303462999999997
52.399271,4.6723437500000005,0.02954039
52.399271,4.70706225,0.02954039
52.399271,4.74178075,0.0
