value,value-30,value-29,value-28,value-27,value-26,value-25,value-24,value-23,value-22,value-21,value-20,value-19,value-18,value-17,value-16,value-15,value-14,value-13,value-12,value-11,value-10,value-9,value-8,value-7,value-6,value-5,value-4,value-3,value-2,value-1,Prediction+1,Prediction+2,Prediction+3
0.029202892,0.0,0.030255107000000007,0.0,0.0,0.0,0.029726432999999997,0.0,0.03254177,0.0,0.0,0.0,0.03027703,0.032237615,0.0,0.0,0.0,0.03151536,0.026933257000000002,0.030023066,0.02938687,0.0,0.028616041000000002,0.033073552,0.03172306,0.029544208,0.0,0.031146333999999998,0.023079613,0.0,0.02564431,0.025928347999999997,0.027190383999999998,0.0
0.025928347999999997,0.030255107000000007,0.0,0.0,0.0,0.029726432999999997,0.0,0.03254177,0.0,0.0,0.0,0.03027703,0.032237615,0.0,0.0,0.0,0.03151536,0.026933257000000002,0.030023066,0.02938687,0.0,0.028616041000000002,0.033073552,0.03172306,0.029544208,0.0,0.031146333999999998,0.023079613,0.0,0.02564431,0.029202892,0.027190383999999998,0.0,0.03129725
0.027190383999999998,0.0,0.0,0.0,0.029726432999999997,0.0,0.03254177,0.0,0.0,0.0,0.03027703,0.032237615,0.0,0.0,0.0,0.03151536,0.026933257000000002,0.030023066,0.02938687,0.0,0.028616041000000002,0.033073552,0.03172306,0.029544208,0.0,0.031146333999999998,0.023079613,0.0,0.02564431,0.029202892,0.025928347999999997,0.0,0.03129725,0.02573491
0.0,0.0,0.0,0.029726432999999997,0.0,0.03254177,0.0,0.0,0.0,0.03027703,0.032237615,0.0,0.0,0.0,0.03151536,0.026933257000000002,0.030023066,0.02938687,0.0,0.028616041000000002,0.033073552,0.03172306,0.029544208,0.0,0.031146333999999998,0.023079613,0.0,0.02564431,0.029202892,0.025928347999999997,0.027190383999999998,0.03129725,0.02573491,0.0
0.03129725,0.0,0.029726432999999997,0.0,0.03254177,0.0,0.0,0.0,0.03027703,0.032237615,0.0,0.0,0.0,0.03151536,0.026933257000000002,0.030023066,0.02938687,0.0,0.028616041000000002,0.033073552,0.03172306,0.029544208,0.0,0.031146333999999998,0.023079613,0.0,0.02564431,0.029202892,0.025928347999999997,0.027190383999999998,0.0,0.02573491,0.0,0.0
0.02573491,0.029726432999999997,0.0,0.03254177,0.0,0.0,0.0,0.03027703,0.032237615,0.0,0.0,0.0,0.03151536,0.026933257000000002,0.030023066,0.02938687,0.0,0.028616041000000002,0.033073552,0.03172306,0.029544208,0.0,0.031146333999999998,0.023079613,0.0,0.02564431,0.029202892,0.025928347999999997,0.027190383999999998,0.0,0.03129725,0.0,0.0,0.03038414
0.0,0.0,0.03254177,0.0,0.0,0.0,0.03027703,0.032237615,0.0,0.0,0.0,0.03151536,0.026933257000000002,0.030023066,0.02938687,0.0,0.028616041000000002,0.033073552,0.03172306,0.029544208,0.0,0.031146333999999998,0.023079613,0.0,0.02564431,0.029202892,0.025928347999999997,0.027190383999999998,0.0,0.03129725,0.02573491,0.0,0.03038414,0.024945036
0.0,0.03254177,0.0,0.0,0.0,0.03027703,0.032237615,0.0,0.0,0.0,0.03151536,0.026933257000000002,0.030023066,0.02938687,0.0,0.028616041000000002,0.033073552,0.03172306,0.029544208,0.0,0.031146333999999998,0.023079613,0.0,0.02564431,0.029202892,0.025928347999999997,0.027190383999999998,0.0,0.03129725,0.02573491,0.0,0.03038414,0.024945036,0.024382597000000002
0.03038414,0.0,0.0,0.0,0.03027703,0.032237615,0.0,0.0,0.0,0.03151536,0.026933257000000002,0.030023066,0.02938687,0.0,0.028616041000000002,0.033073552,0.03172306,0.029544208,0.0,0.031146333999999998,0.023079613,0.0,0.02564431,0.029202892,0.025928347999999997,0.027190383999999998,0.0,0.03129725,0.02573491,0.0,0.0,0.024945036,0.024382597000000002,0.0
0.024945036,0.0,0.0,0.03027703,0.032237615,0.0,0.0,0.0,0.03151536,0.026933257000000002,0.030023066,0.02938687,0.0,0.028616041000000002,0.033073552,0.03172306,0.029544208,0.0,0.031146333999999998,0.023079613,0.0,0.02564431,0.029202892,0.025928347999999997,0.027190383999999998,0.0,0.03129725,0.02573491,0.0,0.0,0.03038414,0.024382597000000002,0.0,0.034324855
0.024382597000000002,0.0,0.03027703,0.032237615,0.0,0.0,0.0,0.03151536,0.026933257000000002,0.030023066,0.02938687,0.0,0.028616041000000002,0.033073552,0.03172306,0.029544208,0.0,0.031146333999999998,0.023079613,0.0,0.02564431,0.029202892,0.025928347999999997,0.027190383999999998,0.0,0.03129725,0.02573491,0.0,0.0,0.03038414,0.024945036,0.0,0.034324855,0.0
0.0,0.03027703,0.032237615,0.0,0.0,0.0,0.03151536,0.026933257000000002,0.030023066,0.02938687,0.0,0.028616041000000002,0.033073552,0.03172306,0.029544208,0.0,0.031146333999999998,0.023079613,0.0,0.02564431,0.029202892,0.025928347999999997,0.027190383999999998,0.0,0.03129725,0.02573491,0.0,0.0,0.03038414,0.024945036,0.024382597000000002,0.034324855,0.0,0.026327958
0.034324855,0.032237615,0.0,0.0,0.0,0.03151536,0.026933257000000002,0.030023066,0.02938687,0.0,0.028616041000000002,0.033073552,0.03172306,0.029544208,0.0,0.031146333999999998,0.023079613,0.0,0.02564431,0.029202892,0.025928347999999997,0.027190383999999998,0.0,0.03129725,0.02573491,0.0,0.0,0.03038414,0.024945036,0.024382597000000002,0.0,0.0,0.026327958,0.028268582999999996
0.0,0.0,0.0,0.0,0.03151536,0.026933257000000002,0.030023066,0.02938687,0.0,0.028616041000000002,0.033073552,0.03172306,0.029544208,0.0,0.031146333999999998,0.023079613,0.0,0.02564431,0.029202892,0.025928347999999997,0.027190383999999998,0.0,0.03129725,0.02573491,0.0,0.0,0.03038414,0.024945036,0.024382597000000002,0.0,0.034324855,0.026327958,0.028268582999999996,0.028173767000000002
0.026327958,0.0,0.0,0.03151536,0.026933257000000002,0.030023066,0.02938687,0.0,0.028616041000000002,0.033073552,0.03172306,0.029544208,0.0,0.031146333999999998,0.023079613,0.0,0.02564431,0.029202892,0.025928347999999997,0.027190383999999998,0.0,0.03129725,0.02573491,0.0,0.0,0.03038414,0.024945036,0.024382597000000002,0.0,0.034324855,0.0,0.028268582999999996,0.028173767000000002,0.027587226
0.028268582999999996,0.0,0.03151536,0.026933257000000002,0.030023066,0.02938687,0.0,0.028616041000000002,0.033073552,0.03172306,0.029544208,0.0,0.031146333999999998,0.023079613,0.0,0.02564431,0.029202892,0.025928347999999997,0.027190383999999998,0.0,0.03129725,0.02573491,0.0,0.0,0.03038414,0.024945036,0.024382597000000002,0.0,0.034324855,0.0,0.026327958,0.028173767000000002,0.027587226,0.0
0.028173767000000002,0.03151536,0.026933257000000002,0.030023066,0.02938687,0.0,0.028616041000000002,0.033073552,0.03172306,0.029544208,0.0,0.031146333999999998,0.023079613,0.0,0.02564431,0.029202892,0.025928347999999997,0.027190383999999998,0.0,0.03129725,0.02573491,0.0,0.0,0.03038414,0.024945036,0.024382597000000002,0.0,0.034324855,0.0,0.026327958,0.028268582999999996,0.027587226,0.0,0.028049905
0.027587226,0.026933257000000002,0.030023066,0.02938687,0.0,0.028616041000000002,0.033073552,0.03172306,0.029544208,0.0,0.031146333999999998,0.023079613,0.0,0.02564431,0.029202892,0.025928347999999997,0.027190383999999998,0.0,0.03129725,0.02573491,0.0,0.0,0.03038414,0.024945036,0.024382597000000002,0.0,0.034324855,0.0,0.026327958,0.028268582999999996,0.028173767000000002,0.0,0.028049905,0.028474912
0.0,0.030023066,0.02938687,0.0,0.028616041000000002,0.033073552,0.03172306,0.029544208,0.0,0.031146333999999998,0.023079613,0.0,0.02564431,0.029202892,0.025928347999999997,0.027190383999999998,0.0,0.03129725,0.02573491,0.0,0.0,0.03038414,0.024945036,0.024382597000000002,0.0,0.034324855,0.0,0.026327958,0.028268582999999996,0.028173767000000002,0.027587226,0.028049905,0.028474912,0.0
0.028049905,0.02938687,0.0,0.028616041000000002,0.033073552,0.03172306,0.029544208,0.0,0.031146333999999998,0.023079613,0.0,0.02564431,0.029202892,0.025928347999999997,0.027190383999999998,0.0,0.03129725,0.02573491,0.0,0.0,0.03038414,0.024945036,0.024382597000000002,0.0,0.034324855,0.0,0.026327958,0.028268582999999996,0.028173767000000002,0.027587226,0.0,0.028474912,0.0,0.0
0.028474912,0.0,0.028616041000000002,0.033073552,0.03172306,0.029544208,0.0,0.031146333999999998,0.023079613,0.0,0.02564431,0.029202892,0.025928347999999997,0.027190383999999998,0.0,0.03129725,0.02573491,0.0,0.0,0.03038414,0.024945036,0.024382597000000002,0.0,0.034324855,0.0,0.026327958,0.028268582999999996,0.028173767000000002,0.027587226,0.0,0.028049905,0.0,0.0,0.024670912000000003
0.0,0.028616041000000002,0.033073552,0.03172306,0.029544208,0.0,0.031146333999999998,0.023079613,0.0,0.02564431,0.029202892,0.025928347999999997,0.027190383999999998,0.0,0.03129725,0.02573491,0.0,0.0,0.03038414,0.024945036,0.024382597000000002,0.0,0.034324855,0.0,0.026327958,0.028268582999999996,0.028173767000000002,0.027587226,0.0,0.028049905,0.028474912,0.0,0.024670912000000003,0.0
0.0,0.033073552,0.03172306,0.029544208,0.0,0.031146333999999998,0.023079613,0.0,0.02564431,0.029202892,0.025928347999999997,0.027190383999999998,0.0,0.03129725,0.02573491,0.0,0.0,0.03038414,0.024945036,0.024382597000000002,0.0,0.034324855,0.0,0.026327958,0.028268582999999996,0.028173767000000002,0.027587226,0.0,0.028049905,0.028474912,0.0,0.024670912000000003,0.0,0.030323562999999998
0.024670912000000003,0.03172306,0.029544208,0.0,0.031146333999999998,0.023079613,0.0,0.02564431,0.029202892,0.025928347999999997,0.027190383999999998,0.0,0.03129725,0.02573491,0.0,0.0,0.03038414,0.024945036,0.024382597000000002,0.0,0.034324855,0.0,0.026327958,0.028268582999999996,0.028173767000000002,0.027587226,0.0,0.028049905,0.028474912,0.0,0.0,0.0,0.030323562999999998,0.0
0.0,0.029544208,0.0,0.031146333999999998,0.023079613,0.0,0.02564431,0.029202892,0.025928347999999997,0.027190383999999998,0.0,0.03129725,0.02573491,0.0,0.0,0.03038414,0.024945036,0.024382597000000002,0.0,0.034324855,0.0,0.026327958,0.028268582999999996,0.028173767000000002,0.027587226,0.0,0.028049905,0.028474912,0.0,0.0,0.024670912000000003,0.030323562999999998,0.0,0.021084002999999997
0.030323562999999998,0.0,0.031146333999999998,0.023079613,0.0,0.02564431,0.029202892,0.025928347999999997,0.027190383999999998,0.0,0.03129725,0.02573491,0.0,0.0,0.03038414,0.024945036,0.024382597000000002,0.0,0.034324855,0.0,0.026327958,0.028268582999999996,0.028173767000000002,0.027587226,0.0,0.028049905,0.028474912,0.0,0.0,0.024670912000000003,0.0,0.0,0.021084002999999997,0.03214978
0.0,0.031146333999999998,0.023079613,0.0,0.02564431,0.029202892,0.025928347999999997,0.027190383999999998,0.0,0.03129725,0.02573491,0.0,0.0,0.03038414,0.024945036,0.024382597000000002,0.0,0.034324855,0.0,0.026327958,0.028268582999999996,0.028173767000000002,0.027587226,0.0,0.028049905,0.028474912,0.0,0.0,0.024670912000000003,0.0,0.030323562999999998,0.021084002999999997,0.03214978,0.030741203999999998
0.021084002999999997,0.023079613,0.0,0.02564431,0.029202892,0.025928347999999997,0.027190383999999998,0.0,0.03129725,0.02573491,0.0,0.0,0.03038414,0.024945036,0.024382597000000002,0.0,0.034324855,0.0,0.026327958,0.028268582999999996,0.028173767000000002,0.027587226,0.0,0.028049905,0.028474912,0.0,0.0,0.024670912000000003,0.0,0.030323562999999998,0.0,0.03214978,0.030741203999999998,0.028856073
0.03214978,0.0,0.02564431,0.029202892,0.025928347999999997,0.027190383999999998,0.0,0.03129725,0.02573491,0.0,0.0,0.03038414,0.024945036,0.024382597000000002,0.0,0.034324855,0.0,0.026327958,0.028268582999999996,0.028173767000000002,0.027587226,0.0,0.028049905,0.028474912,0.0,0.0,0.024670912000000003,0.0,0.030323562999999998,0.0,0.021084002999999997,0.030741203999999998,0.028856073,0.03683098
0.030741203999999998,0.02564431,0.029202892,0.025928347999999997,0.027190383999999998,0.0,0.03129725,0.02573491,0.0,0.0,0.03038414,0.024945036,0.024382597000000002,0.0,0.034324855,0.0,0.026327958,0.028268582999999996,0.028173767000000002,0.027587226,0.0,0.028049905,0.028474912,0.0,0.0,0.024670912000000003,0.0,0.030323562999999998,0.0,0.021084002999999997,0.03214978,0.028856073,0.03683098,0.0
0.028856073,0.029202892,0.025928347999999997,0.027190383999999998,0.0,0.03129725,0.02573491,0.0,0.0,0.03038414,0.024945036,0.024382597000000002,0.0,0.034324855,0.0,0.026327958,0.028268582999999996,0.028173767000000002,0.027587226,0.0,0.028049905,0.028474912,0.0,0.0,0.024670912000000003,0.0,0.030323562999999998,0.0,0.021084002999999997,0.03214978,0.030741203999999998,0.03683098,0.0,0.03204436
0.03683098,0.025928347999999997,0.027190383999999998,0.0,0.03129725,0.02573491,0.0,0.0,0.03038414,0.024945036,0.024382597000000002,0.0,0.034324855,0.0,0.026327958,0.028268582999999996,0.028173767000000002,0.027587226,0.0,0.028049905,0.028474912,0.0,0.0,0.024670912000000003,0.0,0.030323562999999998,0.0,0.021084002999999997,0.03214978,0.030741203999999998,0.028856073,0.0,0.03204436,0.027807283999999998
0.0,0.027190383999999998,0.0,0.03129725,0.02573491,0.0,0.0,0.03038414,0.024945036,0.024382597000000002,0.0,0.034324855,0.0,0.026327958,0.028268582999999996,0.028173767000000002,0.027587226,0.0,0.028049905,0.028474912,0.0,0.0,0.024670912000000003,0.0,0.030323562999999998,0.0,0.021084002999999997,0.03214978,0.030741203999999998,0.028856073,0.03683098,0.03204436,0.027807283999999998,0.03040128
0.03204436,0.0,0.03129725,0.02573491,0.0,0.0,0.03038414,0.024945036,0.024382597000000002,0.0,0.034324855,0.0,0.026327958,0.028268582999999996,0.028173767000000002,0.027587226,0.0,0.028049905,0.028474912,0.0,0.0,0.024670912000000003,0.0,0.030323562999999998,0.0,0.021084002999999997,0.03214978,0.030741203999999998,0.028856073,0.03683098,0.0,0.027807283999999998,0.03040128,0.029110588
0.027807283999999998,0.03129725,0.02573491,0.0,0.0,0.03038414,0.024945036,0.024382597000000002,0.0,0.034324855,0.0,0.026327958,0.028268582999999996,0.028173767000000002,0.027587226,0.0,0.028049905,0.028474912,0.0,0.0,0.024670912000000003,0.0,0.030323562999999998,0.0,0.021084002999999997,0.03214978,0.030741203999999998,0.028856073,0.03683098,0.0,0.03204436,0.03040128,0.029110588,0.0
0.03040128,0.02573491,0.0,0.0,0.03038414,0.024945036,0.024382597000000002,0.0,0.034324855,0.0,0.026327958,0.028268582999999996,0.028173767000000002,0.027587226,0.0,0.028049905,0.028474912,0.0,0.0,0.024670912000000003,0.0,0.030323562999999998,0.0,0.021084002999999997,0.03214978,0.030741203999999998,0.028856073,0.03683098,0.0,0.03204436,0.027807283999999998,0.029110588,0.0,0.032410762999999995
0.029110588,0.0,0.0,0.03038414,0.024945036,0.024382597000000002,0.0,0.034324855,0.0,0.026327958,0.028268582999999996,0.028173767000000002,0.027587226,0.0,0.028049905,0.028474912,0.0,0.0,0.024670912000000003,0.0,0.030323562999999998,0.0,0.021084002999999997,0.03214978,0.030741203999999998,0.028856073,0.03683098,0.0,0.03204436,0.027807283999999998,0.03040128,0.0,0.032410762999999995,0.029653832
0.0,0.0,0.03038414,0.024945036,0.024382597000000002,0.0,0.034324855,0.0,0.026327958,0.028268582999999996,0.028173767000000002,0.027587226,0.0,0.028049905,0.028474912,0.0,0.0,0.024670912000000003,0.0,0.030323562999999998,0.0,0.021084002999999997,0.03214978,0.030741203999999998,0.028856073,0.03683098,0.0,0.03204436,0.027807283999999998,0.03040128,0.029110588,0.032410762999999995,0.029653832,0.034196664
0.032410762999999995,0.03038414,0.024945036,0.024382597000000002,0.0,0.034324855,0.0,0.026327958,0.028268582999999996,0.028173767000000002,0.027587226,0.0,0.028049905,0.028474912,0.0,0.0,0.024670912000000003,0.0,0.030323562999999998,0.0,0.021084002999999997,0.03214978,0.030741203999999998,0.028856073,0.03683098,0.0,0.03204436,0.027807283999999998,0.03040128,0.029110588,0.0,0.029653832,0.034196664,0.03372392
0.029653832,0.024945036,0.024382597000000002,0.0,0.034324855,0.0,0.026327958,0.028268582999999996,0.028173767000000002,0.027587226,0.0,0.028049905,0.028474912,0.0,0.0,0.024670912000000003,0.0,0.030323562999999998,0.0,0.021084002999999997,0.03214978,0.030741203999999998,0.028856073,0.03683098,0.0,0.03204436,0.027807283999999998,0.03040128,0.029110588,0.0,0.032410762999999995,0.034196664,0.03372392,0.0
0.034196664,0.024382597000000002,0.0,0.034324855,0.0,0.026327958,0.028268582999999996,0.028173767000000002,0.027587226,0.0,0.028049905,0.028474912,0.0,0.0,0.024670912000000003,0.0,0.030323562999999998,0.0,0.021084002999999997,0.03214978,0.030741203999999998,0.028856073,0.03683098,0.0,0.03204436,0.027807283999999998,0.03040128,0.029110588,0.0,0.032410762999999995,0.029653832,0.03372392,0.0,0.0
0.03372392,0.0,0.034324855,0.0,0.026327958,0.028268582999999996,0.028173767000000002,0.027587226,0.0,0.028049905,0.028474912,0.0,0.0,0.024670912000000003,0.0,0.030323562999999998,0.0,0.021084002999999997,0.03214978,0.030741203999999998,0.028856073,0.03683098,0.0,0.03204436,0.027807283999999998,0.03040128,0.029110588,0.0,0.032410762999999995,0.029653832,0.034196664,0.0,0.0,0.03605427
0.0,0.034324855,0.0,0.026327958,0.028268582999999996,0.028173767000000002,0.027587226,0.0,0.028049905,0.028474912,0.0,0.0,0.024670912000000003,0.0,0.030323562999999998,0.0,0.021084002999999997,0.03214978,0.030741203999999998,0.028856073,0.03683098,0.0,0.03204436,0.027807283999999998,0.03040128,0.029110588,0.0,0.032410762999999995,0.029653832,0.034196664,0.03372392,0.0,0.03605427,0.030988012000000002
0.0,0.0,0.026327958,0.028268582999999996,0.028173767000000002,0.027587226,0.0,0.028049905,0.028474912,0.0,0.0,0.024670912000000003,0.0,0.030323562999999998,0.0,0.021084002999999997,0.03214978,0.030741203999999998,0.028856073,0.03683098,0.0,0.03204436,0.027807283999999998,0.03040128,0.029110588,0.0,0.032410762999999995,0.029653832,0.034196664,0.03372392,0.0,0.03605427,0.030988012000000002,0.025678502000000002
0.03605427,0.026327958,0.028268582999999996,0.028173767000000002,0.027587226,0.0,0.028049905,0.028474912,0.0,0.0,0.024670912000000003,0.0,0.030323562999999998,0.0,0.021084002999999997,0.03214978,0.030741203999999998,0.028856073,0.03683098,0.0,0.03204436,0.027807283999999998,0.03040128,0.029110588,0.0,0.032410762999999995,0.029653832,0.034196664,0.03372392,0.0,0.0,0.030988012000000002,0.025678502000000002,0.0
0.030988012000000002,0.028268582999999996,0.028173767000000002,0.027587226,0.0,0.028049905,0.028474912,0.0,0.0,0.024670912000000003,0.0,0.030323562999999998,0.0,0.021084002999999997,0.03214978,0.030741203999999998,0.028856073,0.03683098,0.0,0.03204436,0.027807283999999998,0.03040128,0.029110588,0.0,0.032410762999999995,0.029653832,0.034196664,0.03372392,0.0,0.0,0.03605427,0.025678502000000002,0.0,0.0
0.025678502000000002,0.028173767000000002,0.027587226,0.0,0.028049905,0.028474912,0.0,0.0,0.024670912000000003,0.0,0.030323562999999998,0.0,0.021084002999999997,0.03214978,0.030741203999999998,0.028856073,0.03683098,0.0,0.03204436,0.027807283999999998,0.03040128,0.029110588,0.0,0.032410762999999995,0.029653832,0.034196664,0.03372392,0.0,0.0,0.03605427,0.030988012000000002,0.0,0.0,0.0
0.0,0.027587226,0.0,0.028049905,0.028474912,0.0,0.0,0.024670912000000003,0.0,0.030323562999999998,0.0,0.021084002999999997,0.03214978,0.030741203999999998,0.028856073,0.03683098,0.0,0.03204436,0.027807283999999998,0.03040128,0.029110588,0.0,0.032410762999999995,0.029653832,0.034196664,0.03372392,0.0,0.0,0.03605427,0.030988012000000002,0.025678502000000002,0.0,0.0,0.026663145
0.0,0.0,0.028049905,0.028474912,0.0,0.0,0.024670912000000003,0.0,0.030323562999999998,0.0,0.021084002999999997,0.03214978,0.030741203999999998,0.028856073,0.03683098,0.0,0.03204436,0.027807283999999998,0.03040128,0.029110588,0.0,0.032410762999999995,0.029653832,0.034196664,0.03372392,0.0,0.0,0.03605427,0.030988012000000002,0.025678502000000002,0.0,0.0,0.026663145,0.028613677
0.0,0.028049905,0.028474912,0.0,0.0,0.024670912000000003,0.0,0.030323562999999998,0.0,0.021084002999999997,0.03214978,0.030741203999999998,0.028856073,0.03683098,0.0,0.03204436,0.027807283999999998,0.03040128,0.029110588,0.0,0.032410762999999995,0.029653832,0.034196664,0.03372392,0.0,0.0,0.03605427,0.030988012000000002,0.025678502000000002,0.0,0.0,0.026663145,0.028613677,0.02727868
0.026663145,0.028474912,0.0,0.0,0.024670912000000003,0.0,0.030323562999999998,0.0,0.021084002999999997,0.03214978,0.030741203999999998,0.028856073,0.03683098,0.0,0.03204436,0.027807283999999998,0.03040128,0.029110588,0.0,0.032410762999999995,0.029653832,0.034196664,0.03372392,0.0,0.0,0.03605427,0.030988012000000002,0.025678502000000002,0.0,0.0,0.0,0.028613677,0.02727868,0.026925886
0.028613677,0.0,0.0,0.024670912000000003,0.0,0.030323562999999998,0.0,0.021084002999999997,0.03214978,0.030741203999999998,0.028856073,0.03683098,0.0,0.03204436,0.027807283999999998,0.03040128,0.029110588,0.0,0.032410762999999995,0.029653832,0.034196664,0.03372392,0.0,0.0,0.03605427,0.030988012000000002,0.025678502000000002,0.0,0.0,0.0,0.026663145,0.02727868,0.026925886,0.028638514
0.02727868,0.0,0.024670912000000003,0.0,0.030323562999999998,0.0,0.021084002999999997,0.03214978,0.030741203999999998,0.028856073,0.03683098,0.0,0.03204436,0.027807283999999998,0.03040128,0.029110588,0.0,0.032410762999999995,0.029653832,0.034196664,0.03372392,0.0,0.0,0.03605427,0.030988012000000002,0.025678502000000002,0.0,0.0,0.0,0.026663145,0.028613677,0.026925886,0.028638514,0.0
0.026925886,0.024670912000000003,0.0,0.030323562999999998,0.0,0.021084002999999997,0.03214978,0.030741203999999998,0.028856073,0.03683098,0.0,0.03204436,0.027807283999999998,0.03040128,0.029110588,0.0,0.032410762999999995,0.029653832,0.034196664,0.03372392,0.0,0.0,0.03605427,0.030988012000000002,0.025678502000000002,0.0,0.0,0.0,0.026663145,0.028613677,0.02727868,0.028638514,0.0,0.0
0.028638514,0.0,0.030323562999999998,0.0,0.021084002999999997,0.03214978,0.030741203999999998,0.028856073,0.03683098,0.0,0.03204436,0.027807283999999998,0.03040128,0.029110588,0.0,0.032410762999999995,0.029653832,0.034196664,0.03372392,0.0,0.0,0.03605427,0.030988012000000002,0.025678502000000002,0.0,0.0,0.0,0.026663145,0.028613677,0.02727868,0.026925886,0.0,0.0,0.0
0.0,0.030323562999999998,0.0,0.021084002999999997,0.03214978,0.030741203999999998,0.028856073,0.03683098,0.0,0.03204436,0.027807283999999998,0.03040128,0.029110588,0.0,0.032410762999999995,0.029653832,0.034196664,0.03372392,0.0,0.0,0.03605427,0.030988012000000002,0.025678502000000002,0.0,0.0,0.0,0.026663145,0.028613677,0.02727868,0.026925886,0.028638514,0.0,0.0,0.028311249
0.0,0.0,0.021084002999999997,0.03214978,0.030741203999999998,0.028856073,0.03683098,0.0,0.03204436,0.027807283999999998,0.03040128,0.029110588,0.0,0.032410762999999995,0.029653832,0.034196664,0.03372392,0.0,0.0,0.03605427,0.030988012000000002,0.025678502000000002,0.0,0.0,0.0,0.026663145,0.028613677,0.02727868,0.026925886,0.028638514,0.0,0.0,0.028311249,0.0
0.0,0.021084002999999997,0.03214978,0.030741203999999998,0.028856073,0.03683098,0.0,0.03204436,0.027807283999999998,0.03040128,0.029110588,0.0,0.032410762999999995,0.029653832,0.034196664,0.03372392,0.0,0.0,0.03605427,0.030988012000000002,0.025678502000000002,0.0,0.0,0.0,0.026663145,0.028613677,0.02727868,0.026925886,0.028638514,0.0,0.0,0.028311249,0.0,0.03330343
0.028311249,0.03214978,0.030741203999999998,0.028856073,0.03683098,0.0,0.03204436,0.027807283999999998,0.03040128,0.029110588,0.0,0.032410762999999995,0.029653832,0.034196664,0.03372392,0.0,0.0,0.03605427,0.030988012000000002,0.025678502000000002,0.0,0.0,0.0,0.026663145,0.028613677,0.02727868,0.026925886,0.028638514,0.0,0.0,0.0,0.0,0.03330343,0.03085293
0.0,0.030741203999999998,0.028856073,0.03683098,0.0,0.03204436,0.027807283999999998,0.03040128,0.029110588,0.0,0.032410762999999995,0.029653832,0.034196664,0.03372392,0.0,0.0,0.03605427,0.030988012000000002,0.025678502000000002,0.0,0.0,0.0,0.026663145,0.028613677,0.02727868,0.026925886,0.028638514,0.0,0.0,0.0,0.028311249,0.03330343,0.03085293,0.030389765
0.03330343,0.028856073,0.03683098,0.0,0.03204436,0.027807283999999998,0.03040128,0.029110588,0.0,0.032410762999999995,0.029653832,0.034196664,0.03372392,0.0,0.0,0.03605427,0.030988012000000002,0.025678502000000002,0.0,0.0,0.0,0.026663145,0.028613677,0.02727868,0.026925886,0.028638514,0.0,0.0,0.0,0.028311249,0.0,0.03085293,0.030389765,0.030155612000000002
0.03085293,0.03683098,0.0,0.03204436,0.027807283999999998,0.03040128,0.029110588,0.0,0.032410762999999995,0.029653832,0.034196664,0.03372392,0.0,0.0,0.03605427,0.030988012000000002,0.025678502000000002,0.0,0.0,0.0,0.026663145,0.028613677,0.02727868,0.026925886,0.028638514,0.0,0.0,0.0,0.028311249,0.0,0.03330343,0.030389765,0.030155612000000002,0.030081998999999998
0.030389765,0.0,0.03204436,0.027807283999999998,0.03040128,0.029110588,0.0,0.032410762999999995,0.029653832,0.034196664,0.03372392,0.0,0.0,0.03605427,0.030988012000000002,0.025678502000000002,0.0,0.0,0.0,0.026663145,0.028613677,0.02727868,0.026925886,0.028638514,0.0,0.0,0.0,0.028311249,0.0,0.03330343,0.03085293,0.030155612000000002,0.030081998999999998,0.0
0.030155612000000002,0.03204436,0.027807283999999998,0.03040128,0.029110588,0.0,0.032410762999999995,0.029653832,0.034196664,0.03372392,0.0,0.0,0.03605427,0.030988012000000002,0.025678502000000002,0.0,0.0,0.0,0.026663145,0.028613677,0.02727868,0.026925886,0.028638514,0.0,0.0,0.0,0.028311249,0.0,0.03330343,0.03085293,0.030389765,0.030081998999999998,0.0,0.030477196
0.030081998999999998,0.027807283999999998,0.03040128,0.029110588,0.0,0.032410762999999995,0.029653832,0.034196664,0.03372392,0.0,0.0,0.03605427,0.030988012000000002,0.025678502000000002,0.0,0.0,0.0,0.026663145,0.028613677,0.02727868,0.026925886,0.028638514,0.0,0.0,0.0,0.028311249,0.0,0.03330343,0.03085293,0.030389765,0.030155612000000002,0.0,0.030477196,0.031277344
0.0,0.03040128,0.029110588,0.0,0.032410762999999995,0.029653832,0.034196664,0.03372392,0.0,0.0,0.03605427,0.030988012000000002,0.025678502000000002,0.0,0.0,0.0,0.026663145,0.028613677,0.02727868,0.026925886,0.028638514,0.0,0.0,0.0,0.028311249,0.0,0.03330343,0.03085293,0.030389765,0.030155612000000002,0.030081998999999998,0.030477196,0.031277344,0.029494686000000006
0.030477196,0.029110588,0.0,0.032410762999999995,0.029653832,0.034196664,0.03372392,0.0,0.0,0.03605427,0.030988012000000002,0.025678502000000002,0.0,0.0,0.0,0.026663145,0.028613677,0.02727868,0.026925886,0.028638514,0.0,0.0,0.0,0.028311249,0.0,0.03330343,0.03085293,0.030389765,0.030155612000000002,0.030081998999999998,0.0,0.031277344,0.029494686000000006,0.027266997999999997
0.031277344,0.0,0.032410762999999995,0.029653832,0.034196664,0.03372392,0.0,0.0,0.03605427,0.030988012000000002,0.025678502000000002,0.0,0.0,0.0,0.026663145,0.028613677,0.02727868,0.026925886,0.028638514,0.0,0.0,0.0,0.028311249,0.0,0.03330343,0.03085293,0.030389765,0.030155612000000002,0.030081998999999998,0.0,0.030477196,0.029494686000000006,0.027266997999999997,0.035818199999999994
0.029494686000000006,0.032410762999999995,0.029653832,0.034196664,0.03372392,0.0,0.0,0.03605427,0.030988012000000002,0.025678502000000002,0.0,0.0,0.0,0.026663145,0.028613677,0.02727868,0.026925886,0.028638514,0.0,0.0,0.0,0.028311249,0.0,0.03330343,0.03085293,0.030389765,0.030155612000000002,0.030081998999999998,0.0,0.030477196,0.031277344,0.027266997999999997,0.035818199999999994,0.04942116
0.027266997999999997,0.029653832,0.034196664,0.03372392,0.0,0.0,0.03605427,0.030988012000000002,0.025678502000000002,0.0,0.0,0.0,0.026663145,0.028613677,0.02727868,0.026925886,0.028638514,0.0,0.0,0.0,0.028311249,0.0,0.03330343,0.03085293,0.030389765,0.030155612000000002,0.030081998999999998,0.0,0.030477196,0.031277344,0.029494686000000006,0.035818199999999994,0.04942116,0.032797456
0.035818199999999994,0.034196664,0.03372392,0.0,0.0,0.03605427,0.030988012000000002,0.025678502000000002,0.0,0.0,0.0,0.026663145,0.028613677,0.02727868,0.026925886,0.028638514,0.0,0.0,0.0,0.028311249,0.0,0.03330343,0.03085293,0.030389765,0.030155612000000002,0.030081998999999998,0.0,0.030477196,0.031277344,0.029494686000000006,0.027266997999999997,0.04942116,0.032797456,0.030685792000000007
0.04942116,0.03372392,0.0,0.0,0.03605427,0.030988012000000002,0.025678502000000002,0.0,0.0,0.0,0.026663145,0.028613677,0.02727868,0.026925886,0.028638514,0.0,0.0,0.0,0.028311249,0.0,0.03330343,0.03085293,0.030389765,0.030155612000000002,0.030081998999999998,0.0,0.030477196,0.031277344,0.029494686000000006,0.027266997999999997,0.035818199999999994,0.032797456,0.030685792000000007,0.039670736
0.032797456,0.0,0.0,0.03605427,0.030988012000000002,0.025678502000000002,0.0,0.0,0.0,0.026663145,0.028613677,0.02727868,0.026925886,0.028638514,0.0,0.0,0.0,0.028311249,0.0,0.03330343,0.03085293,0.030389765,0.030155612000000002,0.030081998999999998,0.0,0.030477196,0.031277344,0.029494686000000006,0.027266997999999997,0.035818199999999994,0.04942116,0.030685792000000007,0.039670736,0.0
0.030685792000000007,0.0,0.03605427,0.030988012000000002,0.025678502000000002,0.0,0.0,0.0,0.026663145,0.028613677,0.02727868,0.026925886,0.028638514,0.0,0.0,0.0,0.028311249,0.0,0.03330343,0.03085293,0.030389765,0.030155612000000002,0.030081998999999998,0.0,0.030477196,0.031277344,0.029494686000000006,0.027266997999999997,0.035818199999999994,0.04942116,0.032797456,0.039670736,0.0,0.0
0.039670736,0.03605427,0.030988012000000002,0.025678502000000002,0.0,0.0,0.0,0.026663145,0.028613677,0.02727868,0.026925886,0.028638514,0.0,0.0,0.0,0.028311249,0.0,0.03330343,0.03085293,0.030389765,0.030155612000000002,0.030081998999999998,0.0,0.030477196,0.031277344,0.029494686000000006,0.027266997999999997,0.035818199999999994,0.04942116,0.032797456,0.030685792000000007,0.0,0.0,0.03126101
0.0,0.030988012000000002,0.025678502000000002,0.0,0.0,0.0,0.026663145,0.028613677,0.02727868,0.026925886,0.028638514,0.0,0.0,0.0,0.028311249,0.0,0.03330343,0.03085293,0.030389765,0.030155612000000002,0.030081998999999998,0.0,0.030477196,0.031277344,0.029494686000000006,0.027266997999999997,0.035818199999999994,0.04942116,0.032797456,0.030685792000000007,0.039670736,0.0,0.03126101,0.0
0.0,0.025678502000000002,0.0,0.0,0.0,0.026663145,0.028613677,0.02727868,0.026925886,0.028638514,0.0,0.0,0.0,0.028311249,0.0,0.03330343,0.03085293,0.030389765,0.030155612000000002,0.030081998999999998,0.0,0.030477196,0.031277344,0.029494686000000006,0.027266997999999997,0.035818199999999994,0.04942116,0.032797456,0.030685792000000007,0.039670736,0.0,0.03126101,0.0,0.030140062999999998
0.03126101,0.0,0.0,0.0,0.026663145,0.028613677,0.02727868,0.026925886,0.028638514,0.0,0.0,0.0,0.028311249,0.0,0.03330343,0.03085293,0.030389765,0.030155612000000002,0.030081998999999998,0.0,0.030477196,0.031277344,0.029494686000000006,0.027266997999999997,0.035818199999999994,0.04942116,0.032797456,0.030685792000000007,0.039670736,0.0,0.0,0.0,0.030140062999999998,0.031907238
0.0,0.0,0.0,0.026663145,0.028613677,0.02727868,0.026925886,0.028638514,0.0,0.0,0.0,0.028311249,0.0,0.03330343,0.03085293,0.030389765,0.030155612000000002,0.030081998999999998,0.0,0.030477196,0.031277344,0.029494686000000006,0.027266997999999997,0.035818199999999994,0.04942116,0.032797456,0.030685792000000007,0.039670736,0.0,0.0,0.03126101,0.030140062999999998,0.031907238,0.0
0.030140062999999998,0.0,0.026663145,0.028613677,0.02727868,0.026925886,0.028638514,0.0,0.0,0.0,0.028311249,0.0,0.03330343,0.03085293,0.030389765,0.030155612000000002,0.030081998999999998,0.0,0.030477196,0.031277344,0.029494686000000006,0.027266997999999997,0.035818199999999994,0.04942116,0.032797456,0.030685792000000007,0.039670736,0.0,0.0,0.03126101,0.0,0.031907238,0.0,0.03054308
0.031907238,0.026663145,0.028613677,0.02727868,0.026925886,0.028638514,0.0,0.0,0.0,0.028311249,0.0,0.03330343,0.03085293,0.030389765,0.030155612000000002,0.030081998999999998,0.0,0.030477196,0.031277344,0.029494686000000006,0.027266997999999997,0.035818199999999994,0.04942116,0.032797456,0.030685792000000007,0.039670736,0.0,0.0,0.03126101,0.0,0.030140062999999998,0.0,0.03054308,0.046305872000000005
0.0,0.028613677,0.02727868,0.026925886,0.028638514,0.0,0.0,0.0,0.028311249,0.0,0.03330343,0.03085293,0.030389765,0.030155612000000002,0.030081998999999998,0.0,0.030477196,0.031277344,0.029494686000000006,0.027266997999999997,0.035818199999999994,0.04942116,0.032797456,0.030685792000000007,0.039670736,0.0,0.0,0.03126101,0.0,0.030140062999999998,0.031907238,0.03054308,0.046305872000000005,0.0
0.03054308,0.02727868,0.026925886,0.028638514,0.0,0.0,0.0,0.028311249,0.0,0.03330343,0.03085293,0.030389765,0.030155612000000002,0.030081998999999998,0.0,0.030477196,0.031277344,0.029494686000000006,0.027266997999999997,0.035818199999999994,0.04942116,0.032797456,0.030685792000000007,0.039670736,0.0,0.0,0.03126101,0.0,0.030140062999999998,0.031907238,0.0,0.046305872000000005,0.0,0.0
0.046305872000000005,0.026925886,0.028638514,0.0,0.0,0.0,0.028311249,0.0,0.03330343,0.03085293,0.030389765,0.030155612000000002,0.030081998999999998,0.0,0.030477196,0.031277344,0.029494686000000006,0.027266997999999997,0.035818199999999994,0.04942116,0.032797456,0.030685792000000007,0.039670736,0.0,0.0,0.03126101,0.0,0.030140062999999998,0.031907238,0.0,0.03054308,0.0,0.0,0.03646863
0.0,0.028638514,0.0,0.0,0.0,0.028311249,0.0,0.03330343,0.03085293,0.030389765,0.030155612000000002,0.030081998999999998,0.0,0.030477196,0.031277344,0.029494686000000006,0.027266997999999997,0.035818199999999994,0.04942116,0.032797456,0.030685792000000007,0.039670736,0.0,0.0,0.03126101,0.0,0.030140062999999998,0.031907238,0.0,0.03054308,0.046305872000000005,0.0,0.03646863,0.0
0.0,0.0,0.0,0.0,0.028311249,0.0,0.03330343,0.03085293,0.030389765,0.030155612000000002,0.030081998999999998,0.0,0.030477196,0.031277344,0.029494686000000006,0.027266997999999997,0.035818199999999994,0.04942116,0.032797456,0.030685792000000007,0.039670736,0.0,0.0,0.03126101,0.0,0.030140062999999998,0.031907238,0.0,0.03054308,0.046305872000000005,0.0,0.03646863,0.0,0.036828566
0.03646863,0.0,0.0,0.028311249,0.0,0.03330343,0.03085293,0.030389765,0.030155612000000002,0.030081998999999998,0.0,0.030477196,0.031277344,0.029494686000000006,0.027266997999999997,0.035818199999999994,0.04942116,0.032797456,0.030685792000000007,0.039670736,0.0,0.0,0.03126101,0.0,0.030140062999999998,0.031907238,0.0,0.03054308,0.046305872000000005,0.0,0.0,0.0,0.036828566,0.0
0.0,0.0,0.028311249,0.0,0.03330343,0.03085293,0.030389765,0.030155612000000002,0.030081998999999998,0.0,0.030477196,0.031277344,0.029494686000000006,0.027266997999999997,0.035818199999999994,0.04942116,0.032797456,0.030685792000000007,0.039670736,0.0,0.0,0.03126101,0.0,0.030140062999999998,0.031907238,0.0,0.03054308,0.046305872000000005,0.0,0.0,0.03646863,0.036828566,0.0,0.0
0.036828566,0.028311249,0.0,0.03330343,0.03085293,0.030389765,0.030155612000000002,0.030081998999999998,0.0,0.030477196,0.031277344,0.029494686000000006,0.027266997999999997,0.035818199999999994,0.04942116,0.032797456,0.030685792000000007,0.039670736,0.0,0.0,0.03126101,0.0,0.030140062999999998,0.031907238,0.0,0.03054308,0.046305872000000005,0.0,0.0,0.03646863,0.0,0.0,0.0,0.03847526
0.0,0.0,0.03330343,0.03085293,0.030389765,0.030155612000000002,0.030081998999999998,0.0,0.030477196,0.031277344,0.029494686000000006,0.027266997999999997,0.035818199999999994,0.04942116,0.032797456,0.030685792000000007,0.039670736,0.0,0.0,0.03126101,0.0,0.030140062999999998,0.031907238,0.0,0.03054308,0.046305872000000005,0.0,0.0,0.03646863,0.0,0.036828566,0.0,0.03847526,0.0
0.0,0.03330343,0.03085293,0.030389765,0.030155612000000002,0.030081998999999998,0.0,0.030477196,0.031277344,0.029494686000000006,0.027266997999999997,0.035818199999999994,0.04942116,0.032797456,0.030685792000000007,0.039670736,0.0,0.0,0.03126101,0.0,0.030140062999999998,0.031907238,0.0,0.03054308,0.046305872000000005,0.0,0.0,0.03646863,0.0,0.036828566,0.0,0.03847526,0.0,0.0
0.03847526,0.03085293,0.030389765,0.030155612000000002,0.030081998999999998,0.0,0.030477196,0.031277344,0.029494686000000006,0.027266997999999997,0.035818199999999994,0.04942116,0.032797456,0.030685792000000007,0.039670736,0.0,0.0,0.03126101,0.0,0.030140062999999998,0.031907238,0.0,0.03054308,0.046305872000000005,0.0,0.0,0.03646863,0.0,0.036828566,0.0,0.0,0.0,0.0,0.0
0.0,0.030389765,0.030155612000000002,0.030081998999999998,0.0,0.030477196,0.031277344,0.029494686000000006,0.027266997999999997,0.035818199999999994,0.04942116,0.032797456,0.030685792000000007,0.039670736,0.0,0.0,0.03126101,0.0,0.030140062999999998,0.031907238,0.0,0.03054308,0.046305872000000005,0.0,0.0,0.03646863,0.0,0.036828566,0.0,0.0,0.03847526,0.0,0.0,0.033145156
0.0,0.030155612000000002,0.030081998999999998,0.0,0.030477196,0.031277344,0.029494686000000006,0.027266997999999997,0.035818199999999994,0.04942116,0.032797456,0.030685792000000007,0.039670736,0.0,0.0,0.03126101,0.0,0.030140062999999998,0.031907238,0.0,0.03054308,0.046305872000000005,0.0,0.0,0.03646863,0.0,0.036828566,0.0,0.0,0.03847526,0.0,0.0,0.033145156,0.031952478
