52.508251,4.49875125,3040.1279999999997
52.508251,4.53346975,3040.1279999999997
52.508251,4.56818825,3040.1279999999997
52.508251,4.60290675,3181.3442999999997
52.508251,4.63762525,3181.3442999999997
52.508251,4.6723437500000005,3181.3442999999997
52.508251,4.70706225,2991.398
52.508251,4.74178075,2991.398
52.48645500000001,4.49875125,3040.1279999999997
52.48645500000001,4.53346975,3040.1279999999997
52.48645500000001,4.56818825,3040.1279999999997
52.48645500000001,4.60290675,3040.1279999999997
52.48645500000001,4.63762525,3398.3417000000004
52.48645500000001,4.6723437500000005,3398.3417000000004
52.48645500000001,4.70706225,3398.3417000000004
52.48645500000001,4.74178075,2914.2851
52.464659,4.49875125,0.0
52.464659,4.53346975,2699.9373
52.464659,4.56818825,2699.9373
52.464659,4.60290675,2699.9373
52.464659,4.63762525,3398.3417000000004
52.464659,4.6723437500000005,3398.3417000000004
52.464659,4.70706225,3398.3417000000004
52.464659,4.74178075,2914.2851
52.442863,4.49875125,3094.0767
52.442863,4.53346975,2699.9373
52.442863,4.56818825,2699.9373
52.442863,4.60290675,2699.9373
52.442863,4.63762525,3398.3417000000004
52.442863,4.6723437500000005,3398.3417000000004
52.442863,4.70706225,3109.6505
52.442863,4.74178075,2974.5440000000003
52.421067,4.49875125,3094.0767
52.421067,4.53346975,2699.9373
52.421067,4.56818825,2659.27
52.421067,4.60290675,2659.27
52.421067,4.63762525,3109.6505
52.421067,4.6723437500000005,3109.6505
52.421067,4.70706225,3109.6505
52.421067,4.74178075,3109.6505
52.399271,4.49875125,0.0
52.399271,4.53346975,2866.4002
52.399271,4.56818825,2659.27
52.399271,4.60290675,2659.27
52.399271,4.63762525,2659.27
52.399271,4.6723437500000005,3109.6505
52.399271,4.70706225,3109.6505
52.399271,4.74178075,0.0
