52.508251,4.49875125,0.0
52.508251,4.53346975,0.0
52.508251,4.56818825,2564.431
52.508251,4.60290675,2564.431
52.508251,4.63762525,0.0
52.508251,4.6723437500000005,0.0
52.508251,4.70706225,0.0
52.508251,4.74178075,0.0
52.48645500000001,4.49875125,2796.9249
52.48645500000001,4.53346975,2796.9249
52.48645500000001,4.56818825,2564.431
52.48645500000001,4.60290675,2564.431
52.48645500000001,4.63762525,2564.431
52.48645500000001,4.6723437500000005,0.0
52.48645500000001,4.70706225,2810.0494
52.48645500000001,4.74178075,2810.0494
52.464659,4.49875125,2796.9249
52.464659,4.53346975,2796.9249
52.464659,4.56818825,2564.431
52.464659,4.60290675,0.0
52.464659,4.63762525,0.0
52.464659,4.6723437500000005,2810.0494
52.464659,4.70706225,2810.0494
52.464659,4.74178075,2810.0494
52.442863,4.49875125,0.0
52.442863,4.53346975,0.0
52.442863,4.56818825,0.0
52.442863,4.60290675,0.0
52.442863,4.63762525,0.0
52.442863,4.6723437500000005,2810.0494
52.442863,4.70706225,2810.0494
52.442863,4.74178075,0.0
52.421067,4.49875125,0.0
52.421067,4.53346975,0.0
52.421067,4.56818825,0.0
52.421067,4.60290675,0.0
52.421067,4.63762525,0.0
52.421067,4.6723437500000005,0.0
52.421067,4.70706225,0.0
52.421067,4.74178075,0.0
52.399271,4.49875125,0.0
52.399271,4.53346975,0.0
52.399271,4.56818825,0.0
52.399271,4.60290675,0.0
52.399271,4.63762525,0.0
52.399271,4.6723437500000005,0.0
52.399271,4.70706225,0.0
52.399271,4.74178075,0.0
