value,value-30,value-29,value-28,value-27,value-26,value-25,value-24,value-23,value-22,value-21,value-20,value-19,value-18,value-17,value-16,value-15,value-14,value-13,value-12,value-11,value-10,value-9,value-8,value-7,value-6,value-5,value-4,value-3,value-2,value-1,Prediction+1,Prediction+2,Prediction+3
0.029468426000000002,0.0,0.030255107000000007,0.0,0.0,0.0,0.029726432999999997,0.0,0.032281343,0.031351954,0.0,0.0,0.032007422,0.0,0.0,0.0,0.0,0.0,0.032526605,0.03147652,0.025391756,0.0,0.028616041000000002,0.033073552,0.0,0.03222478,0.0,0.028204566,0.024269098,0.0,0.02564431,0.023974143,0.027190383999999998,0.0
0.023974143,0.030255107000000007,0.0,0.0,0.0,0.029726432999999997,0.0,0.032281343,0.031351954,0.0,0.0,0.032007422,0.0,0.0,0.0,0.0,0.0,0.032526605,0.03147652,0.025391756,0.0,0.028616041000000002,0.033073552,0.0,0.03222478,0.0,0.028204566,0.024269098,0.0,0.02564431,0.029468426000000002,0.027190383999999998,0.0,0.03129725
0.027190383999999998,0.0,0.0,0.0,0.029726432999999997,0.0,0.032281343,0.031351954,0.0,0.0,0.032007422,0.0,0.0,0.0,0.0,0.0,0.032526605,0.03147652,0.025391756,0.0,0.028616041000000002,0.033073552,0.0,0.03222478,0.0,0.028204566,0.024269098,0.0,0.02564431,0.029468426000000002,0.023974143,0.0,0.03129725,0.0
0.0,0.0,0.0,0.029726432999999997,0.0,0.032281343,0.031351954,0.0,0.0,0.032007422,0.0,0.0,0.0,0.0,0.0,0.032526605,0.03147652,0.025391756,0.0,0.028616041000000002,0.033073552,0.0,0.03222478,0.0,0.028204566,0.024269098,0.0,0.02564431,0.029468426000000002,0.023974143,0.027190383999999998,0.03129725,0.0,0.0
0.03129725,0.0,0.029726432999999997,0.0,0.032281343,0.031351954,0.0,0.0,0.032007422,0.0,0.0,0.0,0.0,0.0,0.032526605,0.03147652,0.025391756,0.0,0.028616041000000002,0.033073552,0.0,0.03222478,0.0,0.028204566,0.024269098,0.0,0.02564431,0.029468426000000002,0.023974143,0.027190383999999998,0.0,0.0,0.0,0.0
0.0,0.029726432999999997,0.0,0.032281343,0.031351954,0.0,0.0,0.032007422,0.0,0.0,0.0,0.0,0.0,0.032526605,0.03147652,0.025391756,0.0,0.028616041000000002,0.033073552,0.0,0.03222478,0.0,0.028204566,0.024269098,0.0,0.02564431,0.029468426000000002,0.023974143,0.027190383999999998,0.0,0.03129725,0.0,0.0,0.031150034
0.0,0.0,0.032281343,0.031351954,0.0,0.0,0.032007422,0.0,0.0,0.0,0.0,0.0,0.032526605,0.03147652,0.025391756,0.0,0.028616041000000002,0.033073552,0.0,0.03222478,0.0,0.028204566,0.024269098,0.0,0.02564431,0.029468426000000002,0.023974143,0.027190383999999998,0.0,0.03129725,0.0,0.0,0.031150034,0.028911673
0.0,0.032281343,0.031351954,0.0,0.0,0.032007422,0.0,0.0,0.0,0.0,0.0,0.032526605,0.03147652,0.025391756,0.0,0.028616041000000002,0.033073552,0.0,0.03222478,0.0,0.028204566,0.024269098,0.0,0.02564431,0.029468426000000002,0.023974143,0.027190383999999998,0.0,0.03129725,0.0,0.0,0.031150034,0.028911673,0.023850739
0.031150034,0.031351954,0.0,0.0,0.032007422,0.0,0.0,0.0,0.0,0.0,0.032526605,0.03147652,0.025391756,0.0,0.028616041000000002,0.033073552,0.0,0.03222478,0.0,0.028204566,0.024269098,0.0,0.02564431,0.029468426000000002,0.023974143,0.027190383999999998,0.0,0.03129725,0.0,0.0,0.0,0.028911673,0.023850739,0.0
0.028911673,0.0,0.0,0.032007422,0.0,0.0,0.0,0.0,0.0,0.032526605,0.03147652,0.025391756,0.0,0.028616041000000002,0.033073552,0.0,0.03222478,0.0,0.028204566,0.024269098,0.0,0.02564431,0.029468426000000002,0.023974143,0.027190383999999998,0.0,0.03129725,0.0,0.0,0.0,0.031150034,0.023850739,0.0,0.034324855
0.023850739,0.0,0.032007422,0.0,0.0,0.0,0.0,0.0,0.032526605,0.03147652,0.025391756,0.0,0.028616041000000002,0.033073552,0.0,0.03222478,0.0,0.028204566,0.024269098,0.0,0.02564431,0.029468426000000002,0.023974143,0.027190383999999998,0.0,0.03129725,0.0,0.0,0.0,0.031150034,0.028911673,0.0,0.034324855,0.0
0.0,0.032007422,0.0,0.0,0.0,0.0,0.0,0.032526605,0.03147652,0.025391756,0.0,0.028616041000000002,0.033073552,0.0,0.03222478,0.0,0.028204566,0.024269098,0.0,0.02564431,0.029468426000000002,0.023974143,0.027190383999999998,0.0,0.03129725,0.0,0.0,0.0,0.031150034,0.028911673,0.023850739,0.034324855,0.0,0.026327958
0.034324855,0.0,0.0,0.0,0.0,0.0,0.032526605,0.03147652,0.025391756,0.0,0.028616041000000002,0.033073552,0.0,0.03222478,0.0,0.028204566,0.024269098,0.0,0.02564431,0.029468426000000002,0.023974143,0.027190383999999998,0.0,0.03129725,0.0,0.0,0.0,0.031150034,0.028911673,0.023850739,0.0,0.0,0.026327958,0.033310506000000004
0.0,0.0,0.0,0.0,0.0,0.032526605,0.03147652,0.025391756,0.0,0.028616041000000002,0.033073552,0.0,0.03222478,0.0,0.028204566,0.024269098,0.0,0.02564431,0.029468426000000002,0.023974143,0.027190383999999998,0.0,0.03129725,0.0,0.0,0.0,0.031150034,0.028911673,0.023850739,0.0,0.034324855,0.026327958,0.033310506000000004,0.030435007000000007
0.026327958,0.0,0.0,0.0,0.032526605,0.03147652,0.025391756,0.0,0.028616041000000002,0.033073552,0.0,0.03222478,0.0,0.028204566,0.024269098,0.0,0.02564431,0.029468426000000002,0.023974143,0.027190383999999998,0.0,0.03129725,0.0,0.0,0.0,0.031150034,0.028911673,0.023850739,0.0,0.034324855,0.0,0.033310506000000004,0.030435007000000007,0.02604433
0.033310506000000004,0.0,0.0,0.032526605,0.03147652,0.025391756,0.0,0.028616041000000002,0.033073552,0.0,0.03222478,0.0,0.028204566,0.024269098,0.0,0.02564431,0.029468426000000002,0.023974143,0.027190383999999998,0.0,0.03129725,0.0,0.0,0.0,0.031150034,0.028911673,0.023850739,0.0,0.034324855,0.0,0.026327958,0.030435007000000007,0.02604433,0.0
0.030435007000000007,0.0,0.032526605,0.03147652,0.025391756,0.0,0.028616041000000002,0.033073552,0.0,0.03222478,0.0,0.028204566,0.024269098,0.0,0.02564431,0.029468426000000002,0.023974143,0.027190383999999998,0.0,0.03129725,0.0,0.0,0.0,0.031150034,0.028911673,0.023850739,0.0,0.034324855,0.0,0.026327958,0.033310506000000004,0.02604433,0.0,0.028049905
0.02604433,0.032526605,0.03147652,0.025391756,0.0,0.028616041000000002,0.033073552,0.0,0.03222478,0.0,0.028204566,0.024269098,0.0,0.02564431,0.029468426000000002,0.023974143,0.027190383999999998,0.0,0.03129725,0.0,0.0,0.0,0.031150034,0.028911673,0.023850739,0.0,0.034324855,0.0,0.026327958,0.033310506000000004,0.030435007000000007,0.0,0.028049905,0.028013559
0.0,0.03147652,0.025391756,0.0,0.028616041000000002,0.033073552,0.0,0.03222478,0.0,0.028204566,0.024269098,0.0,0.02564431,0.029468426000000002,0.023974143,0.027190383999999998,0.0,0.03129725,0.0,0.0,0.0,0.031150034,0.028911673,0.023850739,0.0,0.034324855,0.0,0.026327958,0.033310506000000004,0.030435007000000007,0.02604433,0.028049905,0.028013559,0.0
0.028049905,0.025391756,0.0,0.028616041000000002,0.033073552,0.0,0.03222478,0.0,0.028204566,0.024269098,0.0,0.02564431,0.029468426000000002,0.023974143,0.027190383999999998,0.0,0.03129725,0.0,0.0,0.0,0.031150034,0.028911673,0.023850739,0.0,0.034324855,0.0,0.026327958,0.033310506000000004,0.030435007000000007,0.02604433,0.0,0.028013559,0.0,0.0
0.028013559,0.0,0.028616041000000002,0.033073552,0.0,0.03222478,0.0,0.028204566,0.024269098,0.0,0.02564431,0.029468426000000002,0.023974143,0.027190383999999998,0.0,0.03129725,0.0,0.0,0.0,0.031150034,0.028911673,0.023850739,0.0,0.034324855,0.0,0.026327958,0.033310506000000004,0.030435007000000007,0.02604433,0.0,0.028049905,0.0,0.0,0.02613773
0.0,0.028616041000000002,0.033073552,0.0,0.03222478,0.0,0.028204566,0.024269098,0.0,0.02564431,0.029468426000000002,0.023974143,0.027190383999999998,0.0,0.03129725,0.0,0.0,0.0,0.031150034,0.028911673,0.023850739,0.0,0.034324855,0.0,0.026327958,0.033310506000000004,0.030435007000000007,0.02604433,0.0,0.028049905,0.028013559,0.0,0.02613773,0.0
0.0,0.033073552,0.0,0.03222478,0.0,0.028204566,0.024269098,0.0,0.02564431,0.029468426000000002,0.023974143,0.027190383999999998,0.0,0.03129725,0.0,0.0,0.0,0.031150034,0.028911673,0.023850739,0.0,0.034324855,0.0,0.026327958,0.033310506000000004,0.030435007000000007,0.02604433,0.0,0.028049905,0.028013559,0.0,0.02613773,0.0,0.030323562999999998
0.02613773,0.0,0.03222478,0.0,0.028204566,0.024269098,0.0,0.02564431,0.029468426000000002,0.023974143,0.027190383999999998,0.0,0.03129725,0.0,0.0,0.0,0.031150034,0.028911673,0.023850739,0.0,0.034324855,0.0,0.026327958,0.033310506000000004,0.030435007000000007,0.02604433,0.0,0.028049905,0.028013559,0.0,0.0,0.0,0.030323562999999998,0.0
0.0,0.03222478,0.0,0.028204566,0.024269098,0.0,0.02564431,0.029468426000000002,0.023974143,0.027190383999999998,0.0,0.03129725,0.0,0.0,0.0,0.031150034,0.028911673,0.023850739,0.0,0.034324855,0.0,0.026327958,0.033310506000000004,0.030435007000000007,0.02604433,0.0,0.028049905,0.028013559,0.0,0.0,0.02613773,0.030323562999999998,0.0,0.019181255
0.030323562999999998,0.0,0.028204566,0.024269098,0.0,0.02564431,0.029468426000000002,0.023974143,0.027190383999999998,0.0,0.03129725,0.0,0.0,0.0,0.031150034,0.028911673,0.023850739,0.0,0.034324855,0.0,0.026327958,0.033310506000000004,0.030435007000000007,0.02604433,0.0,0.028049905,0.028013559,0.0,0.0,0.02613773,0.0,0.0,0.019181255,0.034367412
0.0,0.028204566,0.024269098,0.0,0.02564431,0.029468426000000002,0.023974143,0.027190383999999998,0.0,0.03129725,0.0,0.0,0.0,0.031150034,0.028911673,0.023850739,0.0,0.034324855,0.0,0.026327958,0.033310506000000004,0.030435007000000007,0.02604433,0.0,0.028049905,0.028013559,0.0,0.0,0.02613773,0.0,0.030323562999999998,0.019181255,0.034367412,0.032984603
0.019181255,0.024269098,0.0,0.02564431,0.029468426000000002,0.023974143,0.027190383999999998,0.0,0.03129725,0.0,0.0,0.0,0.031150034,0.028911673,0.023850739,0.0,0.034324855,0.0,0.026327958,0.033310506000000004,0.030435007000000007,0.02604433,0.0,0.028049905,0.028013559,0.0,0.0,0.02613773,0.0,0.030323562999999998,0.0,0.034367412,0.032984603,0.0
0.034367412,0.0,0.02564431,0.029468426000000002,0.023974143,0.027190383999999998,0.0,0.03129725,0.0,0.0,0.0,0.031150034,0.028911673,0.023850739,0.0,0.034324855,0.0,0.026327958,0.033310506000000004,0.030435007000000007,0.02604433,0.0,0.028049905,0.028013559,0.0,0.0,0.02613773,0.0,0.030323562999999998,0.0,0.019181255,0.032984603,0.0,0.03683098
0.032984603,0.02564431,0.029468426000000002,0.023974143,0.027190383999999998,0.0,0.03129725,0.0,0.0,0.0,0.031150034,0.028911673,0.023850739,0.0,0.034324855,0.0,0.026327958,0.033310506000000004,0.030435007000000007,0.02604433,0.0,0.028049905,0.028013559,0.0,0.0,0.02613773,0.0,0.030323562999999998,0.0,0.019181255,0.034367412,0.0,0.03683098,0.0
0.0,0.029468426000000002,0.023974143,0.027190383999999998,0.0,0.03129725,0.0,0.0,0.0,0.031150034,0.028911673,0.023850739,0.0,0.034324855,0.0,0.026327958,0.033310506000000004,0.030435007000000007,0.02604433,0.0,0.028049905,0.028013559,0.0,0.0,0.02613773,0.0,0.030323562999999998,0.0,0.019181255,0.034367412,0.032984603,0.03683098,0.0,0.03204436
0.03683098,0.023974143,0.027190383999999998,0.0,0.03129725,0.0,0.0,0.0,0.031150034,0.028911673,0.023850739,0.0,0.034324855,0.0,0.026327958,0.033310506000000004,0.030435007000000007,0.02604433,0.0,0.028049905,0.028013559,0.0,0.0,0.02613773,0.0,0.030323562999999998,0.0,0.019181255,0.034367412,0.032984603,0.0,0.0,0.03204436,0.0
0.0,0.027190383999999998,0.0,0.03129725,0.0,0.0,0.0,0.031150034,0.028911673,0.023850739,0.0,0.034324855,0.0,0.026327958,0.033310506000000004,0.030435007000000007,0.02604433,0.0,0.028049905,0.028013559,0.0,0.0,0.02613773,0.0,0.030323562999999998,0.0,0.019181255,0.034367412,0.032984603,0.0,0.03683098,0.03204436,0.0,0.026999372999999997
0.03204436,0.0,0.03129725,0.0,0.0,0.0,0.031150034,0.028911673,0.023850739,0.0,0.034324855,0.0,0.026327958,0.033310506000000004,0.030435007000000007,0.02604433,0.0,0.028049905,0.028013559,0.0,0.0,0.02613773,0.0,0.030323562999999998,0.0,0.019181255,0.034367412,0.032984603,0.0,0.03683098,0.0,0.0,0.026999372999999997,0.026082814
0.0,0.03129725,0.0,0.0,0.0,0.031150034,0.028911673,0.023850739,0.0,0.034324855,0.0,0.026327958,0.033310506000000004,0.030435007000000007,0.02604433,0.0,0.028049905,0.028013559,0.0,0.0,0.02613773,0.0,0.030323562999999998,0.0,0.019181255,0.034367412,0.032984603,0.0,0.03683098,0.0,0.03204436,0.026999372999999997,0.026082814,0.0
0.026999372999999997,0.0,0.0,0.0,0.031150034,0.028911673,0.023850739,0.0,0.034324855,0.0,0.026327958,0.033310506000000004,0.030435007000000007,0.02604433,0.0,0.028049905,0.028013559,0.0,0.0,0.02613773,0.0,0.030323562999999998,0.0,0.019181255,0.034367412,0.032984603,0.0,0.03683098,0.0,0.03204436,0.0,0.026082814,0.0,0.033062395
0.026082814,0.0,0.0,0.031150034,0.028911673,0.023850739,0.0,0.034324855,0.0,0.026327958,0.033310506000000004,0.030435007000000007,0.02604433,0.0,0.028049905,0.028013559,0.0,0.0,0.02613773,0.0,0.030323562999999998,0.0,0.019181255,0.034367412,0.032984603,0.0,0.03683098,0.0,0.03204436,0.0,0.026999372999999997,0.0,0.033062395,0.029653832
0.0,0.0,0.031150034,0.028911673,0.023850739,0.0,0.034324855,0.0,0.026327958,0.033310506000000004,0.030435007000000007,0.02604433,0.0,0.028049905,0.028013559,0.0,0.0,0.02613773,0.0,0.030323562999999998,0.0,0.019181255,0.034367412,0.032984603,0.0,0.03683098,0.0,0.03204436,0.0,0.026999372999999997,0.026082814,0.033062395,0.029653832,0.028617281
0.033062395,0.031150034,0.028911673,0.023850739,0.0,0.034324855,0.0,0.026327958,0.033310506000000004,0.030435007000000007,0.02604433,0.0,0.028049905,0.028013559,0.0,0.0,0.02613773,0.0,0.030323562999999998,0.0,0.019181255,0.034367412,0.032984603,0.0,0.03683098,0.0,0.03204436,0.0,0.026999372999999997,0.026082814,0.0,0.029653832,0.028617281,0.02844978
0.029653832,0.028911673,0.023850739,0.0,0.034324855,0.0,0.026327958,0.033310506000000004,0.030435007000000007,0.02604433,0.0,0.028049905,0.028013559,0.0,0.0,0.02613773,0.0,0.030323562999999998,0.0,0.019181255,0.034367412,0.032984603,0.0,0.03683098,0.0,0.03204436,0.0,0.026999372999999997,0.026082814,0.0,0.033062395,0.028617281,0.02844978,0.0
0.028617281,0.023850739,0.0,0.034324855,0.0,0.026327958,0.033310506000000004,0.030435007000000007,0.02604433,0.0,0.028049905,0.028013559,0.0,0.0,0.02613773,0.0,0.030323562999999998,0.0,0.019181255,0.034367412,0.032984603,0.0,0.03683098,0.0,0.03204436,0.0,0.026999372999999997,0.026082814,0.0,0.033062395,0.029653832,0.02844978,0.0,0.0
0.02844978,0.0,0.034324855,0.0,0.026327958,0.033310506000000004,0.030435007000000007,0.02604433,0.0,0.028049905,0.028013559,0.0,0.0,0.02613773,0.0,0.030323562999999998,0.0,0.019181255,0.034367412,0.032984603,0.0,0.03683098,0.0,0.03204436,0.0,0.026999372999999997,0.026082814,0.0,0.033062395,0.029653832,0.028617281,0.0,0.0,0.0
0.0,0.034324855,0.0,0.026327958,0.033310506000000004,0.030435007000000007,0.02604433,0.0,0.028049905,0.028013559,0.0,0.0,0.02613773,0.0,0.030323562999999998,0.0,0.019181255,0.034367412,0.032984603,0.0,0.03683098,0.0,0.03204436,0.0,0.026999372999999997,0.026082814,0.0,0.033062395,0.029653832,0.028617281,0.02844978,0.0,0.0,0.030988012000000002
0.0,0.0,0.026327958,0.033310506000000004,0.030435007000000007,0.02604433,0.0,0.028049905,0.028013559,0.0,0.0,0.02613773,0.0,0.030323562999999998,0.0,0.019181255,0.034367412,0.032984603,0.0,0.03683098,0.0,0.03204436,0.0,0.026999372999999997,0.026082814,0.0,0.033062395,0.029653832,0.028617281,0.02844978,0.0,0.0,0.030988012000000002,0.025678502000000002
0.0,0.026327958,0.033310506000000004,0.030435007000000007,0.02604433,0.0,0.028049905,0.028013559,0.0,0.0,0.02613773,0.0,0.030323562999999998,0.0,0.019181255,0.034367412,0.032984603,0.0,0.03683098,0.0,0.03204436,0.0,0.026999372999999997,0.026082814,0.0,0.033062395,0.029653832,0.028617281,0.02844978,0.0,0.0,0.030988012000000002,0.025678502000000002,0.0
0.030988012000000002,0.033310506000000004,0.030435007000000007,0.02604433,0.0,0.028049905,0.028013559,0.0,0.0,0.02613773,0.0,0.030323562999999998,0.0,0.019181255,0.034367412,0.032984603,0.0,0.03683098,0.0,0.03204436,0.0,0.026999372999999997,0.026082814,0.0,0.033062395,0.029653832,0.028617281,0.02844978,0.0,0.0,0.0,0.025678502000000002,0.0,0.0
0.025678502000000002,0.030435007000000007,0.02604433,0.0,0.028049905,0.028013559,0.0,0.0,0.02613773,0.0,0.030323562999999998,0.0,0.019181255,0.034367412,0.032984603,0.0,0.03683098,0.0,0.03204436,0.0,0.026999372999999997,0.026082814,0.0,0.033062395,0.029653832,0.028617281,0.02844978,0.0,0.0,0.0,0.030988012000000002,0.0,0.0,0.0
0.0,0.02604433,0.0,0.028049905,0.028013559,0.0,0.0,0.02613773,0.0,0.030323562999999998,0.0,0.019181255,0.034367412,0.032984603,0.0,0.03683098,0.0,0.03204436,0.0,0.026999372999999997,0.026082814,0.0,0.033062395,0.029653832,0.028617281,0.02844978,0.0,0.0,0.0,0.030988012000000002,0.025678502000000002,0.0,0.0,0.026663145
0.0,0.0,0.028049905,0.028013559,0.0,0.0,0.02613773,0.0,0.030323562999999998,0.0,0.019181255,0.034367412,0.032984603,0.0,0.03683098,0.0,0.03204436,0.0,0.026999372999999997,0.026082814,0.0,0.033062395,0.029653832,0.028617281,0.02844978,0.0,0.0,0.0,0.030988012000000002,0.025678502000000002,0.0,0.0,0.026663145,0.028983342999999998
0.0,0.028049905,0.028013559,0.0,0.0,0.02613773,0.0,0.030323562999999998,0.0,0.019181255,0.034367412,0.032984603,0.0,0.03683098,0.0,0.03204436,0.0,0.026999372999999997,0.026082814,0.0,0.033062395,0.029653832,0.028617281,0.02844978,0.0,0.0,0.0,0.030988012000000002,0.025678502000000002,0.0,0.0,0.026663145,0.028983342999999998,0.030905787
0.026663145,0.028013559,0.0,0.0,0.02613773,0.0,0.030323562999999998,0.0,0.019181255,0.034367412,0.032984603,0.0,0.03683098,0.0,0.03204436,0.0,0.026999372999999997,0.026082814,0.0,0.033062395,0.029653832,0.028617281,0.02844978,0.0,0.0,0.0,0.030988012000000002,0.025678502000000002,0.0,0.0,0.0,0.028983342999999998,0.030905787,0.027326051
0.028983342999999998,0.0,0.0,0.02613773,0.0,0.030323562999999998,0.0,0.019181255,0.034367412,0.032984603,0.0,0.03683098,0.0,0.03204436,0.0,0.026999372999999997,0.026082814,0.0,0.033062395,0.029653832,0.028617281,0.02844978,0.0,0.0,0.0,0.030988012000000002,0.025678502000000002,0.0,0.0,0.0,0.026663145,0.030905787,0.027326051,0.030373154
0.030905787,0.0,0.02613773,0.0,0.030323562999999998,0.0,0.019181255,0.034367412,0.032984603,0.0,0.03683098,0.0,0.03204436,0.0,0.026999372999999997,0.026082814,0.0,0.033062395,0.029653832,0.028617281,0.02844978,0.0,0.0,0.0,0.030988012000000002,0.025678502000000002,0.0,0.0,0.0,0.026663145,0.028983342999999998,0.027326051,0.030373154,0.0
0.027326051,0.02613773,0.0,0.030323562999999998,0.0,0.019181255,0.034367412,0.032984603,0.0,0.03683098,0.0,0.03204436,0.0,0.026999372999999997,0.026082814,0.0,0.033062395,0.029653832,0.028617281,0.02844978,0.0,0.0,0.0,0.030988012000000002,0.025678502000000002,0.0,0.0,0.0,0.026663145,0.028983342999999998,0.030905787,0.030373154,0.0,0.0
0.030373154,0.0,0.030323562999999998,0.0,0.019181255,0.034367412,0.032984603,0.0,0.03683098,0.0,0.03204436,0.0,0.026999372999999997,0.026082814,0.0,0.033062395,0.029653832,0.028617281,0.02844978,0.0,0.0,0.0,0.030988012000000002,0.025678502000000002,0.0,0.0,0.0,0.026663145,0.028983342999999998,0.030905787,0.027326051,0.0,0.0,0.0
0.0,0.030323562999999998,0.0,0.019181255,0.034367412,0.032984603,0.0,0.03683098,0.0,0.03204436,0.0,0.026999372999999997,0.026082814,0.0,0.033062395,0.029653832,0.028617281,0.02844978,0.0,0.0,0.0,0.030988012000000002,0.025678502000000002,0.0,0.0,0.0,0.026663145,0.028983342999999998,0.030905787,0.027326051,0.030373154,0.0,0.0,0.028311249
0.0,0.0,0.019181255,0.034367412,0.032984603,0.0,0.03683098,0.0,0.03204436,0.0,0.026999372999999997,0.026082814,0.0,0.033062395,0.029653832,0.028617281,0.02844978,0.0,0.0,0.0,0.030988012000000002,0.025678502000000002,0.0,0.0,0.0,0.026663145,0.028983342999999998,0.030905787,0.027326051,0.030373154,0.0,0.0,0.028311249,0.0
0.0,0.019181255,0.034367412,0.032984603,0.0,0.03683098,0.0,0.03204436,0.0,0.026999372999999997,0.026082814,0.0,0.033062395,0.029653832,0.028617281,0.02844978,0.0,0.0,0.0,0.030988012000000002,0.025678502000000002,0.0,0.0,0.0,0.026663145,0.028983342999999998,0.030905787,0.027326051,0.030373154,0.0,0.0,0.028311249,0.0,0.03330343
0.028311249,0.034367412,0.032984603,0.0,0.03683098,0.0,0.03204436,0.0,0.026999372999999997,0.026082814,0.0,0.033062395,0.029653832,0.028617281,0.02844978,0.0,0.0,0.0,0.030988012000000002,0.025678502000000002,0.0,0.0,0.0,0.026663145,0.028983342999999998,0.030905787,0.027326051,0.030373154,0.0,0.0,0.0,0.0,0.03330343,0.027226318
0.0,0.032984603,0.0,0.03683098,0.0,0.03204436,0.0,0.026999372999999997,0.026082814,0.0,0.033062395,0.029653832,0.028617281,0.02844978,0.0,0.0,0.0,0.030988012000000002,0.025678502000000002,0.0,0.0,0.0,0.026663145,0.028983342999999998,0.030905787,0.027326051,0.030373154,0.0,0.0,0.0,0.028311249,0.03330343,0.027226318,0.0
0.03330343,0.0,0.03683098,0.0,0.03204436,0.0,0.026999372999999997,0.026082814,0.0,0.033062395,0.029653832,0.028617281,0.02844978,0.0,0.0,0.0,0.030988012000000002,0.025678502000000002,0.0,0.0,0.0,0.026663145,0.028983342999999998,0.030905787,0.027326051,0.030373154,0.0,0.0,0.0,0.028311249,0.0,0.027226318,0.0,0.030155612000000002
0.027226318,0.03683098,0.0,0.03204436,0.0,0.026999372999999997,0.026082814,0.0,0.033062395,0.029653832,0.028617281,0.02844978,0.0,0.0,0.0,0.030988012000000002,0.025678502000000002,0.0,0.0,0.0,0.026663145,0.028983342999999998,0.030905787,0.027326051,0.030373154,0.0,0.0,0.0,0.028311249,0.0,0.03330343,0.0,0.030155612000000002,0.028890343
0.0,0.0,0.03204436,0.0,0.026999372999999997,0.026082814,0.0,0.033062395,0.029653832,0.028617281,0.02844978,0.0,0.0,0.0,0.030988012000000002,0.025678502000000002,0.0,0.0,0.0,0.026663145,0.028983342999999998,0.030905787,0.027326051,0.030373154,0.0,0.0,0.0,0.028311249,0.0,0.03330343,0.027226318,0.030155612000000002,0.028890343,0.0
0.030155612000000002,0.03204436,0.0,0.026999372999999997,0.026082814,0.0,0.033062395,0.029653832,0.028617281,0.02844978,0.0,0.0,0.0,0.030988012000000002,0.025678502000000002,0.0,0.0,0.0,0.026663145,0.028983342999999998,0.030905787,0.027326051,0.030373154,0.0,0.0,0.0,0.028311249,0.0,0.03330343,0.027226318,0.0,0.028890343,0.0,0.033673834
0.028890343,0.0,0.026999372999999997,0.026082814,0.0,0.033062395,0.029653832,0.028617281,0.02844978,0.0,0.0,0.0,0.030988012000000002,0.025678502000000002,0.0,0.0,0.0,0.026663145,0.028983342999999998,0.030905787,0.027326051,0.030373154,0.0,0.0,0.0,0.028311249,0.0,0.03330343,0.027226318,0.0,0.030155612000000002,0.0,0.033673834,0.031277344
0.0,0.026999372999999997,0.026082814,0.0,0.033062395,0.029653832,0.028617281,0.02844978,0.0,0.0,0.0,0.030988012000000002,0.025678502000000002,0.0,0.0,0.0,0.026663145,0.028983342999999998,0.030905787,0.027326051,0.030373154,0.0,0.0,0.0,0.028311249,0.0,0.03330343,0.027226318,0.0,0.030155612000000002,0.028890343,0.033673834,0.031277344,0.033234645
0.033673834,0.026082814,0.0,0.033062395,0.029653832,0.028617281,0.02844978,0.0,0.0,0.0,0.030988012000000002,0.025678502000000002,0.0,0.0,0.0,0.026663145,0.028983342999999998,0.030905787,0.027326051,0.030373154,0.0,0.0,0.0,0.028311249,0.0,0.03330343,0.027226318,0.0,0.030155612000000002,0.028890343,0.0,0.031277344,0.033234645,0.02680844
0.031277344,0.0,0.033062395,0.029653832,0.028617281,0.02844978,0.0,0.0,0.0,0.030988012000000002,0.025678502000000002,0.0,0.0,0.0,0.026663145,0.028983342999999998,0.030905787,0.027326051,0.030373154,0.0,0.0,0.0,0.028311249,0.0,0.03330343,0.027226318,0.0,0.030155612000000002,0.028890343,0.0,0.033673834,0.033234645,0.02680844,0.0
0.033234645,0.033062395,0.029653832,0.028617281,0.02844978,0.0,0.0,0.0,0.030988012000000002,0.025678502000000002,0.0,0.0,0.0,0.026663145,0.028983342999999998,0.030905787,0.027326051,0.030373154,0.0,0.0,0.0,0.028311249,0.0,0.03330343,0.027226318,0.0,0.030155612000000002,0.028890343,0.0,0.033673834,0.031277344,0.02680844,0.0,0.046097837
0.02680844,0.029653832,0.028617281,0.02844978,0.0,0.0,0.0,0.030988012000000002,0.025678502000000002,0.0,0.0,0.0,0.026663145,0.028983342999999998,0.030905787,0.027326051,0.030373154,0.0,0.0,0.0,0.028311249,0.0,0.03330343,0.027226318,0.0,0.030155612000000002,0.028890343,0.0,0.033673834,0.031277344,0.033234645,0.0,0.046097837,0.032797456
0.0,0.028617281,0.02844978,0.0,0.0,0.0,0.030988012000000002,0.025678502000000002,0.0,0.0,0.0,0.026663145,0.028983342999999998,0.030905787,0.027326051,0.030373154,0.0,0.0,0.0,0.028311249,0.0,0.03330343,0.027226318,0.0,0.030155612000000002,0.028890343,0.0,0.033673834,0.031277344,0.033234645,0.02680844,0.046097837,0.032797456,0.030685792000000007
0.046097837,0.02844978,0.0,0.0,0.0,0.030988012000000002,0.025678502000000002,0.0,0.0,0.0,0.026663145,0.028983342999999998,0.030905787,0.027326051,0.030373154,0.0,0.0,0.0,0.028311249,0.0,0.03330343,0.027226318,0.0,0.030155612000000002,0.028890343,0.0,0.033673834,0.031277344,0.033234645,0.02680844,0.0,0.032797456,0.030685792000000007,0.039670736
0.032797456,0.0,0.0,0.0,0.030988012000000002,0.025678502000000002,0.0,0.0,0.0,0.026663145,0.028983342999999998,0.030905787,0.027326051,0.030373154,0.0,0.0,0.0,0.028311249,0.0,0.03330343,0.027226318,0.0,0.030155612000000002,0.028890343,0.0,0.033673834,0.031277344,0.033234645,0.02680844,0.0,0.046097837,0.030685792000000007,0.039670736,0.031300493
0.030685792000000007,0.0,0.0,0.030988012000000002,0.025678502000000002,0.0,0.0,0.0,0.026663145,0.028983342999999998,0.030905787,0.027326051,0.030373154,0.0,0.0,0.0,0.028311249,0.0,0.03330343,0.027226318,0.0,0.030155612000000002,0.028890343,0.0,0.033673834,0.031277344,0.033234645,0.02680844,0.0,0.046097837,0.032797456,0.039670736,0.031300493,0.0
0.039670736,0.0,0.030988012000000002,0.025678502000000002,0.0,0.0,0.0,0.026663145,0.028983342999999998,0.030905787,0.027326051,0.030373154,0.0,0.0,0.0,0.028311249,0.0,0.03330343,0.027226318,0.0,0.030155612000000002,0.028890343,0.0,0.033673834,0.031277344,0.033234645,0.02680844,0.0,0.046097837,0.032797456,0.030685792000000007,0.031300493,0.0,0.0
0.031300493,0.030988012000000002,0.025678502000000002,0.0,0.0,0.0,0.026663145,0.028983342999999998,0.030905787,0.027326051,0.030373154,0.0,0.0,0.0,0.028311249,0.0,0.03330343,0.027226318,0.0,0.030155612000000002,0.028890343,0.0,0.033673834,0.031277344,0.033234645,0.02680844,0.0,0.046097837,0.032797456,0.030685792000000007,0.039670736,0.0,0.0,0.0
0.0,0.025678502000000002,0.0,0.0,0.0,0.026663145,0.028983342999999998,0.030905787,0.027326051,0.030373154,0.0,0.0,0.0,0.028311249,0.0,0.03330343,0.027226318,0.0,0.030155612000000002,0.028890343,0.0,0.033673834,0.031277344,0.033234645,0.02680844,0.0,0.046097837,0.032797456,0.030685792000000007,0.039670736,0.031300493,0.0,0.0,0.03362348
0.0,0.0,0.0,0.0,0.026663145,0.028983342999999998,0.030905787,0.027326051,0.030373154,0.0,0.0,0.0,0.028311249,0.0,0.03330343,0.027226318,0.0,0.030155612000000002,0.028890343,0.0,0.033673834,0.031277344,0.033234645,0.02680844,0.0,0.046097837,0.032797456,0.030685792000000007,0.039670736,0.031300493,0.0,0.0,0.03362348,0.0
0.0,0.0,0.0,0.026663145,0.028983342999999998,0.030905787,0.027326051,0.030373154,0.0,0.0,0.0,0.028311249,0.0,0.03330343,0.027226318,0.0,0.030155612000000002,0.028890343,0.0,0.033673834,0.031277344,0.033234645,0.02680844,0.0,0.046097837,0.032797456,0.030685792000000007,0.039670736,0.031300493,0.0,0.0,0.03362348,0.0,0.0310205
0.03362348,0.0,0.026663145,0.028983342999999998,0.030905787,0.027326051,0.030373154,0.0,0.0,0.0,0.028311249,0.0,0.03330343,0.027226318,0.0,0.030155612000000002,0.028890343,0.0,0.033673834,0.031277344,0.033234645,0.02680844,0.0,0.046097837,0.032797456,0.030685792000000007,0.039670736,0.031300493,0.0,0.0,0.0,0.0,0.0310205,0.03053266
0.0,0.026663145,0.028983342999999998,0.030905787,0.027326051,0.030373154,0.0,0.0,0.0,0.028311249,0.0,0.03330343,0.027226318,0.0,0.030155612000000002,0.028890343,0.0,0.033673834,0.031277344,0.033234645,0.02680844,0.0,0.046097837,0.032797456,0.030685792000000007,0.039670736,0.031300493,0.0,0.0,0.0,0.03362348,0.0310205,0.03053266,0.048903435
0.0310205,0.028983342999999998,0.030905787,0.027326051,0.030373154,0.0,0.0,0.0,0.028311249,0.0,0.03330343,0.027226318,0.0,0.030155612000000002,0.028890343,0.0,0.033673834,0.031277344,0.033234645,0.02680844,0.0,0.046097837,0.032797456,0.030685792000000007,0.039670736,0.031300493,0.0,0.0,0.0,0.03362348,0.0,0.03053266,0.048903435,0.0
0.03053266,0.030905787,0.027326051,0.030373154,0.0,0.0,0.0,0.028311249,0.0,0.03330343,0.027226318,0.0,0.030155612000000002,0.028890343,0.0,0.033673834,0.031277344,0.033234645,0.02680844,0.0,0.046097837,0.032797456,0.030685792000000007,0.039670736,0.031300493,0.0,0.0,0.0,0.03362348,0.0,0.0310205,0.048903435,0.0,0.0
0.048903435,0.027326051,0.030373154,0.0,0.0,0.0,0.028311249,0.0,0.03330343,0.027226318,0.0,0.030155612000000002,0.028890343,0.0,0.033673834,0.031277344,0.033234645,0.02680844,0.0,0.046097837,0.032797456,0.030685792000000007,0.039670736,0.031300493,0.0,0.0,0.0,0.03362348,0.0,0.0310205,0.03053266,0.0,0.0,0.03646863
0.0,0.030373154,0.0,0.0,0.0,0.028311249,0.0,0.03330343,0.027226318,0.0,0.030155612000000002,0.028890343,0.0,0.033673834,0.031277344,0.033234645,0.02680844,0.0,0.046097837,0.032797456,0.030685792000000007,0.039670736,0.031300493,0.0,0.0,0.0,0.03362348,0.0,0.0310205,0.03053266,0.048903435,0.0,0.03646863,0.0
0.0,0.0,0.0,0.0,0.028311249,0.0,0.03330343,0.027226318,0.0,0.030155612000000002,0.028890343,0.0,0.033673834,0.031277344,0.033234645,0.02680844,0.0,0.046097837,0.032797456,0.030685792000000007,0.039670736,0.031300493,0.0,0.0,0.0,0.03362348,0.0,0.0310205,0.03053266,0.048903435,0.0,0.03646863,0.0,0.037801865
0.03646863,0.0,0.0,0.028311249,0.0,0.03330343,0.027226318,0.0,0.030155612000000002,0.028890343,0.0,0.033673834,0.031277344,0.033234645,0.02680844,0.0,0.046097837,0.032797456,0.030685792000000007,0.039670736,0.031300493,0.0,0.0,0.0,0.03362348,0.0,0.0310205,0.03053266,0.048903435,0.0,0.0,0.0,0.037801865,0.0
0.0,0.0,0.028311249,0.0,0.03330343,0.027226318,0.0,0.030155612000000002,0.028890343,0.0,0.033673834,0.031277344,0.033234645,0.02680844,0.0,0.046097837,0.032797456,0.030685792000000007,0.039670736,0.031300493,0.0,0.0,0.0,0.03362348,0.0,0.0310205,0.03053266,0.048903435,0.0,0.0,0.03646863,0.037801865,0.0,0.0
0.037801865,0.028311249,0.0,0.03330343,0.027226318,0.0,0.030155612000000002,0.028890343,0.0,0.033673834,0.031277344,0.033234645,0.02680844,0.0,0.046097837,0.032797456,0.030685792000000007,0.039670736,0.031300493,0.0,0.0,0.0,0.03362348,0.0,0.0310205,0.03053266,0.048903435,0.0,0.0,0.03646863,0.0,0.0,0.0,0.03847526
0.0,0.0,0.03330343,0.027226318,0.0,0.030155612000000002,0.028890343,0.0,0.033673834,0.031277344,0.033234645,0.02680844,0.0,0.046097837,0.032797456,0.030685792000000007,0.039670736,0.031300493,0.0,0.0,0.0,0.03362348,0.0,0.0310205,0.03053266,0.048903435,0.0,0.0,0.03646863,0.0,0.037801865,0.0,0.03847526,0.0
0.0,0.03330343,0.027226318,0.0,0.030155612000000002,0.028890343,0.0,0.033673834,0.031277344,0.033234645,0.02680844,0.0,0.046097837,0.032797456,0.030685792000000007,0.039670736,0.031300493,0.0,0.0,0.0,0.03362348,0.0,0.0310205,0.03053266,0.048903435,0.0,0.0,0.03646863,0.0,0.037801865,0.0,0.03847526,0.0,0.0
0.03847526,0.027226318,0.0,0.030155612000000002,0.028890343,0.0,0.033673834,0.031277344,0.033234645,0.02680844,0.0,0.046097837,0.032797456,0.030685792000000007,0.039670736,0.031300493,0.0,0.0,0.0,0.03362348,0.0,0.0310205,0.03053266,0.048903435,0.0,0.0,0.03646863,0.0,0.037801865,0.0,0.0,0.0,0.0,0.0
0.0,0.0,0.030155612000000002,0.028890343,0.0,0.033673834,0.031277344,0.033234645,0.02680844,0.0,0.046097837,0.032797456,0.030685792000000007,0.039670736,0.031300493,0.0,0.0,0.0,0.03362348,0.0,0.0310205,0.03053266,0.048903435,0.0,0.0,0.03646863,0.0,0.037801865,0.0,0.0,0.03847526,0.0,0.0,0.03520709
0.0,0.030155612000000002,0.028890343,0.0,0.033673834,0.031277344,0.033234645,0.02680844,0.0,0.046097837,0.032797456,0.030685792000000007,0.039670736,0.031300493,0.0,0.0,0.0,0.03362348,0.0,0.0310205,0.03053266,0.048903435,0.0,0.0,0.03646863,0.0,0.037801865,0.0,0.0,0.03847526,0.0,0.0,0.03520709,0.033102627999999995
