52.508251,4.49875125,3114.6334
52.508251,4.53346975,3114.6334
52.508251,4.56818825,3114.6334
52.508251,4.60290675,3114.6334
52.508251,4.63762525,3114.6334
52.508251,4.6723437500000005,3114.6334
52.508251,4.70706225,3114.6334
52.508251,4.74178075,3114.6334
52.48645500000001,4.49875125,2861.6855
52.48645500000001,4.53346975,3114.6334
52.48645500000001,4.56818825,3114.6334
52.48645500000001,4.60290675,3114.6334
52.48645500000001,4.63762525,3114.6334
52.48645500000001,4.6723437500000005,3114.6334
52.48645500000001,4.70706225,3114.6334
52.48645500000001,4.74178075,3114.6334
52.464659,4.49875125,2861.6855
52.464659,4.53346975,2820.4566
52.464659,4.56818825,2820.4566
52.464659,4.60290675,2820.4566
52.464659,4.63762525,2820.4566
52.464659,4.6723437500000005,2820.4566
52.464659,4.70706225,2820.4566
52.464659,4.74178075,2820.4566
52.442863,4.49875125,2861.6855
52.442863,4.53346975,2820.4566
52.442863,4.56818825,2820.4566
52.442863,4.60290675,2820.4566
52.442863,4.63762525,2820.4566
52.442863,4.6723437500000005,2820.4566
52.442863,4.70706225,2820.4566
52.442863,4.74178075,2820.4566
52.421067,4.49875125,2620.8688
52.421067,4.53346975,3087.3857000000003
52.421067,4.56818825,3087.3857000000003
52.421067,4.60290675,3087.3857000000003
52.421067,4.63762525,3087.3857000000003
52.421067,4.6723437500000005,3087.3857000000003
52.421067,4.70706225,3087.3857000000003
52.421067,4.74178075,3087.3857000000003
52.399271,4.49875125,0.0
52.399271,4.53346975,3087.3857000000003
52.399271,4.56818825,3087.3857000000003
52.399271,4.60290675,3087.3857000000003
52.399271,4.63762525,3087.3857000000003
52.399271,4.6723437500000005,3087.3857000000003
52.399271,4.70706225,3087.3857000000003
52.399271,4.74178075,0.0
