52.508251,4.49875125,2887.6577
52.508251,4.53346975,2887.6577
52.508251,4.56818825,3090.5787
52.508251,4.60290675,2727.868
52.508251,4.63762525,2727.868
52.508251,4.6723437500000005,2727.868
52.508251,4.70706225,3003.3363
52.508251,4.74178075,3003.3363
52.48645500000001,4.49875125,3090.5787
52.48645500000001,4.53346975,3090.5787
52.48645500000001,4.56818825,3090.5787
52.48645500000001,4.60290675,2727.868
52.48645500000001,4.63762525,2727.868
52.48645500000001,4.6723437500000005,2727.868
52.48645500000001,4.70706225,2884.1572000000006
52.48645500000001,4.74178075,2851.417
52.464659,4.49875125,3090.5787
52.464659,4.53346975,3090.5787
52.464659,4.56818825,3090.5787
52.464659,4.60290675,2727.868
52.464659,4.63762525,2884.1572000000006
52.464659,4.6723437500000005,2884.1572000000006
52.464659,4.70706225,2884.1572000000006
52.464659,4.74178075,2851.417
52.442863,4.49875125,3090.5787
52.442863,4.53346975,2883.6174
52.442863,4.56818825,2883.6174
52.442863,4.60290675,2883.6174
52.442863,4.63762525,2884.1572000000006
52.442863,4.6723437500000005,2884.1572000000006
52.442863,4.70706225,2884.1572000000006
52.442863,4.74178075,2724.0658000000003
52.421067,4.49875125,2883.6174
52.421067,4.53346975,2883.6174
52.421067,4.56818825,2883.6174
52.421067,4.60290675,2883.6174
52.421067,4.63762525,2884.1572000000006
52.421067,4.6723437500000005,2873.4816
52.421067,4.70706225,2873.4816
52.421067,4.74178075,2873.4816
52.399271,4.49875125,0.0
52.399271,4.53346975,2883.6174
52.399271,4.56818825,2883.6174
52.399271,4.60290675,3133.6773
52.399271,4.63762525,2873.4816
52.399271,4.6723437500000005,2873.4816
52.399271,4.70706225,2873.4816
52.399271,4.74178075,0.0
