52.508251,4.49875125,0.0
52.508251,4.53346975,0.0
52.508251,4.56818825,3334.5196
52.508251,4.60290675,3334.5196
52.508251,4.63762525,3038.9764999999998
52.508251,4.6723437500000005,3038.9764999999998
52.508251,4.70706225,3125.3154999999997
52.508251,4.74178075,3125.3154999999997
52.48645500000001,4.49875125,0.0
52.48645500000001,4.53346975,0.0
52.48645500000001,4.56818825,0.0
52.48645500000001,4.60290675,3038.9764999999998
52.48645500000001,4.63762525,3038.9764999999998
52.48645500000001,4.6723437500000005,3038.9764999999998
52.48645500000001,4.70706225,3125.3154999999997
52.48645500000001,4.74178075,3125.3154999999997
52.464659,4.49875125,0.0
52.464659,4.53346975,0.0
52.464659,4.56818825,0.0
52.464659,4.60290675,3038.9764999999998
52.464659,4.63762525,3038.9764999999998
52.464659,4.6723437500000005,2953.5282000000007
52.464659,4.70706225,3097.4641
52.464659,4.74178075,3097.4641
52.442863,4.49875125,0.0
52.442863,4.53346975,0.0
52.442863,4.56818825,0.0
52.442863,4.60290675,2953.5282000000007
52.442863,4.63762525,2953.5282000000007
52.442863,4.6723437500000005,2953.5282000000007
52.442863,4.70706225,2953.5282000000007
52.442863,4.74178075,3097.4641
52.421067,4.49875125,3573.9060000000004
52.421067,4.53346975,3573.9060000000004
52.421067,4.56818825,3573.9060000000004
52.421067,4.60290675,3573.9060000000004
52.421067,4.63762525,2953.5282000000007
52.421067,4.6723437500000005,2953.5282000000007
52.421067,4.70706225,2953.5282000000007
52.421067,4.74178075,3104.2708
52.399271,4.49875125,0.0
52.399271,4.53346975,3573.9060000000004
52.399271,4.56818825,3573.9060000000004
52.399271,4.60290675,3573.9060000000004
52.399271,4.63762525,3313.066
52.399271,4.6723437500000005,3313.066
52.399271,4.70706225,3313.066
52.399271,4.74178075,0.0
