52.508251,4.49875125,4920.044
52.508251,4.53346975,4920.044
52.508251,4.56818825,4920.044
52.508251,4.60290675,4860.9737000000005
52.508251,4.63762525,4630.587200000001
52.508251,4.6723437500000005,4630.587200000001
52.508251,4.70706225,0.0
52.508251,4.74178075,0.0
52.48645500000001,4.49875125,4920.044
52.48645500000001,4.53346975,4890.3435
52.48645500000001,4.56818825,4890.3435
52.48645500000001,4.60290675,4630.587200000001
52.48645500000001,4.63762525,4630.587200000001
52.48645500000001,4.6723437500000005,4630.587200000001
52.48645500000001,4.70706225,4630.587200000001
52.48645500000001,4.74178075,4344.4544000000005
52.464659,4.49875125,4890.3435
52.464659,4.53346975,4890.3435
52.464659,4.56818825,4890.3435
52.464659,4.60290675,4630.587200000001
52.464659,4.63762525,4630.587200000001
52.464659,4.6723437500000005,4724.361400000001
52.464659,4.70706225,4724.361400000001
52.464659,4.74178075,4344.4544000000005
52.442863,4.49875125,4890.3435
52.442863,4.53346975,4890.3435
52.442863,4.56818825,5070.454
52.442863,4.60290675,5070.454
52.442863,4.63762525,4724.361400000001
52.442863,4.6723437500000005,4724.361400000001
52.442863,4.70706225,4724.361400000001
52.442863,4.74178075,4724.361400000001
52.421067,4.49875125,5070.454
52.421067,4.53346975,5070.454
52.421067,4.56818825,5070.454
52.421067,4.60290675,5070.454
52.421067,4.63762525,4724.361400000001
52.421067,4.6723437500000005,4724.361400000001
52.421067,4.70706225,4699.6973
52.421067,4.74178075,4699.6973
52.399271,4.49875125,0.0
52.399271,4.53346975,5070.454
52.399271,4.56818825,5070.454
52.399271,4.60290675,5070.454
52.399271,4.63762525,5037.785
52.399271,4.6723437500000005,4699.6973
52.399271,4.70706225,4699.6973
52.399271,4.74178075,0.0
