52.508251,4.49875125,0.0
52.508251,4.53346975,0.0
52.508251,4.56818825,2666.3145
52.508251,4.60290675,2666.3145
52.508251,4.63762525,3022.2587
52.508251,4.6723437500000005,3022.2587
52.508251,4.70706225,3022.2587
52.508251,4.74178075,3022.2587
52.48645500000001,4.49875125,2666.3145
52.48645500000001,4.53346975,2666.3145
52.48645500000001,4.56818825,2666.3145
52.48645500000001,4.60290675,2666.3145
52.48645500000001,4.63762525,3022.2587
52.48645500000001,4.6723437500000005,3022.2587
52.48645500000001,4.70706225,3022.2587
52.48645500000001,4.74178075,3022.2587
52.464659,4.49875125,0.0
52.464659,4.53346975,2666.3145
52.464659,4.56818825,2666.3145
52.464659,4.60290675,2666.3145
52.464659,4.63762525,2961.8837
52.464659,4.6723437500000005,2961.8837
52.464659,4.70706225,2961.8837
52.464659,4.74178075,2961.8837
52.442863,4.49875125,0.0
52.442863,4.53346975,3088.4119
52.442863,4.56818825,3088.4119
52.442863,4.60290675,3088.4119
52.442863,4.63762525,3088.4119
52.442863,4.6723437500000005,2961.8837
52.442863,4.70706225,2961.8837
52.442863,4.74178075,2961.8837
52.421067,4.49875125,0.0
52.421067,4.53346975,3088.4119
52.421067,4.56818825,3088.4119
52.421067,4.60290675,3088.4119
52.421067,4.63762525,3088.4119
52.421067,4.6723437500000005,2961.8837
52.421067,4.70706225,2858.0887000000007
52.421067,4.74178075,2858.0887000000007
52.399271,4.49875125,0.0
52.399271,4.53346975,2838.4108
52.399271,4.56818825,2838.4108
52.399271,4.60290675,2838.4108
52.399271,4.63762525,2838.4108
52.399271,4.6723437500000005,2858.0887000000007
52.399271,4.70706225,2858.0887000000007
52.399271,4.74178075,0.0
