52.508251,4.49875125,0.0
52.508251,4.53346975,0.0
52.508251,4.56818825,0.0
52.508251,4.60290675,3002.6315
52.508251,4.63762525,3002.6315
52.508251,4.6723437500000005,3002.6315
52.508251,4.70706225,3002.6315
52.508251,4.74178075,3002.6315
52.48645500000001,4.49875125,3436.7412
52.48645500000001,4.53346975,3436.7412
52.48645500000001,4.56818825,3436.7412
52.48645500000001,4.60290675,3214.978
52.48645500000001,4.63762525,3214.978
52.48645500000001,4.6723437500000005,3214.978
52.48645500000001,4.70706225,3214.978
52.48645500000001,4.74178075,3214.978
52.464659,4.49875125,3436.7412
52.464659,4.53346975,3436.7412
52.464659,4.56818825,3436.7412
52.464659,4.60290675,3214.978
52.464659,4.63762525,3214.978
52.464659,4.6723437500000005,3214.978
52.464659,4.70706225,3214.978
52.464659,4.74178075,3214.978
52.442863,4.49875125,3530.6957
52.442863,4.53346975,3530.6957
52.442863,4.56818825,3530.6957
52.442863,4.60290675,3204.6452000000004
52.442863,4.63762525,3204.6452000000004
52.442863,4.6723437500000005,3204.6452000000004
52.442863,4.70706225,3204.6452000000004
52.442863,4.74178075,3204.6452000000004
52.421067,4.49875125,3530.6957
52.421067,4.53346975,3530.6957
52.421067,4.56818825,3530.6957
52.421067,4.60290675,3204.6452000000004
52.421067,4.63762525,3204.6452000000004
52.421067,4.6723437500000005,3204.6452000000004
52.421067,4.70706225,3204.6452000000004
52.421067,4.74178075,3204.6452000000004
52.399271,4.49875125,0.0
52.399271,4.53346975,0.0
52.399271,4.56818825,0.0
52.399271,4.60290675,0.0
52.399271,4.63762525,3226.3115000000003
52.399271,4.6723437500000005,3226.3115000000003
52.399271,4.70706225,3226.3115000000003
52.399271,4.74178075,0.0
