52.508251,4.49875125,2758.7226
52.508251,4.53346975,2758.7226
52.508251,4.56818825,2758.7226
52.508251,4.60290675,2758.7226
52.508251,4.63762525,0.0
52.508251,4.6723437500000005,0.0
52.508251,4.70706225,0.0
52.508251,4.74178075,0.0
52.48645500000001,4.49875125,2758.7226
52.48645500000001,4.53346975,2758.7226
52.48645500000001,4.56818825,2758.7226
52.48645500000001,4.60290675,2758.7226
52.48645500000001,4.63762525,2758.7226
52.48645500000001,4.6723437500000005,0.0
52.48645500000001,4.70706225,0.0
52.48645500000001,4.74178075,0.0
52.464659,4.49875125,2604.433
52.464659,4.53346975,2604.433
52.464659,4.56818825,2604.433
52.464659,4.60290675,2604.433
52.464659,4.63762525,2604.433
52.464659,4.6723437500000005,0.0
52.464659,4.70706225,0.0
52.464659,4.74178075,0.0
52.442863,4.49875125,2604.433
52.442863,4.53346975,2604.433
52.442863,4.56818825,2604.433
52.442863,4.60290675,2604.433
52.442863,4.63762525,2604.433
52.442863,4.6723437500000005,0.0
52.442863,4.70706225,0.0
52.442863,4.74178075,0.0
52.421067,4.49875125,2721.6855
52.421067,4.53346975,2721.6855
52.421067,4.56818825,2721.6855
52.421067,4.60290675,2721.6855
52.421067,4.63762525,2721.6855
52.421067,4.6723437500000005,0.0
52.421067,4.70706225,0.0
52.421067,4.74178075,0.0
52.399271,4.49875125,0.0
52.399271,4.53346975,2721.6855
52.399271,4.56818825,2721.6855
52.399271,4.60290675,2721.6855
52.399271,4.63762525,2721.6855
52.399271,4.6723437500000005,0.0
52.399271,4.70706225,0.0
52.399271,4.74178075,0.0
