52.508251,4.49875125,3014.0063
52.508251,4.53346975,3014.0063
52.508251,4.56818825,3014.0063
52.508251,4.60290675,3014.0063
52.508251,4.63762525,3014.0063
52.508251,4.6723437500000005,3014.0063
52.508251,4.70706225,3014.0063
52.508251,4.74178075,3135.767
52.48645500000001,4.49875125,3014.0063
52.48645500000001,4.53346975,3014.0063
52.48645500000001,4.56818825,3014.0063
52.48645500000001,4.60290675,3014.0063
52.48645500000001,4.63762525,3014.0063
52.48645500000001,4.6723437500000005,3014.0063
52.48645500000001,4.70706225,3014.0063
52.48645500000001,4.74178075,3014.0063
52.464659,4.49875125,3362.3479999999995
52.464659,4.53346975,3362.3479999999995
52.464659,4.56818825,3362.3479999999995
52.464659,4.60290675,3362.3479999999995
52.464659,4.63762525,3014.0063
52.464659,4.6723437500000005,3014.0063
52.464659,4.70706225,3014.0063
52.464659,4.74178075,3014.0063
52.442863,4.49875125,3362.3479999999995
52.442863,4.53346975,3362.3479999999995
52.442863,4.56818825,3362.3479999999995
52.442863,4.60290675,3362.3479999999995
52.442863,4.63762525,3362.3479999999995
52.442863,4.6723437500000005,3362.3479999999995
52.442863,4.70706225,3362.3479999999995
52.442863,4.74178075,3362.3479999999995
52.421067,4.49875125,3362.3479999999995
52.421067,4.53346975,3362.3479999999995
52.421067,4.56818825,3362.3479999999995
52.421067,4.60290675,3362.3479999999995
52.421067,4.63762525,3362.3479999999995
52.421067,4.6723437500000005,3362.3479999999995
52.421067,4.70706225,3362.3479999999995
52.421067,4.74178075,3362.3479999999995
52.399271,4.49875125,0.0
52.399271,4.53346975,3589.8324000000002
52.399271,4.56818825,3589.8324000000002
52.399271,4.60290675,3589.8324000000002
52.399271,4.63762525,3589.8324000000002
52.399271,4.6723437500000005,3589.8324000000002
52.399271,4.70706225,3589.8324000000002
52.399271,4.74178075,0.0
