52.508251,4.49875125,2335.059
52.508251,4.53346975,2335.059
52.508251,4.56818825,2335.059
52.508251,4.60290675,2335.059
52.508251,4.63762525,2335.059
52.508251,4.67234375,2335.059
52.508251,4.70706225,2335.059
52.508251,4.74178075,2335.059
52.48645500000001,4.49875125,2335.059
52.48645500000001,4.53346975,2335.059
52.48645500000001,4.56818825,2335.059
52.48645500000001,4.60290675,2335.059
52.48645500000001,4.63762525,2335.059
52.48645500000001,4.67234375,2335.059
52.48645500000001,4.70706225,2335.059
52.48645500000001,4.74178075,2335.059
52.464659,4.49875125,2335.059
52.464659,4.53346975,2335.059
52.464659,4.56818825,2335.059
52.464659,4.60290675,2335.059
52.464659,4.63762525,2335.059
52.464659,4.67234375,2335.059
52.464659,4.70706225,2335.059
52.464659,4.74178075,2335.059
52.442863,4.49875125,2335.059
52.442863,4.53346975,2335.059
52.442863,4.56818825,2335.059
52.442863,4.60290675,2335.059
52.442863,4.63762525,2335.059
52.442863,4.67234375,2335.059
52.442863,4.70706225,2335.059
52.442863,4.74178075,2335.059
52.421067,4.49875125,2335.059
52.421067,4.53346975,2335.059
52.421067,4.56818825,2335.059
52.421067,4.60290675,2335.059
52.421067,4.63762525,2335.059
52.421067,4.67234375,2335.059
52.421067,4.70706225,2335.059
52.421067,4.74178075,2335.059
52.399271,4.49875125,2335.059
52.399271,4.53346975,2335.059
52.399271,4.56818825,2335.059
52.399271,4.60290675,2335.059
52.399271,4.63762525,2335.059
52.399271,4.67234375,2335.059
52.399271,4.70706225,2335.059
52.399271,4.74178075,2335.059
