47.06431778185494,15.361633300781252,5000.0
47.08457120472491,15.430251583456995,45678.0
47.0808884220554,15.42638920247555,3025.5107000000007
47.07527607320631,15.427075847983362,3025.5107000000007
47.07135877114589,15.429479107260706,3025.5107000000007
47.093011380499625,15.403924360871317,3204.9
47.09371272290363,15.44804133474827,3204.9
47.091374878971,15.464177504181864,3204.9
47.09115504943583,15.506858825683596,56789.0
47.07548878314629,15.49003601074219,765439.000089
47.05396938865019,15.466003417968752,30255107.000000007
52.48645500000001,4.60290675,3025.5107000000007
52.48645500000001,4.63762525,3025.5107000000007
52.48645500000001,4.6723437500000005,3025.5107000000007
52.48645500000001,4.70706225,3204.9
52.48645500000001,4.74178075,3204.9
52.464659,4.49875125,0.0
52.464659,4.53346975,0.0
52.464659,4.56818825,3025.5107000000007
52.464659,4.60290675,3298.2416
52.464659,4.63762525,3298.2416
52.464659,4.6723437500000005,3298.2416
52.464659,4.70706225,3318.668
52.464659,4.74178075,3318.668
52.442863,4.49875125,0.0
52.442863,4.53346975,0.0
52.442863,4.56818825,3298.2416
52.442863,4.60290675,3298.2416
52.442863,4.63762525,3298.2416
52.442863,4.6723437500000005,3298.2416
52.442863,4.70706225,3318.668
52.442863,4.74178075,3318.668
52.421067,4.49875125,0.0
52.421067,4.53346975,0.0
52.421067,4.56818825,0.0
52.421067,4.60290675,3298.2416
52.421067,4.63762525,3298.2416
52.421067,4.6723437500000005,3002.327
52.421067,4.70706225,3502.0147
52.421067,4.74178075,3502.0147
52.399271,4.49875125,0.0
52.399271,4.53346975,0.0
52.399271,4.56818825,0.0
52.399271,4.60290675,3002.327
52.399271,4.63762525,3002.327
52.399271,4.6723437500000005,3002.327
52.399271,4.70706225,3002.327
52.399271,4.74178075,0.0
