
{
  "header": {
    "reportVersion": 1,
    "event": "Allocation failed - JavaScript heap out of memory",
    "trigger": "FatalError",
    "filename": "report.20200303.161111.21580.0.001.json",
    "dumpEventTime": "2020-03-03T16:11:11Z",
    "dumpEventTimeStamp": "1583232071199",
    "processId": 21580,
    "cwd": "/var/www/html/aot",
    "commandLine": [
      "node",
      "/home/wadmin/.nvm/versions/node/v12.10.0/bin/ng",
      "build",
      "--prod"
    ],
    "nodejsVersion": "v12.10.0",
    "glibcVersionRuntime": "2.27",
    "glibcVersionCompiler": "2.17",
    "wordSize": 64,
    "arch": "x64",
    "platform": "linux",
    "componentVersions": {
      "node": "12.10.0",
      "v8": "7.6.303.29-node.16",
      "uv": "1.31.0",
      "zlib": "1.2.11",
      "brotli": "1.0.7",
      "ares": "1.15.0",
      "modules": "72",
      "nghttp2": "1.39.2",
      "napi": "4",
      "llhttp": "1.1.4",
      "http_parser": "2.8.0",
      "openssl": "1.1.1c",
      "cldr": "35.1",
      "icu": "64.2",
      "tz": "2019a",
      "unicode": "12.1"
    },
    "release": {
      "name": "node",
      "headersUrl": "https://nodejs.org/download/release/v12.10.0/node-v12.10.0-headers.tar.gz",
      "sourceUrl": "https://nodejs.org/download/release/v12.10.0/node-v12.10.0.tar.gz"
    },
    "osName": "Linux",
    "osRelease": "4.15.0-66-generic",
    "osVersion": "#75-Ubuntu SMP Tue Oct 1 05:24:09 UTC 2019",
    "osMachine": "x86_64",
    "cpus": [
      {
        "model": "Intel(R) Pentium(R) CPU G3240 @ 3.10GHz",
        "speed": 2085,
        "user": 25799600,
        "nice": 3800900,
        "sys": 4861900,
        "idle": 152975600,
        "irq": 0
      },
      {
        "model": "Intel(R) Pentium(R) CPU G3240 @ 3.10GHz",
        "speed": 2120,
        "user": 25708800,
        "nice": 2702600,
        "sys": 4865600,
        "idle": 152922900,
        "irq": 0
      }
    ],
    "networkInterfaces": [
      {
        "name": "lo",
        "internal": true,
        "mac": "00:00:00:00:00:00",
        "address": "127.0.0.1",
        "netmask": "255.0.0.0",
        "family": "IPv4"
      },
      {
        "name": "enp2s0",
        "internal": false,
        "mac": "4c:cc:6a:48:87:06",
        "address": "192.168.0.36",
        "netmask": "255.255.255.0",
        "family": "IPv4"
      },
      {
        "name": "lo",
        "internal": true,
        "mac": "00:00:00:00:00:00",
        "address": "::1",
        "netmask": "ffff:ffff:ffff:ffff:ffff:ffff:ffff:ffff",
        "family": "IPv6",
        "scopeid": 0
      },
      {
        "name": "enp2s0",
        "internal": false,
        "mac": "4c:cc:6a:48:87:06",
        "address": "fe80::23eb:8fe7:2636:2302",
        "netmask": "ffff:ffff:ffff:ffff::",
        "family": "IPv6",
        "scopeid": 2
      }
    ],
    "host": "wadmin"
  },
  "javascriptStack": {
    "message": "No stack.",
    "stack": [
      "Unavailable."
    ]
  },
  "nativeStack": [
    {
      "pc": "0x0000000000ae3e75",
      "symbol": "report::TriggerNodeReport(v8::Isolate*, node::Environment*, char const*, char const*, std::string const&, v8::Local<v8::String>) [ng build --prod]"
    },
    {
      "pc": "0x00000000009bdd83",
      "symbol": "node::OnFatalError(char const*, char const*) [ng build --prod]"
    },
    {
      "pc": "0x0000000000b1948e",
      "symbol": "v8::Utils::ReportOOMFailure(v8::internal::Isolate*, char const*, bool) [ng build --prod]"
    },
    {
      "pc": "0x0000000000b19809",
      "symbol": "v8::internal::V8::FatalProcessOutOfMemory(v8::internal::Isolate*, char const*, bool) [ng build --prod]"
    },
    {
      "pc": "0x0000000000cca1f5",
      "symbol": " [ng build --prod]"
    },
    {
      "pc": "0x0000000000cca866",
      "symbol": "v8::internal::Heap::RecomputeLimits(v8::internal::GarbageCollector) [ng build --prod]"
    },
    {
      "pc": "0x0000000000cd609a",
      "symbol": "v8::internal::Heap::PerformGarbageCollection(v8::internal::GarbageCollector, v8::GCCallbackFlags) [ng build --prod]"
    },
    {
      "pc": "0x0000000000cd6fa5",
      "symbol": "v8::internal::Heap::CollectGarbage(v8::internal::AllocationSpace, v8::internal::GarbageCollectionReason, v8::GCCallbackFlags) [ng build --prod]"
    },
    {
      "pc": "0x0000000000cd9a68",
      "symbol": "v8::internal::Heap::AllocateRawWithRetryOrFail(int, v8::internal::AllocationType, v8::internal::AllocationAlignment) [ng build --prod]"
    },
    {
      "pc": "0x0000000000ca1597",
      "symbol": "v8::internal::Factory::NewFillerObject(int, bool, v8::internal::AllocationType) [ng build --prod]"
    },
    {
      "pc": "0x0000000000fc9820",
      "symbol": "v8::internal::Runtime_AllocateInOldGeneration(int, unsigned long*, v8::internal::Isolate*) [ng build --prod]"
    },
    {
      "pc": "0x000000000134e879",
      "symbol": " [ng build --prod]"
    }
  ],
  "javascriptHeap": {
    "totalMemory": 2193883136,
    "totalCommittedMemory": 2192610456,
    "usedMemory": 2117781992,
    "availableMemory": 59648448,
    "memoryLimit": 2197815296,
    "heapSpaces": {
      "read_only_space": {
        "memorySize": 262144,
        "committedMemory": 31744,
        "capacity": 261832,
        "used": 31432,
        "available": 230400
      },
      "new_space": {
        "memorySize": 33554432,
        "committedMemory": 33289312,
        "capacity": 16757248,
        "used": 935680,
        "available": 15821568
      },
      "old_space": {
        "memorySize": 1921363968,
        "committedMemory": 1921107032,
        "capacity": 1913654728,
        "used": 1890747656,
        "available": 22907072
      },
      "code_space": {
        "memorySize": 6717440,
        "committedMemory": 6433632,
        "capacity": 5656576,
        "used": 5656576,
        "available": 0
      },
      "map_space": {
        "memorySize": 31723520,
        "committedMemory": 31487104,
        "capacity": 20890320,
        "used": 20890320,
        "available": 0
      },
      "large_object_space": {
        "memorySize": 199639040,
        "committedMemory": 199639040,
        "capacity": 198969672,
        "used": 198969672,
        "available": 0
      },
      "code_large_object_space": {
        "memorySize": 622592,
        "committedMemory": 622592,
        "capacity": 550656,
        "used": 550656,
        "available": 0
      },
      "new_large_object_space": {
        "memorySize": 0,
        "committedMemory": 0,
        "capacity": 16757248,
        "used": 0,
        "available": 16757248
      }
    }
  },
  "resourceUsage": {
    "userCpuSeconds": 210.517,
    "kernelCpuSeconds": 3.44301,
    "cpuConsumptionPercent": 124.396,
    "maxRss": 2455527424,
    "pageFaults": {
      "IORequired": 22,
      "IONotRequired": 1297220
    },
    "fsActivity": {
      "reads": 223576,
      "writes": 0
    }
  },
  "uvthreadResourceUsage": {
    "userCpuSeconds": 124.983,
    "kernelCpuSeconds": 1.98621,
    "cpuConsumptionPercent": 73.8193,
    "fsActivity": {
      "reads": 221360,
      "writes": 0
    }
  },
  "libuv": [
  ],
  "environmentVariables": {
    "CLUTTER_IM_MODULE": "xim",
    "NVM_DIR": "/home/wadmin/.nvm",
    "LS_COLORS": "rs=0:di=01;34:ln=01;36:mh=00:pi=40;33:so=01;35:do=01;35:bd=40;33;01:cd=40;33;01:or=40;31;01:mi=00:su=37;41:sg=30;43:ca=30;41:tw=30;42:ow=34;42:st=37;44:ex=01;32:*.tar=01;31:*.tgz=01;31:*.arc=01;31:*.arj=01;31:*.taz=01;31:*.lha=01;31:*.lz4=01;31:*.lzh=01;31:*.lzma=01;31:*.tlz=01;31:*.txz=01;31:*.tzo=01;31:*.t7z=01;31:*.zip=01;31:*.z=01;31:*.Z=01;31:*.dz=01;31:*.gz=01;31:*.lrz=01;31:*.lz=01;31:*.lzo=01;31:*.xz=01;31:*.zst=01;31:*.tzst=01;31:*.bz2=01;31:*.bz=01;31:*.tbz=01;31:*.tbz2=01;31:*.tz=01;31:*.deb=01;31:*.rpm=01;31:*.jar=01;31:*.war=01;31:*.ear=01;31:*.sar=01;31:*.rar=01;31:*.alz=01;31:*.ace=01;31:*.zoo=01;31:*.cpio=01;31:*.7z=01;31:*.rz=01;31:*.cab=01;31:*.wim=01;31:*.swm=01;31:*.dwm=01;31:*.esd=01;31:*.jpg=01;35:*.jpeg=01;35:*.mjpg=01;35:*.mjpeg=01;35:*.gif=01;35:*.bmp=01;35:*.pbm=01;35:*.pgm=01;35:*.ppm=01;35:*.tga=01;35:*.xbm=01;35:*.xpm=01;35:*.tif=01;35:*.tiff=01;35:*.png=01;35:*.svg=01;35:*.svgz=01;35:*.mng=01;35:*.pcx=01;35:*.mov=01;35:*.mpg=01;35:*.mpeg=01;35:*.m2v=01;35:*.mkv=01;35:*.webm=01;35:*.ogm=01;35:*.mp4=01;35:*.m4v=01;35:*.mp4v=01;35:*.vob=01;35:*.qt=01;35:*.nuv=01;35:*.wmv=01;35:*.asf=01;35:*.rm=01;35:*.rmvb=01;35:*.flc=01;35:*.avi=01;35:*.fli=01;35:*.flv=01;35:*.gl=01;35:*.dl=01;35:*.xcf=01;35:*.xwd=01;35:*.yuv=01;35:*.cgm=01;35:*.emf=01;35:*.ogv=01;35:*.ogx=01;35:*.aac=00;36:*.au=00;36:*.flac=00;36:*.m4a=00;36:*.mid=00;36:*.midi=00;36:*.mka=00;36:*.mp3=00;36:*.mpc=00;36:*.ogg=00;36:*.ra=00;36:*.wav=00;36:*.oga=00;36:*.opus=00;36:*.spx=00;36:*.xspf=00;36:",
    "LESSCLOSE": "/usr/bin/lesspipe %s %s",
    "XDG_MENU_PREFIX": "gnome-",
    "LANG": "en_IN",
    "MANAGERPID": "1444",
    "DISPLAY": ":0",
    "INVOCATION_ID": "9ed4961035bf4bd5aca8333843255b9e",
    "GNOME_SHELL_SESSION_MODE": "ubuntu",
    "COLORTERM": "truecolor",
    "NVM_CD_FLAGS": "",
    "USERNAME": "wadmin",
    "XDG_VTNR": "2",
    "SSH_AUTH_SOCK": "/run/user/1000/keyring/ssh",
    "MANDATORY_PATH": "/usr/share/gconf/ubuntu.mandatory.path",
    "XDG_SESSION_ID": "2",
    "USER": "wadmin",
    "DESKTOP_SESSION": "ubuntu",
    "QT4_IM_MODULE": "xim",
    "TEXTDOMAINDIR": "/usr/share/locale/",
    "GNOME_TERMINAL_SCREEN": "/org/gnome/Terminal/screen/961b6dfb_acb4_400b_be71_8a3b95a25581",
    "DEFAULTS_PATH": "/usr/share/gconf/ubuntu.default.path",
    "PWD": "/var/www/html/aot",
    "HOME": "/home/wadmin",
    "JOURNAL_STREAM": "9:31226",
    "TEXTDOMAIN": "im-config",
    "SSH_AGENT_PID": "1571",
    "QT_ACCESSIBILITY": "1",
    "XDG_SESSION_TYPE": "x11",
    "XDG_DATA_DIRS": "/usr/share/ubuntu:/usr/local/share/:/usr/share/:/var/lib/snapd/desktop",
    "XDG_SESSION_DESKTOP": "ubuntu",
    "DBUS_STARTER_ADDRESS": "unix:path=/run/user/1000/bus,guid=8c355453348f858e4d060a185e5de944",
    "GTK_MODULES": "gail:atk-bridge",
    "WINDOWPATH": "2",
    "TERM": "xterm-256color",
    "SHELL": "/bin/bash",
    "VTE_VERSION": "5202",
    "QT_IM_MODULE": "xim",
    "XMODIFIERS": "@im=ibus",
    "IM_CONFIG_PHASE": "2",
    "DBUS_STARTER_BUS_TYPE": "session",
    "NVM_BIN": "/home/wadmin/.nvm/versions/node/v12.10.0/bin",
    "XDG_CURRENT_DESKTOP": "ubuntu:GNOME",
    "GPG_AGENT_INFO": "/run/user/1000/gnupg/S.gpg-agent:0:1",
    "GNOME_TERMINAL_SERVICE": ":1.73",
    "XDG_SEAT": "seat0",
    "SHLVL": "1",
    "LANGUAGE": "en_IN:en",
    "GDMSESSION": "ubuntu",
    "GNOME_DESKTOP_SESSION_ID": "this-is-deprecated",
    "LOGNAME": "wadmin",
    "DBUS_SESSION_BUS_ADDRESS": "unix:path=/run/user/1000/bus,guid=8c355453348f858e4d060a185e5de944",
    "XDG_RUNTIME_DIR": "/run/user/1000",
    "XAUTHORITY": "/run/user/1000/gdm/Xauthority",
    "XDG_CONFIG_DIRS": "/etc/xdg/xdg-ubuntu:/etc/xdg",
    "PATH": "/home/wadmin/.nvm/versions/node/v12.10.0/bin:/usr/local/sbin:/usr/local/bin:/usr/sbin:/usr/bin:/sbin:/bin:/usr/games:/usr/local/games:/snap/bin",
    "SESSION_MANAGER": "local/wadmin:@/tmp/.ICE-unix/1475,unix/wadmin:/tmp/.ICE-unix/1475",
    "LESSOPEN": "| /usr/bin/lesspipe %s",
    "GTK_IM_MODULE": "ibus",
    "_": "/home/wadmin/.nvm/versions/node/v12.10.0/bin/ng",
    "BROWSERSLIST_IGNORE_OLD_DATA": "1"
  },
  "userLimits": {
    "core_file_size_blocks": {
      "soft": 0,
      "hard": "unlimited"
    },
    "data_seg_size_kbytes": {
      "soft": "unlimited",
      "hard": "unlimited"
    },
    "file_size_blocks": {
      "soft": "unlimited",
      "hard": "unlimited"
    },
    "max_locked_memory_bytes": {
      "soft": 16777216,
      "hard": 16777216
    },
    "max_memory_size_kbytes": {
      "soft": "unlimited",
      "hard": "unlimited"
    },
    "open_files": {
      "soft": 4096,
      "hard": 4096
    },
    "stack_size_bytes": {
      "soft": 8388608,
      "hard": "unlimited"
    },
    "cpu_time_seconds": {
      "soft": "unlimited",
      "hard": "unlimited"
    },
    "max_user_processes": {
      "soft": 30359,
      "hard": 30359
    },
    "virtual_memory_kbytes": {
      "soft": "unlimited",
      "hard": "unlimited"
    }
  },
  "sharedObjects": [
    "linux-vdso.so.1",
    "/lib/x86_64-linux-gnu/libdl.so.2",
    "/lib/x86_64-linux-gnu/librt.so.1",
    "/usr/lib/x86_64-linux-gnu/libstdc++.so.6",
    "/lib/x86_64-linux-gnu/libm.so.6",
    "/lib/x86_64-linux-gnu/libgcc_s.so.1",
    "/lib/x86_64-linux-gnu/libpthread.so.0",
    "/lib/x86_64-linux-gnu/libc.so.6",
    "/lib64/ld-linux-x86-64.so.2",
    "/var/www/html/aot/node_modules/node-sass/vendor/linux-x64-72/binding.node"
  ]
}