H_HEADCODE,CAPACITY,NAME,LOTNO,SNAME,TED_RATE,RANK,STD_BAGS,ACT_BAGS,AMOUNT,DISTU,STATUS,ROUND,GRNAME
3,50000000.00,A AND A ASSOCIATES,157A,KACCHE,8709.00,,1400.000,0,12192600.00,,,1,
3,50000000.00,A AND A ASSOCIATES,154A,CHAWELA,8499.00,,1700.000,0,14448300.00,,,1,
4,40000000.00,ABC TRADERS,192B,P.V.34,6579.00,,1400.000,0,9210600.00,,,1,
91,13750112.50,AMRIT SALES,699,KOI,7299.00,,400.000,0,2919600.00,,,1,
91,13750112.50,AMRIT SALES,326,BORAI,5499.00,,900.000,0,4949100.00,,,1,
12,87112100.00,APR BIRI FACTORY,123A,AAMABEDA,6189.00,,1700.000,0,10521300.00,,,1,
12,87112100.00,APR BIRI FACTORY,123B,AAMABEDA,6199.00,,2200.000,0,13637800.00,,,1,
17,25000000.00,ASHUTOSH TRADING COMPANY,636,TURTURA,5331.00,,900.000,0,4797900.00,,,1,DESAI
17,25000000.00,ASHUTOSH TRADING COMPANY,650,MUKDEGA,5304.00,,1300.000,0,6895200.00,,,1,DESAI
17,25000000.00,ASHUTOSH TRADING COMPANY,651,JHAGARPUR,5087.00,,1600.000,0,8139200.00,,,1,DESAI
19,18750000.00,ASMA TRADERS,764,LADKORBI,6786.00,,2200.000,0,14929200.00,,,1,
111,155000000.00,MS ASSURANCE CO,26A,KARKELI,9216.00,,1400.000,0,12902400.00,,,1,
111,155000000.00,MS ASSURANCE CO,28B,KUTRU,9216.00,,1300.000,0,11980800.00,,,1,
111,155000000.00,MS ASSURANCE CO,26B,KARKELI,8559.00,,1000.000,0,8559000.00,,,1,
111,155000000.00,MS ASSURANCE CO,28A,KUTRU,8559.00,,2000.000,0,17118000.00,,,1,
111,155000000.00,MS ASSURANCE CO,22A,GUDMA,8019.00,,2200.000,0,17641800.00,,,1,
111,155000000.00,MS ASSURANCE CO,22B,GUDMA,8019.00,,2300.000,0,18443700.00,,,1,
111,155000000.00,MS ASSURANCE CO,57,DANTEWADA,5769.00,,2200.000,0,12691800.00,,,1,
111,155000000.00,MS ASSURANCE CO,20A,NAIMAD,8019.00,,1900.000,0,15236100.00,,,1,
111,155000000.00,MS ASSURANCE CO,20B,NAIMED,8019.00,,1800.000,0,14434200.00,,,1,
111,155000000.00,MS ASSURANCE CO,17A,DHANORA,7029.00,,1500.000,0,10543500.00,,,1,
111,155000000.00,MS ASSURANCE CO,59A,MATWADA,7299.00,,1900.000,0,13868100.00,,,1,
21,143750000.00,Ashoka enterprises,821,"KAMARJI,GOINI",7299.00,,3200.000,0,23356800.00,,,1,SAIDU
21,143750000.00,Ashoka enterprises,850,LANJIT,7299.00,,5800.000,0,42334200.00,,,1,SAIDU
21,143750000.00,Ashoka enterprises,880,GHUI,6899.00,,4900.000,0,33805100.00,,,1,SAIDU
21,143750000.00,Ashoka enterprises,830,DANDGAON,7299.00,,4800.000,0,35035200.00,,,1,SAIDU
21,143750000.00,Ashoka enterprises,708,KORBA,6899.00,,1100.000,0,7588900.00,,,1,SAIDU
22,31250000.00,BABU BEEDI WORKS,912B,VISHALPUR,5419.00,,2500.000,0,13547500.00,,,1,
92,52020000.00,BENGAL BIRI FACTORY,753,BANDHAPARA,9207.00,,4300.000,0,39590100.00,,,1,
92,52020000.00,BENGAL BIRI FACTORY,710,BELA,9513.00,,1300.000,0,12366900.00,,,1,
24,203000000.00,BHARATH MARKETING(30NO),736,BATRA,5677.00,,2100.000,0,11921700.00,,,1,SAIDU
24,203000000.00,BHARATH MARKETING(30NO),759,SEMRA,6677.00,,2800.000,0,18695600.00,,,1,SAIDU
24,203000000.00,BHARATH MARKETING(30NO),763,SIRMINA,5877.00,,2800.000,0,16455600.00,,,1,SAIDU
24,203000000.00,BHARATH MARKETING(30NO),539,BASAJHAL,5377.00,,1300.000,0,6990100.00,,,1,SAIDU
24,203000000.00,BHARATH MARKETING(30NO),760,PASAN,7777.00,,4000.000,0,31108000.00,,,1,SAIDU
24,203000000.00,BHARATH MARKETING(30NO),436,TUHLU,8577.00,,1800.000,0,15438600.00,,,1,SAIDU
24,203000000.00,BHARATH MARKETING(30NO),437,BHOTHA,8577.00,,2400.000,0,20584800.00,,,1,SAIDU
24,203000000.00,BHARATH MARKETING(30NO),442,MUNGASER,5077.00,,1500.000,0,7615500.00,,,1,SAIDU
26,13137500.00,BHIMRAJ SUNDERLAL KIRI,210,BAIJANPURI,7111.00,,1800.000,0,12799800.00,,,1,
34,50000000.00,CHHOTABHAI MUNNUBHAI,801A,JANAKPUR,6149.00,,2000.000,0,12298000.00,,,1,
34,50000000.00,CHHOTABHAI MUNNUBHAI,801B,JANAKPUR,6139.00,,1400.000,0,8594600.00,,,1,
34,50000000.00,CHHOTABHAI MUNNUBHAI,800,KANJIYA,5519.00,,2600.000,0,14349400.00,,,1,
34,50000000.00,CHHOTABHAI MUNNUBHAI,802B,GHAGHRA,6319.00,,1900.000,0,12006100.00,,,1,
35,100000000.00,C.J.PATEL & CO(CJ),734,PONDI,5529.00,,1600.000,0,8846400.00,,,1,DESAI
35,100000000.00,C.J.PATEL & CO(CJ),837,UMESHWARPUR,5289.00,,3100.000,0,16395900.00,,,1,DESAI
35,100000000.00,C.J.PATEL & CO(CJ),838,KANAKPUR,5189.00,,2100.000,0,10896900.00,,,1,DESAI
35,100000000.00,C.J.PATEL & CO(CJ),595,"BANGURSIA, SAMBALPUR",6109.00,,2100.000,0,12828900.00,,,1,DESAI
35,100000000.00,C.J.PATEL & CO(CJ),597,"HAMIRPUR, PADIGAON",6059.00,,1600.000,0,9694400.00,,,1,DESAI
35,100000000.00,C.J.PATEL & CO(CJ),602,KEWALI,5609.00,,1300.000,0,7291700.00,,,1,DESAI
35,100000000.00,C.J.PATEL & CO(CJ),615,KHAMHARIYA,6289.00,,1000.000,0,6289000.00,,,1,DESAI
35,100000000.00,C.J.PATEL & CO(CJ),886,DOMAHAT,5189.00,,3300.000,0,17123700.00,,,1,DESAI
35,100000000.00,C.J.PATEL & CO(CJ),887,REWATI,5089.00,,1600.000,0,8142400.00,,,1,DESAI
36,60000000.00,CRESCENT TRADE LINKS,199,BHANBEDA,8289.00,,3000.000,0,24867000.00,,,1,DESAI
36,60000000.00,CRESCENT TRADE LINKS,58,MIRTOOR,5709.00,,2500.000,0,14272500.00,,,1,DESAI
36,60000000.00,CRESCENT TRADE LINKS,59B,MATWADA,5709.00,,1600.000,0,9134400.00,,,1,DESAI
38,60000000.00,DECCAN LEAVES PROCESSORS,279,GATAPAR,5489.00,,2100.000,0,11526900.00,,,1,
40,375000000.00,DESAI BROTHERS(DESAI),431,SIRPUR,6789.00,,2600.000,0,17651400.00,,,1,
40,375000000.00,DESAI BROTHERS(DESAI),443,TENDUKONA,7869.00,,2000.000,0,15738000.00,,,1,
40,375000000.00,DESAI BROTHERS(DESAI),508,GANIYARI,6809.00,,1300.000,0,8851700.00,,,1,
40,375000000.00,DESAI BROTHERS(DESAI),504,BAYA,7119.00,,1700.000,0,12102300.00,,,1,
40,375000000.00,DESAI BROTHERS(DESAI),715,SYANG,7719.00,,2100.000,0,16209900.00,,,1,
40,375000000.00,DESAI BROTHERS(DESAI),755,MADANPUR,8039.00,,2000.000,0,16078000.00,,,1,
40,375000000.00,DESAI BROTHERS(DESAI),754,MORGA,8039.00,,2200.000,0,17685800.00,,,1,
40,375000000.00,DESAI BROTHERS(DESAI),712,GIRARI,7299.00,,1000.000,0,7299000.00,,,1,
40,375000000.00,DESAI BROTHERS(DESAI),704B,KOLGA,7479.00,,1600.000,0,11966400.00,,,1,
40,375000000.00,DESAI BROTHERS(DESAI),465,RIKHADADAR,6719.00,,1100.000,0,7390900.00,,,1,
40,375000000.00,DESAI BROTHERS(DESAI),757,JATGA,7219.00,,3000.000,0,21657000.00,,,1,
40,375000000.00,DESAI BROTHERS(DESAI),751,TUMAN,6719.00,,2300.000,0,15453700.00,,,1,
40,375000000.00,DESAI BROTHERS(DESAI),739,LAFA,6339.00,,3600.000,0,22820400.00,,,1,
40,375000000.00,DESAI BROTHERS(DESAI),445,TAMORA,6519.00,,2200.000,0,14341800.00,,,1,
40,375000000.00,DESAI BROTHERS(DESAI),454,BADAIPALI,7019.00,,1800.000,0,12634200.00,,,1,
40,375000000.00,DESAI BROTHERS(DESAI),425,SINGHRUPALI,6819.00,,1600.000,0,10910400.00,,,1,
40,375000000.00,DESAI BROTHERS(DESAI),428,CHIRKO,5639.00,,1100.000,0,6202900.00,,,1,
46,72500000.00,GANAPATI ASSOCIATES,611,"KATANGDIHI, NAWAPARA",7030.00,,2100.000,0,14763000.00,,,1,
46,72500000.00,GANAPATI ASSOCIATES,648,"SONAJORI, BAISKIMUDA",5590.00,,2100.000,0,11739000.00,,,1,
46,72500000.00,GANAPATI ASSOCIATES,286,RAMPUR,5050.00,,2600.000,0,13130000.00,,,1,
46,72500000.00,GANAPATI ASSOCIATES,287,MURUM,5050.00,,1400.000,0,7070000.00,,,1,
46,72500000.00,GANAPATI ASSOCIATES,797,BEHRASI,5540.00,,2200.000,0,12188000.00,,,1,
48,93750000.00,GIRIDHAR DADAJI DHARNE,3A,USOOR,8921.00,,1200.000,0,10705200.00,,,1,SW
48,93750000.00,GIRIDHAR DADAJI DHARNE,3B,USOOR,9421.00,,1200.000,0,11305200.00,,,1,SW
48,93750000.00,GIRIDHAR DADAJI DHARNE,12A,CHERPALLI,7621.00,,1500.000,0,11431500.00,,,1,SW
48,93750000.00,GIRIDHAR DADAJI DHARNE,13,SAKNAPALLI,7621.00,,2200.000,0,16766200.00,,,1,SW
48,93750000.00,GIRIDHAR DADAJI DHARNE,15,BANDEPARA,7221.00,,3100.000,0,22385100.00,,,1,SW
48,93750000.00,GIRIDHAR DADAJI DHARNE,31B,ERRABOR,7667.00,,800.000,0,6133600.00,,,1,SW
50,25000000.00,GREEN BRIGADE,44A,PHULBAGADI,5101.00,,1900.000,0,9691900.00,,,1,
50,25000000.00,GREEN BRIGADE,44B,PHULBAGADI,5101.00,,2200.000,0,11222200.00,,,1,
52,100000000.00,GV NATURAL FOREST,758,AMLIKUNDA,8030.00,,2200.000,0,17666000.00,,,1,
52,100000000.00,GV NATURAL FOREST,664,SISRINGA,8230.00,,2600.000,0,21398000.00,,,1,
52,100000000.00,GV NATURAL FOREST,703,BARPALI,8130.00,,1400.000,0,11382000.00,,,1,
52,100000000.00,GV NATURAL FOREST,707,RAJGAMAR,8330.00,,1400.000,0,11662000.00,,,1,
52,100000000.00,GV NATURAL FOREST,713,LABED,8430.00,,3300.000,0,27819000.00,,,1,
52,100000000.00,GV NATURAL FOREST,709,JAMBAHAR,7830.00,,900.000,0,7047000.00,,,1,
58,16250000.00,HUSSAIN,781,KUNKURI,5369.00,,1700.000,0,9127300.00,,,1,
59,75000000.00,IDEAL TRADING CO,407,KANSINGHI,7705.00,,1400.000,0,10787000.00,,,1,
59,75000000.00,IDEAL TRADING CO,201B,PIDAPAL,6952.00,,1400.000,0,9732800.00,,,1,
62,190000000.00,J. P. TOBACCO(TELE),531,KHUDIA,6009.00,,2300.000,0,13820700.00,,,1,
62,190000000.00,J. P. TOBACCO(TELE),532,"KOTA, SHIVTARAI",5839.00,,2200.000,0,12845800.00,,,1,
62,190000000.00,J. P. TOBACCO(TELE),548,"BASTI,UMARKHOI",7069.00,,3100.000,0,21913900.00,,,1,
62,190000000.00,J. P. TOBACCO(TELE),321A,KUKDUR,5549.00,,2300.000,0,12762700.00,,,1,
63,45000000.00,J.S.TOBACCO STORES,222,AUNDHI,7007.00,,2600.000,0,18218200.00,,,1,
63,45000000.00,J.S.TOBACCO STORES,172,CHHOTEBETHIYA,6068.00,,2000.000,0,12136000.00,,,1,
63,45000000.00,J.S.TOBACCO STORES,218B,NARHARPUR,6268.00,,800.000,0,5014400.00,,,1,
64,127500000.00,JAI JALARAM TRADERS,179,P.V.37,5189.00,,1000.000,0,5189000.00,,,1,
64,127500000.00,JAI JALARAM TRADERS,183A,GHODAGAON,6839.00,,1100.000,0,7522900.00,,,1,
64,127500000.00,JAI JALARAM TRADERS,194,KHAIRKATTA,6839.00,,1900.000,0,12994100.00,,,1,
64,127500000.00,JAI JALARAM TRADERS,120,TALABEDA,8839.00,,2000.000,0,17678000.00,,,1,
64,127500000.00,JAI JALARAM TRADERS,121,TADOKI,8839.00,,1900.000,0,16794100.00,,,1,
64,127500000.00,JAI JALARAM TRADERS,166,TADBAYLI,7339.00,,2000.000,0,14678000.00,,,1,
64,127500000.00,JAI JALARAM TRADERS,232A,KOTARI,8639.00,,1300.000,0,11230700.00,,,1,
64,127500000.00,JAI JALARAM TRADERS,232B,KOTARI,8639.00,,1300.000,0,11230700.00,,,1,
64,127500000.00,JAI JALARAM TRADERS,223,"TATEKASA, SENDEWAHI",7839.00,,1700.000,0,13326300.00,,,1,
64,127500000.00,JAI JALARAM TRADERS,226,HURELI,8639.00,,1700.000,0,14686300.00,,,1,
65,125000000.00,JAMNADAS MORARJI(VADERA),249,DANGARH,5283.00,,1000.000,0,5283000.00,,,1,
65,125000000.00,JAMNADAS MORARJI(VADERA),248A,BOGATOLA,5058.00,,800.000,0,4046400.00,,,1,
65,125000000.00,JAMNADAS MORARJI(VADERA),248B,BOGATOLA,5058.00,,700.000,0,3540600.00,,,1,
66,62500000.00,JEET BIRI MFG.,478,"JEVRA, MEDNIPUR",6323.00,,2100.000,0,13278300.00,,,1,
66,62500000.00,JEET BIRI MFG.,480,GARPHULJHAR,5189.00,,1100.000,0,5707900.00,,,1,
69,81337500.00,KALEEM TRADERS,393,PIPERCHHEDI,8703.00,,1300.000,0,11313900.00,,,1,
69,81337500.00,KALEEM TRADERS,410,BAMHANI,8379.00,,1100.000,0,9216900.00,,,1,
69,81337500.00,KALEEM TRADERS,217,DABENA,6734.00,,1700.000,0,11447800.00,,,1,
69,81337500.00,KALEEM TRADERS,218A,NARHARPUR,6534.00,,1500.000,0,9801000.00,,,1,
69,81337500.00,KALEEM TRADERS,215,SHAMTARA,6219.00,,1200.000,0,7462800.00,,,1,
69,81337500.00,KALEEM TRADERS,216,JAMGAON,6219.00,,1100.000,0,6840900.00,,,1,
70,70000000.00,KALINDI ENTERPRISE,675,BORO,8929.00,,2500.000,0,22322500.00,,,1,
70,70000000.00,KALINDI ENTERPRISE,656,SAKARLIA,8889.00,,1800.000,0,16000200.00,,,1,
70,70000000.00,KALINDI ENTERPRISE,659,SOKHAMUDA,8389.00,,1400.000,0,11744600.00,,,1,
70,70000000.00,KALINDI ENTERPRISE,652,AAMAPALI,8189.00,,1100.000,0,9007900.00,,,1,
70,70000000.00,KALINDI ENTERPRISE,665,DHARAMJAIGARH,7689.00,,1200.000,0,9226800.00,,,1,
71,62500000.00,KALPANA NATURAL,740,"BARI UMRAO, RAHA",7969.00,,3600.000,0,28688400.00,,,1,MH
71,62500000.00,KALPANA NATURAL,718,"AJAGARBAHAR, SATRENG",7799.00,,2600.000,0,20277400.00,,,1,MH
71,62500000.00,KALPANA NATURAL,616,"HINJHAR, URBA",6399.00,,1300.000,0,8318700.00,,,1,MH
75,68750000.00,KAVITA ENTERPRISES,686,CHIKANIPALI,5042.00,,1000.000,0,5042000.00,,,1,
79,112500000.00,KISHAN BIRI MFG.(KISAN),207,DUDHAWA,7509.00,,1400.000,0,10512600.00,,,1,MH
79,112500000.00,KISHAN BIRI MFG.(KISAN),204,PATOUD,6109.00,,900.000,0,5498100.00,,,1,MH
79,112500000.00,KISHAN BIRI MFG.(KISAN),208,DHANESARA,7409.00,,1200.000,0,8890800.00,,,1,MH
79,112500000.00,KISHAN BIRI MFG.(KISAN),382,KURSIPAR,8309.00,,1600.000,0,13294400.00,,,1,MH
79,112500000.00,KISHAN BIRI MFG.(KISAN),383,JOBA,8209.00,,1400.000,0,11492600.00,,,1,MH
79,112500000.00,KISHAN BIRI MFG.(KISAN),338,"JABARRA, DUGLI",8109.00,,1400.000,0,11352600.00,,,1,MH
79,112500000.00,KISHAN BIRI MFG.(KISAN),339,"MARAGAON, SINGHPUR",7709.00,,1700.000,0,13105300.00,,,1,MH
79,112500000.00,KISHAN BIRI MFG.(KISAN),348,KHADMA,6809.00,,1200.000,0,8170800.00,,,1,MH
79,112500000.00,KISHAN BIRI MFG.(KISAN),500,"BALDAKUCHAR, SAIYABH",7909.00,,1800.000,0,14236200.00,,,1,MH
79,112500000.00,KISHAN BIRI MFG.(KISAN),681,KINDHA,8259.00,,1700.000,0,14040300.00,,,1,MH
86,68750000.00,LEELA TRADING CO.,238,BORIYA MUKASA,7769.00,,2000.000,0,15538000.00,,,1,
86,68750000.00,LEELA TRADING CO.,205,SARONA,8199.00,,2100.000,0,17217900.00,,,1,
86,68750000.00,LEELA TRADING CO.,206,BASANWAHI,8199.00,,2100.000,0,17217900.00,,,1,
86,68750000.00,LEELA TRADING CO.,211,PURI,5229.00,,2600.000,0,13595400.00,,,1,
88,15750000.00,M F A RAHMAN,10,BHADRAKALI,8019.00,,1300.000,0,10424700.00,,,1,
101,100000000.00,M.A. MUQTHAR & CO(DESAI),240,TOLUM,7519.00,,1700.000,0,12782300.00,,,1,DESAI
101,100000000.00,M.A. MUQTHAR & CO(DESAI),278,ITAR,5619.00,,1800.000,0,10114200.00,,,1,DESAI
95,17500000.00,MAHESH KUMAR AND CO.,644,NAGDARHA,7016.00,,1400.000,0,9822400.00,,,1,
112,41490000.00,MANILAL DAYALJI CO(GOLA),701,CHACHIA,8019.00,,2000.000,0,16038000.00,,,1,GOLA
112,41490000.00,MANILAL DAYALJI CO(GOLA),745,"CHHURI, KATGHORA",6669.00,,1800.000,0,12004200.00,,,1,GOLA
112,41490000.00,MANILAL DAYALJI CO(GOLA),748,BINJARA,6417.00,,1400.000,0,8983800.00,,,1,GOLA
105,27500000.00,MMTRADERS,175,"IRPANAR, KANHARGAON",5058.00,,1500.000,0,7587000.00,,,1,
109,75000000.00,MOHD SAMIM,814,AKLASARI,7030.00,,1400.000,0,9842000.00,,,1,
110,100000000.00,MORARJI T. & CO(VADERA),501,MOHDA,7839.00,,1700.000,0,13326300.00,,,1,VADERA
110,100000000.00,MORARJI T. & CO(VADERA),507,THARGAON,6183.00,,900.000,0,5564700.00,,,1,VADERA
110,100000000.00,MORARJI T. & CO(VADERA),509,BANIKHAR,6264.00,,900.000,0,5637600.00,,,1,VADERA
115,160000000.00,MURSHIDABAD BIRI WORKS,420,FULJHAR,5375.00,,900.000,0,4837500.00,,,1,
115,160000000.00,MURSHIDABAD BIRI WORKS,154B,CHAWELA,7055.00,,1600.000,0,11288000.00,,,1,
117,62500000.00,N B TOBACCO STORES,134,KODAPAKHA,6729.00,,1800.000,0,12112200.00,,,1,
119,100000000.00,NAAZ TRADING COMPANY,855B,DHAURPUR,5230.00,,1100.000,0,5753000.00,,,1,
119,100000000.00,NAAZ TRADING COMPANY,811B,CHHINDAND,5430.00,,1600.000,0,8688000.00,,,1,
119,100000000.00,NAAZ TRADING COMPANY,783,KASTURA,5530.00,,1800.000,0,9954000.00,,,1,
119,100000000.00,NAAZ TRADING COMPANY,851,DHOOR,6530.00,,2600.000,0,16978000.00,,,1,
119,100000000.00,NAAZ TRADING COMPANY,852,BASNARA,6530.00,,2000.000,0,13060000.00,,,1,
119,100000000.00,NAAZ TRADING COMPANY,793,GHUTRA,6730.00,,3000.000,0,20190000.00,,,1,
119,100000000.00,NAAZ TRADING COMPANY,794,KACHHAUD,6630.00,,2200.000,0,14586000.00,,,1,
119,100000000.00,NAAZ TRADING COMPANY,855A,DHAURPUR,5230.00,,2000.000,0,10460000.00,,,1,
122,81250000.00,NOOR TRADERS BEEDI(NUR BIDI),113A,NARAYANPUR,5002.00,,1600.000,0,8003200.00,,,1,NUR
123,125000000.00,NUR BIRI WORKS(NUR BIDI),542,KHONGSARA,7539.00,,1000.000,0,7539000.00,,,1,NUR
123,125000000.00,NUR BIRI WORKS(NUR BIDI),756,CHOTIA,7839.00,,1700.000,0,13326300.00,,,1,NUR
124,62500000.00,O2 INDIA PRIVATE LIMITED,198,PACHANGI,6649.00,,1700.000,0,11303300.00,,,1,
124,62500000.00,O2 INDIA PRIVATE LIMITED,237,KAMANSUR,7522.00,,2300.000,0,17300600.00,,,1,
125,80000000.00,OM ENTERPRISE,631,"KUDEKELA, BEHERAMAR",6650.00,,1500.000,0,9975000.00,,,1,
125,80000000.00,OM ENTERPRISE,634,TOLGE,6830.00,,1400.000,0,9562000.00,,,1,
125,80000000.00,OM ENTERPRISE,635,KILKILA,5320.00,,1600.000,0,8512000.00,,,1,
125,80000000.00,OM ENTERPRISE,795,KELHARI,5830.00,,3000.000,0,17490000.00,,,1,
125,80000000.00,OM ENTERPRISE,796,RANPA,5650.00,,2600.000,0,14690000.00,,,1,
127,38750000.00,PARAS ENTERPRISE,300,BANJARI,6516.00,,700.000,0,4561200.00,,,1,
127,38750000.00,PARAS ENTERPRISE,301,GAINJI,6363.00,,1800.000,0,11453400.00,,,1,
127,38750000.00,PARAS ENTERPRISE,293,MATHENA,6228.00,,1300.000,0,8096400.00,,,1,
127,38750000.00,PARAS ENTERPRISE,306,LOHARA,5544.00,,1500.000,0,8316000.00,,,1,
131,1375000000.00,PATAKA  IND(PATAKA),367,GOURGAON,8352.00,,1300.000,0,10857600.00,,,1,PATAKA
131,1375000000.00,PATAKA  IND(PATAKA),368,ADGADI,8640.00,,900.000,0,7776000.00,,,1,PATAKA
131,1375000000.00,PATAKA  IND(PATAKA),369,"TOURENGA,BHATADIGGI",8325.00,,1100.000,0,9157500.00,,,1,PATAKA
131,1375000000.00,PATAKA  IND(PATAKA),371,BARDULA,8080.00,,1300.000,0,10504000.00,,,1,PATAKA
131,1375000000.00,PATAKA  IND(PATAKA),228,HALORA,8107.00,,1500.000,0,12160500.00,,,1,PATAKA
131,1375000000.00,PATAKA  IND(PATAKA),229,"KOHKA,KHAIRKATTA",7963.00,,2200.000,0,17518600.00,,,1,PATAKA
131,1375000000.00,PATAKA  IND(PATAKA),126A,SIKSOD,7911.00,,1600.000,0,12657600.00,,,1,PATAKA
131,1375000000.00,PATAKA  IND(PATAKA),126B,SIKSOD,7911.00,,1800.000,0,14239800.00,,,1,PATAKA
131,1375000000.00,PATAKA  IND(PATAKA),129,SUREWAHI,7830.00,,2300.000,0,18009000.00,,,1,PATAKA
131,1375000000.00,PATAKA  IND(PATAKA),162A,CHARGAON,7176.00,,1500.000,0,10764000.00,,,1,PATAKA
131,1375000000.00,PATAKA  IND(PATAKA),162B,CHARGAON,7426.00,,1800.000,0,13366800.00,,,1,PATAKA
131,1375000000.00,PATAKA  IND(PATAKA),163,MANHAKAL,7363.00,,2600.000,0,19143800.00,,,1,PATAKA
131,1375000000.00,PATAKA  IND(PATAKA),438,BOKARAMUDA,7920.00,,2300.000,0,18216000.00,,,1,PATAKA
131,1375000000.00,PATAKA  IND(PATAKA),200,KORAR,7630.00,,3700.000,0,28231000.00,,,1,PATAKA
131,1375000000.00,PATAKA  IND(PATAKA),298,TEKAPAR,6847.00,,2100.000,0,14378700.00,,,1,PATAKA
131,1375000000.00,PATAKA  IND(PATAKA),379,KASABAI,8181.00,,1000.000,0,8181000.00,,,1,PATAKA
131,1375000000.00,PATAKA  IND(PATAKA),380,NAWAGARH,8136.00,,1000.000,0,8136000.00,,,1,PATAKA
131,1375000000.00,PATAKA  IND(PATAKA),231,GHOTIYA,7963.00,,2000.000,0,15926000.00,,,1,PATAKA
131,1375000000.00,PATAKA  IND(PATAKA),252A,BHOJTOLA,7920.00,,1400.000,0,11088000.00,,,1,PATAKA
131,1375000000.00,PATAKA  IND(PATAKA),252B,BHOJTOLA,7902.00,,2000.000,0,15804000.00,,,1,PATAKA
131,1375000000.00,PATAKA  IND(PATAKA),138,GUMRIDIH,7740.00,,1600.000,0,12384000.00,,,1,PATAKA
131,1375000000.00,PATAKA  IND(PATAKA),140,SADHUMICHGAON,7704.00,,1600.000,0,12326400.00,,,1,PATAKA
131,1375000000.00,PATAKA  IND(PATAKA),143,KODEKURSE,7063.00,,1500.000,0,10594500.00,,,1,PATAKA
131,1375000000.00,PATAKA  IND(PATAKA),144,SURANGDOHE,8107.00,,2900.000,0,23510300.00,,,1,PATAKA
131,1375000000.00,PATAKA  IND(PATAKA),655,POTIA,7306.00,,2000.000,0,14612000.00,,,1,PATAKA
131,1375000000.00,PATAKA  IND(PATAKA),432,RAITUM,7470.00,,2000.000,0,14940000.00,,,1,PATAKA
131,1375000000.00,PATAKA  IND(PATAKA),435,DHOURABHATA,7783.00,,1400.000,0,10896200.00,,,1,PATAKA
131,1375000000.00,PATAKA  IND(PATAKA),427,MOHANDI,6930.00,,2500.000,0,17325000.00,,,1,PATAKA
131,1375000000.00,PATAKA  IND(PATAKA),439,BAGBAHARA,7036.00,,1800.000,0,12664800.00,,,1,PATAKA
131,1375000000.00,PATAKA  IND(PATAKA),430,PATEWA,7063.00,,1300.000,0,9181900.00,,,1,PATAKA
131,1375000000.00,PATAKA  IND(PATAKA),381,DARRIPARA,7756.00,,900.000,0,6980400.00,,,1,PATAKA
131,1375000000.00,PATAKA  IND(PATAKA),234,NEDGAON,7606.00,,1800.000,0,13690800.00,,,1,PATAKA
131,1375000000.00,PATAKA  IND(PATAKA),235,IRRAGAON,7706.00,,1500.000,0,11559000.00,,,1,PATAKA
131,1375000000.00,PATAKA  IND(PATAKA),645,GUNU,6519.00,,2700.000,0,17601300.00,,,1,PATAKA
131,1375000000.00,PATAKA  IND(PATAKA),136,CHIKHLY,7406.00,,2600.000,0,19255600.00,,,1,PATAKA
131,1375000000.00,PATAKA  IND(PATAKA),118,BHAISGAON,6804.00,,1200.000,0,8164800.00,,,1,PATAKA
131,1375000000.00,PATAKA  IND(PATAKA),122A,SARANDI,7236.00,,1500.000,0,10854000.00,,,1,PATAKA
131,1375000000.00,PATAKA  IND(PATAKA),122C,KALEPARAS,7363.00,,2700.000,0,19880100.00,,,1,PATAKA
131,1375000000.00,PATAKA  IND(PATAKA),124,USELY,7236.00,,2400.000,0,17366400.00,,,1,PATAKA
131,1375000000.00,PATAKA  IND(PATAKA),122B,SARANDI,7506.00,,1100.000,0,8256600.00,,,1,PATAKA
131,1375000000.00,PATAKA  IND(PATAKA),161A,JUNAGAWADEGAON,7473.00,,2000.000,0,14946000.00,,,1,PATAKA
131,1375000000.00,PATAKA  IND(PATAKA),161B,JUNAGAWDEGAON,7363.00,,1700.000,0,12517100.00,,,1,PATAKA
131,1375000000.00,PATAKA  IND(PATAKA),127A,ANTAGARH,6903.00,,1400.000,0,9664200.00,,,1,PATAKA
131,1375000000.00,PATAKA  IND(PATAKA),127B,ANTAGARH,6903.00,,1700.000,0,11735100.00,,,1,PATAKA
131,1375000000.00,PATAKA  IND(PATAKA),402,PARSULI,7720.00,,1900.000,0,14668000.00,,,1,PATAKA
131,1375000000.00,PATAKA  IND(PATAKA),332,RATAWA,6940.00,,1000.000,0,6940000.00,,,1,PATAKA
131,1375000000.00,PATAKA  IND(PATAKA),336,GATTASILLI,6676.00,,1000.000,0,6676000.00,,,1,PATAKA
131,1375000000.00,PATAKA  IND(PATAKA),337,RAJPUR,6750.00,,1300.000,0,8775000.00,,,1,PATAKA
131,1375000000.00,PATAKA  IND(PATAKA),344,"CHANAGAON, DOKAL",6840.00,,2000.000,0,13680000.00,,,1,PATAKA
131,1375000000.00,PATAKA  IND(PATAKA),550,"KHODRI,SADHAWANI",7136.00,,2000.000,0,14272000.00,,,1,PATAKA
131,1375000000.00,PATAKA  IND(PATAKA),444,TUSDA,6406.00,,1800.000,0,11530800.00,,,1,PATAKA
131,1375000000.00,PATAKA  IND(PATAKA),447,"KHALLARI, CHARODA",6705.00,,2800.000,0,18774000.00,,,1,PATAKA
131,1375000000.00,PATAKA  IND(PATAKA),426,MAHASAMUND,6714.00,,1600.000,0,10742400.00,,,1,PATAKA
131,1375000000.00,PATAKA  IND(PATAKA),294,BHARRITOLA,6271.00,,1500.000,0,9406500.00,,,1,PATAKA
131,1375000000.00,PATAKA  IND(PATAKA),397,RASELA,7864.00,,1800.000,0,14155200.00,,,1,PATAKA
131,1375000000.00,PATAKA  IND(PATAKA),413,PATSIWANI,7560.00,,1300.000,0,9828000.00,,,1,PATAKA
131,1375000000.00,PATAKA  IND(PATAKA),405,TENGNABASA,7630.00,,1600.000,0,12208000.00,,,1,PATAKA
131,1375000000.00,PATAKA  IND(PATAKA),131A,PONDGAON,6840.00,,1500.000,0,10260000.00,,,1,PATAKA
131,1375000000.00,PATAKA  IND(PATAKA),131B,PONDGAON,7036.00,,1500.000,0,10554000.00,,,1,PATAKA
131,1375000000.00,PATAKA  IND(PATAKA),153A,BHIRAGAON,7740.00,,1400.000,0,10836000.00,,,1,PATAKA
131,1375000000.00,PATAKA  IND(PATAKA),153B,BHIRAGAON,7720.00,,1600.000,0,12352000.00,,,1,PATAKA
131,1375000000.00,PATAKA  IND(PATAKA),159B,DHUNTA,7473.00,,1800.000,0,13451400.00,,,1,PATAKA
131,1375000000.00,PATAKA  IND(PATAKA),717,CHUIYA,6829.00,,1100.000,0,7511900.00,,,1,PATAKA
131,1375000000.00,PATAKA  IND(PATAKA),434,PARSULI,6372.00,,900.000,0,5734800.00,,,1,PATAKA
131,1375000000.00,PATAKA  IND(PATAKA),476,"JABALPUR, ARANGI",6460.00,,2300.000,0,14858000.00,,,1,PATAKA
131,1375000000.00,PATAKA  IND(PATAKA),295,KUSUMKASA,6377.00,,1400.000,0,8927800.00,,,1,PATAKA
131,1375000000.00,PATAKA  IND(PATAKA),241,RAMGARH,7163.00,,2000.000,0,14326000.00,,,1,PATAKA
131,1375000000.00,PATAKA  IND(PATAKA),243,PARASGHAT,7363.00,,2100.000,0,15462300.00,,,1,PATAKA
131,1375000000.00,PATAKA  IND(PATAKA),404,AMJHAR,6804.00,,1000.000,0,6804000.00,,,1,PATAKA
131,1375000000.00,PATAKA  IND(PATAKA),406,CHHURA,7063.00,,1600.000,0,11300800.00,,,1,PATAKA
131,1375000000.00,PATAKA  IND(PATAKA),416,"KHADMA, GAYDABARI",6874.00,,2000.000,0,13748000.00,,,1,PATAKA
131,1375000000.00,PATAKA  IND(PATAKA),626,LOTAN,6964.00,,1000.000,0,6964000.00,,,1,PATAKA
131,1375000000.00,PATAKA  IND(PATAKA),638,NAHARKELA,7036.00,,1300.000,0,9146800.00,,,1,PATAKA
131,1375000000.00,PATAKA  IND(PATAKA),639,PUTHAHAMUDA,6633.00,,1100.000,0,7296300.00,,,1,PATAKA
131,1375000000.00,PATAKA  IND(PATAKA),660,WAYASI,6615.00,,1300.000,0,8599500.00,,,1,PATAKA
131,1375000000.00,PATAKA  IND(PATAKA),330,AMALI,6750.00,,1100.000,0,7425000.00,,,1,PATAKA
131,1375000000.00,PATAKA  IND(PATAKA),331,NAGRI,6408.00,,1200.000,0,7689600.00,,,1,PATAKA
131,1375000000.00,PATAKA  IND(PATAKA),346,BIRJHULI,6840.00,,1000.000,0,6840000.00,,,1,PATAKA
131,1375000000.00,PATAKA  IND(PATAKA),349,PATHAR,6660.00,,900.000,0,5994000.00,,,1,PATAKA
131,1375000000.00,PATAKA  IND(PATAKA),130,BHAISASUR,7226.00,,2300.000,0,16619800.00,,,1,PATAKA
131,1375000000.00,PATAKA  IND(PATAKA),135,MEDO,7236.00,,1900.000,0,13748400.00,,,1,PATAKA
131,1375000000.00,PATAKA  IND(PATAKA),141A,DURGUKONDAL,7207.00,,1800.000,0,12972600.00,,,1,PATAKA
131,1375000000.00,PATAKA  IND(PATAKA),145,GODAPAL,6804.00,,1600.000,0,10886400.00,,,1,PATAKA
131,1375000000.00,PATAKA  IND(PATAKA),151,HATKONDAL,7126.00,,2500.000,0,17815000.00,,,1,PATAKA
131,1375000000.00,PATAKA  IND(PATAKA),152A,AASULKHAR,7263.00,,1400.000,0,10168200.00,,,1,PATAKA
131,1375000000.00,PATAKA  IND(PATAKA),152B,AASULKHAR,7307.00,,1500.000,0,10960500.00,,,1,PATAKA
131,1375000000.00,PATAKA  IND(PATAKA),302A,GHOTIA,6271.00,,1600.000,0,10033600.00,,,1,PATAKA
131,1375000000.00,PATAKA  IND(PATAKA),302B,GHOTIA,5940.00,,800.000,0,4752000.00,,,1,PATAKA
131,1375000000.00,PATAKA  IND(PATAKA),220,SARKHEDA,6806.00,,2500.000,0,17015000.00,,,1,PATAKA
131,1375000000.00,PATAKA  IND(PATAKA),221,SHARDA,6863.00,,2600.000,0,17843800.00,,,1,PATAKA
131,1375000000.00,PATAKA  IND(PATAKA),372,MAINPURKALA,6460.00,,1200.000,0,7752000.00,,,1,PATAKA
131,1375000000.00,PATAKA  IND(PATAKA),374,MAINPUR KHURD,6451.00,,1000.000,0,6451000.00,,,1,PATAKA
131,1375000000.00,PATAKA  IND(PATAKA),386,CHHINDOLA,6750.00,,1000.000,0,6750000.00,,,1,PATAKA
131,1375000000.00,PATAKA  IND(PATAKA),387,"BEHERABUDA, GARIABAN",6433.00,,1600.000,0,10292800.00,,,1,PATAKA
131,1375000000.00,PATAKA  IND(PATAKA),418,BARUKA,6280.00,,600.000,0,3768000.00,,,1,PATAKA
131,1375000000.00,PATAKA  IND(PATAKA),394,MAHUABHATA,7783.00,,1300.000,0,10117900.00,,,1,PATAKA
131,1375000000.00,PATAKA  IND(PATAKA),350A,MOHDI,6507.00,,700.000,0,4554900.00,,,1,PATAKA
131,1375000000.00,PATAKA  IND(PATAKA),350B,MOHDI,6703.00,,1000.000,0,6703000.00,,,1,PATAKA
131,1375000000.00,PATAKA  IND(PATAKA),351A,CHHUHI,6604.00,,1500.000,0,9906000.00,,,1,PATAKA
131,1375000000.00,PATAKA  IND(PATAKA),351B,CHHUHI,6604.00,,1000.000,0,6604000.00,,,1,PATAKA
131,1375000000.00,PATAKA  IND(PATAKA),236,BHARRITOLA,6730.00,,1700.000,0,11441000.00,,,1,PATAKA
131,1375000000.00,PATAKA  IND(PATAKA),188,BADGAON,7462.00,,2500.000,0,18655000.00,,,1,PATAKA
131,1375000000.00,PATAKA  IND(PATAKA),450,KOLDA,7063.00,,1100.000,0,7769300.00,,,1,PATAKA
131,1375000000.00,PATAKA  IND(PATAKA),457,RAJASEWAIYA,6750.00,,1200.000,0,8100000.00,,,1,PATAKA
131,1375000000.00,PATAKA  IND(PATAKA),458,KISHANPUR,6577.00,,800.000,0,5261600.00,,,1,PATAKA
131,1375000000.00,PATAKA  IND(PATAKA),461,BALDIDIH,6784.00,,700.000,0,4748800.00,,,1,PATAKA
131,1375000000.00,PATAKA  IND(PATAKA),424,GONDPALI,6910.00,,600.000,0,4146000.00,,,1,PATAKA
131,1375000000.00,PATAKA  IND(PATAKA),680,KAPU,6570.00,,1400.000,0,9198000.00,,,1,PATAKA
131,1375000000.00,PATAKA  IND(PATAKA),545,"KATRA, MAJHGANWA",6840.00,,2000.000,0,13680000.00,,,1,PATAKA
131,1375000000.00,PATAKA  IND(PATAKA),551,KEONCHI,7136.00,,1300.000,0,9276800.00,,,1,PATAKA
131,1375000000.00,PATAKA  IND(PATAKA),513,"BILAIGARH, ARJUNI",6037.00,,2400.000,0,14488800.00,,,1,PATAKA
131,1375000000.00,PATAKA  IND(PATAKA),515,"NAWAGAON, BORSI",6372.00,,2600.000,0,16567200.00,,,1,PATAKA
131,1375000000.00,PATAKA  IND(PATAKA),291,DONDI,5805.00,,2000.000,0,11610000.00,,,1,PATAKA
131,1375000000.00,PATAKA  IND(PATAKA),472,VIJAYMAL,6406.00,,1200.000,0,7687200.00,,,1,PATAKA
131,1375000000.00,PATAKA  IND(PATAKA),475,DEVTARAI,6073.00,,1500.000,0,9109500.00,,,1,PATAKA
131,1375000000.00,PATAKA  IND(PATAKA),449,SUKHARIDABARI,6471.00,,1600.000,0,10353600.00,,,1,PATAKA
131,1375000000.00,PATAKA  IND(PATAKA),687,"SENDRIPALI,NONBIRRA",6327.00,,2000.000,0,12654000.00,,,1,PATAKA
131,1375000000.00,PATAKA  IND(PATAKA),209,DEORI,6037.00,,1600.000,0,9659200.00,,,1,PATAKA
131,1375000000.00,PATAKA  IND(PATAKA),341,GEDRA,5850.00,,700.000,0,4095000.00,,,1,PATAKA
131,1375000000.00,PATAKA  IND(PATAKA),629,CHHAL,5661.00,,700.000,0,3962700.00,,,1,PATAKA
1,200000000.00,RADHA KISHAN TENDU(KISAN),676,RAIMER,10093.00,,1900.000,0,19176700.00,,,1,DESAI
1,200000000.00,RADHA KISHAN TENDU(KISAN),667,UD-UDA,10093.00,,1400.000,0,14130200.00,,,1,DESAI
1,200000000.00,RADHA KISHAN TENDU(KISAN),666,"SHAHPUR,BHANWARKHOL",10093.00,,2300.000,0,23213900.00,,,1,DESAI
1,200000000.00,RADHA KISHAN TENDU(KISAN),632,MUNUND,8349.00,,1200.000,0,10018800.00,,,1,DESAI
1,200000000.00,RADHA KISHAN TENDU(KISAN),673,CHUNCHUNIDAND,9159.00,,1500.000,0,13738500.00,,,1,DESAI
1,200000000.00,RADHA KISHAN TENDU(KISAN),674,JABGA,10093.00,,1300.000,0,13120900.00,,,1,DESAI
1,200000000.00,RADHA KISHAN TENDU(KISAN),662,DHODAGAON,8320.00,,1200.000,0,9984000.00,,,1,DESAI
1,200000000.00,RADHA KISHAN TENDU(KISAN),683,KUMRATA,6809.00,,2200.000,0,14979800.00,,,1,DESAI
1,200000000.00,RADHA KISHAN TENDU(KISAN),679,KAMRAI,7309.00,,1600.000,0,11694400.00,,,1,DESAI
1,200000000.00,RADHA KISHAN TENDU(KISAN),661,NARKALO,8749.00,,900.000,0,7874100.00,,,1,DESAI
1,200000000.00,RADHA KISHAN TENDU(KISAN),613,KARICHAPAR,7159.00,,1500.000,0,10738500.00,,,1,DESAI
1,200000000.00,RADHA KISHAN TENDU(KISAN),669,RAIRUMA,8320.00,,2400.000,0,19968000.00,,,1,DESAI
1,200000000.00,RADHA KISHAN TENDU(KISAN),747,TANAKHAR,7949.00,,2000.000,0,15898000.00,,,1,DESAI
1,200000000.00,RADHA KISHAN TENDU(KISAN),693,KOTMER,7159.00,,1200.000,0,8590800.00,,,1,DESAI
134,150000000.00,R.T.PAUL,711,THAKURKHETA,8119.00,,1900.000,0,15426100.00,,,1,
134,150000000.00,R.T.PAUL,716,VIMALATA,8129.00,,1400.000,0,11380600.00,,,1,
139,45000000.00,RRR TRADING COMPANY,868,CHANDO,5529.00,,4000.000,0,22116000.00,,,1,
139,45000000.00,RRR TRADING COMPANY,529,LORMI,5560.00,,2100.000,0,11676000.00,,,1,
96,60000000.00,S S ASLAM & CO(DESAI),376,DHAWALPUR,6019.00,,1400.000,0,8426600.00,,,1,DESAI
96,60000000.00,S S ASLAM & CO(DESAI),378,BEGARPALA,6839.00,,1600.000,0,10942400.00,,,1,DESAI
96,60000000.00,S S ASLAM & CO(DESAI),419,POND,6819.00,,1400.000,0,9546600.00,,,1,DESAI
143,102500000.00,S.J. & S.P. FAMILY(TELE),556,CHUKTIPANI,6659.00,,1000.000,0,6659000.00,,,1,TELE
143,102500000.00,S.J. & S.P. FAMILY(TELE),553,AMARU,6229.00,,1200.000,0,7474800.00,,,1,TELE
143,102500000.00,S.J. & S.P. FAMILY(TELE),554,KOTMI,5839.00,,2000.000,0,11678000.00,,,1,TELE
143,102500000.00,S.J. & S.P. FAMILY(TELE),557,DAHIBAHARA,6109.00,,1400.000,0,8552600.00,,,1,TELE
143,102500000.00,S.J. & S.P. FAMILY(TELE),546,CHHATAONA,6269.00,,1200.000,0,7522800.00,,,1,TELE
143,102500000.00,S.J. & S.P. FAMILY(TELE),534,KHAIRA,5319.00,,2000.000,0,10638000.00,,,1,TELE
143,102500000.00,S.J. & S.P. FAMILY(TELE),526,NEERTU,5349.00,,2000.000,0,10698000.00,,,1,TELE
143,102500000.00,S.J. & S.P. FAMILY(TELE),527,BELTARA,5349.00,,1700.000,0,9093300.00,,,1,TELE
143,102500000.00,S.J. & S.P. FAMILY(TELE),525,THARAKPUR,5009.00,,1200.000,0,6010800.00,,,1,TELE
143,102500000.00,S.J. & S.P. FAMILY(TELE),320B,PANDARIA,5539.00,,1300.000,0,7200700.00,,,1,TELE
143,102500000.00,S.J. & S.P. FAMILY(TELE),320A,PANDARIA,5609.00,,1800.000,0,10096200.00,,,1,TELE
143,102500000.00,S.J. & S.P. FAMILY(TELE),311,CHOTUPARA,5169.00,,1200.000,0,6202800.00,,,1,TELE
113,81337500.00,MS SADAT TRADERS,412,MONGRA,8505.00,,1300.000,0,11056500.00,,,1,
113,81337500.00,MS SADAT TRADERS,411,DADARGAON,8505.00,,1500.000,0,12757500.00,,,1,
113,81337500.00,MS SADAT TRADERS,390,GUJRA,8379.00,,1400.000,0,11730600.00,,,1,
113,81337500.00,MS SADAT TRADERS,399,HIRABATAR,8136.00,,1500.000,0,12204000.00,,,1,
113,81337500.00,MS SADAT TRADERS,400,KAMRAJ,8379.00,,1800.000,0,15082200.00,,,1,
113,81337500.00,MS SADAT TRADERS,391,"TENDUBAI, LOHARI",8262.00,,1500.000,0,12393000.00,,,1,
144,175000000.00,SAHA BROTHERS(KISAN),401,MADANPUR,8509.00,,1500.000,0,12763500.00,,,1,KISAN
144,175000000.00,SAHA BROTHERS(KISAN),403,KOCHBAI,7999.00,,1800.000,0,14398200.00,,,1,KISAN
144,175000000.00,SAHA BROTHERS(KISAN),414,"AKALWARA, AMETHI",7909.00,,2600.000,0,20563400.00,,,1,KISAN
144,175000000.00,SAHA BROTHERS(KISAN),384,"BENDKURA, MARODA",7309.00,,1400.000,0,10232600.00,,,1,KISAN
144,175000000.00,SAHA BROTHERS(KISAN),389,NAGABUDA,7899.00,,1200.000,0,9478800.00,,,1,KISAN
144,175000000.00,SAHA BROTHERS(KISAN),453,BHURKONI,7309.00,,900.000,0,6578100.00,,,1,KISAN
144,175000000.00,SAHA BROTHERS(KISAN),462,BAREKEL,7109.00,,1200.000,0,8530800.00,,,1,KISAN
144,175000000.00,SAHA BROTHERS(KISAN),452,BUNDELI,7109.00,,1200.000,0,8530800.00,,,1,KISAN
144,175000000.00,SAHA BROTHERS(KISAN),466,LARIPUR,7499.00,,1400.000,0,10498600.00,,,1,KISAN
144,175000000.00,SAHA BROTHERS(KISAN),463,"GIRNA,SUKHIPALI",6709.00,,2000.000,0,13418000.00,,,1,KISAN
144,175000000.00,SAHA BROTHERS(KISAN),451,PARSADA,7009.00,,900.000,0,6308100.00,,,1,KISAN
144,175000000.00,SAHA BROTHERS(KISAN),470,SANKRA,7309.00,,1300.000,0,9501700.00,,,1,KISAN
144,175000000.00,SAHA BROTHERS(KISAN),446,AMAKONI,7839.00,,1500.000,0,11758500.00,,,1,KISAN
144,175000000.00,SAHA BROTHERS(KISAN),702,KUDMURA,7759.00,,1300.000,0,10086700.00,,,1,KISAN
144,175000000.00,SAHA BROTHERS(KISAN),640,HATI,7609.00,,1800.000,0,13696200.00,,,1,KISAN
144,175000000.00,SAHA BROTHERS(KISAN),468,CHHOTELORAM,6909.00,,1000.000,0,6909000.00,,,1,KISAN
145,50000000.00,SAKSHI ENTERPRISES,360,INDAGAON,7301.00,,1800.000,0,13141800.00,,,1,
145,50000000.00,SAKSHI ENTERPRISES,363,"CHIKHLI,PIPALKHUTA",6605.00,,1500.000,0,9907500.00,,,1,
145,50000000.00,SAKSHI ENTERPRISES,359,DHURVAGUDI,6101.00,,1900.000,0,11591900.00,,,1,
145,50000000.00,SAKSHI ENTERPRISES,366,GONA,7301.00,,1700.000,0,12411700.00,,,1,
149,15000000.00,SHAKTI SWAROOP ENTERPRISES,12B,CHEPALLI,7497.00,,1800.000,0,13494600.00,,,1,
150,38750000.00,SHIGANESHENTERPRISES,6A,PUSNAR,6012.00,,2400.000,0,14428800.00,,,1,
152,75000000.00,SHIV SHAKTI ENTERPRISES,774,LAWAKERA,6797.00,,2100.000,0,14273700.00,,,1,
152,75000000.00,SHIV SHAKTI ENTERPRISES,775,TAPKARA,6487.00,,1900.000,0,12325300.00,,,1,
152,75000000.00,SHIV SHAKTI ENTERPRISES,777,KERSAI,6437.00,,1900.000,0,12230300.00,,,1,
152,75000000.00,SHIV SHAKTI ENTERPRISES,776,PANDRIPANI,6347.00,,1300.000,0,8251100.00,,,1,
152,75000000.00,SHIV SHAKTI ENTERPRISES,768,BAGBAHAR,6337.00,,2300.000,0,14575100.00,,,1,
152,75000000.00,SHIV SHAKTI ENTERPRISES,766,"PATHALGAON, LUDEG",6347.00,,1300.000,0,8251100.00,,,1,
97,150000000.00,SHIV TRADING CO(SHIV BIRI),180,ADAFARSHI,7189.00,,2100.000,0,15096900.00,,,1,SHIV
97,150000000.00,SHIV TRADING CO(SHIV BIRI),146,KARAKI,8429.00,,1100.000,0,9271900.00,,,1,SHIV
97,150000000.00,SHIV TRADING CO(SHIV BIRI),147,KONDRUNJ,8429.00,,1300.000,0,10957700.00,,,1,SHIV
97,150000000.00,SHIV TRADING CO(SHIV BIRI),142,KARKAPAL,8499.00,,2400.000,0,20397600.00,,,1,SHIV
97,150000000.00,SHIV TRADING CO(SHIV BIRI),137,HIMMTWAHI,8499.00,,1900.000,0,16148100.00,,,1,SHIV
97,150000000.00,SHIV TRADING CO(SHIV BIRI),128,TEMRRUPANI,7999.00,,2500.000,0,19997500.00,,,1,SHIV
97,150000000.00,SHIV TRADING CO(SHIV BIRI),132,JETHEGAON,7899.00,,1600.000,0,12638400.00,,,1,SHIV
97,150000000.00,SHIV TRADING CO(SHIV BIRI),190,MENDRA,7999.00,,2100.000,0,16797900.00,,,1,SHIV
97,150000000.00,SHIV TRADING CO(SHIV BIRI),125A,KALGAON,8109.00,,1500.000,0,12163500.00,,,1,SHIV
97,150000000.00,SHIV TRADING CO(SHIV BIRI),125B,KALGAON,8109.00,,1300.000,0,10541700.00,,,1,SHIV
153,170000000.00,SHREE DHANLAXMI(TELE),663,RAJPUR,5919.00,,900.000,0,5327100.00,,,1,TELE
153,170000000.00,SHREE DHANLAXMI(TELE),670,BAGUDEGA,5739.00,,1700.000,0,9756300.00,,,1,TELE
153,170000000.00,SHREE DHANLAXMI(TELE),641,"SITHRA, BARTAPALI",6809.00,,2300.000,0,15660700.00,,,1,TELE
153,170000000.00,SHREE DHANLAXMI(TELE),657,"PAHADLUDEG,LAILUNGA",6129.00,,2300.000,0,14096700.00,,,1,TELE
153,170000000.00,SHREE DHANLAXMI(TELE),672,SAJAPALI,7569.00,,2600.000,0,19679400.00,,,1,TELE
153,170000000.00,SHREE DHANLAXMI(TELE),677,KHAMHAR,6959.00,,1900.000,0,13222100.00,,,1,TELE
153,170000000.00,SHREE DHANLAXMI(TELE),653,"SEMIPALI, KHADGAON",6879.00,,1900.000,0,13070100.00,,,1,TELE
153,170000000.00,SHREE DHANLAXMI(TELE),627,KATAIPALI,7019.00,,1200.000,0,8422800.00,,,1,TELE
153,170000000.00,SHREE DHANLAXMI(TELE),628,BOJIA,6969.00,,1200.000,0,8362800.00,,,1,TELE
153,170000000.00,SHREE DHANLAXMI(TELE),678,BHOJPUR,6669.00,,1000.000,0,6669000.00,,,1,TELE
155,160000000.00,SHREE PRAHLAD(TELE),506,CHANDAN,6509.00,,1400.000,0,9112600.00,,,1,TELE
155,160000000.00,SHREE PRAHLAD(TELE),433,CHUHRI,6349.00,,1300.000,0,8253700.00,,,1,TELE
155,160000000.00,SHREE PRAHLAD(TELE),486,CHANAT,5859.00,,1600.000,0,9374400.00,,,1,TELE
155,160000000.00,SHREE PRAHLAD(TELE),456,ARAND,5919.00,,900.000,0,5327100.00,,,1,TELE
155,160000000.00,SHREE PRAHLAD(TELE),511,"BHATGAON, MANPASAR",5429.00,,2100.000,0,11400900.00,,,1,TELE
155,160000000.00,SHREE PRAHLAD(TELE),429,BAVANKERA,5409.00,,1300.000,0,7031700.00,,,1,TELE
155,160000000.00,SHREE PRAHLAD(TELE),622,"BAROUD, PORDI",5939.00,,2200.000,0,13065800.00,,,1,TELE
155,160000000.00,SHREE PRAHLAD(TELE),585,"KUKURDA, JAMGAON",6119.00,,2000.000,0,12238000.00,,,1,TELE
155,160000000.00,SHREE PRAHLAD(TELE),621,KUDUMKELA,5939.00,,1500.000,0,8908500.00,,,1,TELE
155,160000000.00,SHREE PRAHLAD(TELE),579,"SALAR, BATAUPALI",5829.00,,1600.000,0,9326400.00,,,1,TELE
155,160000000.00,SHREE PRAHLAD(TELE),737,"KODAR, JEMRA",7119.00,,2000.000,0,14238000.00,,,1,TELE
155,160000000.00,SHREE PRAHLAD(TELE),750,RAWA,7549.00,,2200.000,0,16607800.00,,,1,TELE
155,160000000.00,SHREE PRAHLAD(TELE),752,GURSIA,7729.00,,2100.000,0,16230900.00,,,1,TELE
155,160000000.00,SHREE PRAHLAD(TELE),731,NUNERA,5869.00,,1600.000,0,9390400.00,,,1,TELE
155,160000000.00,SHREE PRAHLAD(TELE),728,RATIJA,5769.00,,1600.000,0,9230400.00,,,1,TELE
156,150000000.00,SHREE REVA PRABHU(TELE),688,BEHARCHUWA,6379.00,,1600.000,0,10206400.00,,,1,TELE
156,150000000.00,SHREE REVA PRABHU(TELE),692,"BADMAR, KARTALA",7059.00,,2200.000,0,15529800.00,,,1,TELE
156,150000000.00,SHREE REVA PRABHU(TELE),698,BUNDELI,6839.00,,2300.000,0,15729700.00,,,1,TELE
156,150000000.00,SHREE REVA PRABHU(TELE),706,BATATI,7249.00,,2000.000,0,14498000.00,,,1,TELE
156,150000000.00,SHREE REVA PRABHU(TELE),690,"NONDARHA,CHARMAR",6269.00,,1200.000,0,7522800.00,,,1,TELE
156,150000000.00,SHREE REVA PRABHU(TELE),689,RAMPUR,6579.00,,1000.000,0,6579000.00,,,1,TELE
156,150000000.00,SHREE REVA PRABHU(TELE),614,RODOPALI,6229.00,,2100.000,0,13080900.00,,,1,TELE
156,150000000.00,SHREE REVA PRABHU(TELE),603,JOBI/BARRA,6239.00,,1500.000,0,9358500.00,,,1,TELE
156,150000000.00,SHREE REVA PRABHU(TELE),604,CHARMAR,7029.00,,1000.000,0,7029000.00,,,1,TELE
156,150000000.00,SHREE REVA PRABHU(TELE),704A,KOLGA,7439.00,,1400.000,0,10414600.00,,,1,TELE
156,150000000.00,SHREE REVA PRABHU(TELE),543,KURWAR,6289.00,,2000.000,0,12578000.00,,,1,TELE
156,150000000.00,SHREE REVA PRABHU(TELE),537,SEMARIYA,5849.00,,2100.000,0,12282900.00,,,1,TELE
156,150000000.00,SHREE REVA PRABHU(TELE),544,KENDA,5659.00,,1100.000,0,6224900.00,,,1,TELE
157,170000000.00,SHREE SIDDHI VINAYAK(TELE),742,IRAF,6489.00,,1600.000,0,10382400.00,,,1,TELE
157,170000000.00,SHREE SIDDHI VINAYAK(TELE),761,JALKE TANERA,6889.00,,3000.000,0,20667000.00,,,1,TELE
157,170000000.00,SHREE SIDDHI VINAYAK(TELE),735,SILLI,6219.00,,1700.000,0,10572300.00,,,1,TELE
157,170000000.00,SHREE SIDDHI VINAYAK(TELE),765,PALI(BUDHA),5769.00,,2200.000,0,12691800.00,,,1,TELE
157,170000000.00,SHREE SIDDHI VINAYAK(TELE),741,CHATUABHAUNA,7019.00,,1400.000,0,9826600.00,,,1,TELE
157,170000000.00,SHREE SIDDHI VINAYAK(TELE),762,PIPARIA,6309.00,,2000.000,0,12618000.00,,,1,TELE
157,170000000.00,SHREE SIDDHI VINAYAK(TELE),743,MANIKPUR,6029.00,,800.000,0,4823200.00,,,1,TELE
157,170000000.00,SHREE SIDDHI VINAYAK(TELE),733,BUXAHI,5859.00,,900.000,0,5273100.00,,,1,TELE
157,170000000.00,SHREE SIDDHI VINAYAK(TELE),315,RAJANAWAGAON,5239.00,,1700.000,0,8906300.00,,,1,TELE
157,170000000.00,SHREE SIDDHI VINAYAK(TELE),316,BODLA,5549.00,,1900.000,0,10543100.00,,,1,TELE
157,170000000.00,SHREE SIDDHI VINAYAK(TELE),321B,KUKDUR,5849.00,,1500.000,0,8773500.00,,,1,TELE
157,170000000.00,SHREE SIDDHI VINAYAK(TELE),322,KODAWA,5749.00,,2500.000,0,14372500.00,,,1,TELE
157,170000000.00,SHREE SIDDHI VINAYAK(TELE),323A,KAMTHI,5679.00,,1300.000,0,7382700.00,,,1,TELE
157,170000000.00,SHREE SIDDHI VINAYAK(TELE),323B,KAMTHI,5689.00,,1200.000,0,6826800.00,,,1,TELE
157,170000000.00,SHREE SIDDHI VINAYAK(TELE),324,CHILPI,5689.00,,2600.000,0,14791400.00,,,1,TELE
157,170000000.00,SHREE SIDDHI VINAYAK(TELE),325,RENGAKHAR,5459.00,,2100.000,0,11463900.00,,,1,TELE
158,142500000.00,SHREE SITA SHANTA(TELE),858A,RAJPUR,5209.00,,1700.000,0,8855300.00,,,1,TELE
158,142500000.00,SHREE SITA SHANTA(TELE),873,TATAPANI,5409.00,,2600.000,0,14063400.00,,,1,TELE
158,142500000.00,SHREE SITA SHANTA(TELE),890A,DHAMNI,5289.00,,1700.000,0,8991300.00,,,1,TELE
158,142500000.00,SHREE SITA SHANTA(TELE),890B,DHAMNI,5009.00,,1600.000,0,8014400.00,,,1,TELE
158,142500000.00,SHREE SITA SHANTA(TELE),895B,PACHAWAL,5009.00,,2700.000,0,13524300.00,,,1,TELE
158,142500000.00,SHREE SITA SHANTA(TELE),901,DHADHIYA,5009.00,,2700.000,0,13524300.00,,,1,TELE
158,142500000.00,SHREE SITA SHANTA(TELE),907B,BETO,5009.00,,2100.000,0,10518900.00,,,1,TELE
158,142500000.00,SHREE SITA SHANTA(TELE),824,KAMLESHWERPUR,5229.00,,1700.000,0,8889300.00,,,1,TELE
158,142500000.00,SHREE SITA SHANTA(TELE),853,RAGHUNATHPUR,5009.00,,1300.000,0,6511700.00,,,1,TELE
158,142500000.00,SHREE SITA SHANTA(TELE),849,ODGI,5869.00,,3000.000,0,17607000.00,,,1,TELE
158,142500000.00,SHREE SITA SHANTA(TELE),882,JAJAWAL,6109.00,,3200.000,0,19548800.00,,,1,TELE
158,142500000.00,SHREE SITA SHANTA(TELE),846,CHENDRA,5049.00,,1700.000,0,8583300.00,,,1,TELE
159,21250000.00,SHRI BALAJI TRADING,170,BARKOTE,5839.00,,1400.000,0,8174600.00,,,1,
159,21250000.00,SHRI BALAJI TRADING,189,ANHOOR,7039.00,,1500.000,0,10558500.00,,,1,
160,10000000.00,SHRI RAM ENTERPRISES,606,SAMARUMA,5059.00,,800.000,0,4047200.00,,,1,
161,35000000.00,SHRI VIJAY TRADERS(VADERA),806,SAKDA,5211.00,,1800.000,0,9379800.00,,,1,VADERA
161,35000000.00,SHRI VIJAY TRADERS(VADERA),812A,PATANA,5211.00,,2500.000,0,13027500.00,,,1,VADERA
161,35000000.00,SHRI VIJAY TRADERS(VADERA),798,KUWARPUR,5382.00,,2000.000,0,10764000.00,,,1,VADERA
164,50000000.00,STAR TRADING & CO.,870,"BALRAMPUR, GIRWARGAN",5351.00,,4500.000,0,24079500.00,,,1,
164,50000000.00,STAR TRADING & CO.,861,KUSMI,5141.00,,2300.000,0,11824300.00,,,1,
165,75000000.00,SUMANGALAM FINANCIAL,271,BAGNADI,5301.00,,1300.000,0,6891300.00,,,1,
165,75000000.00,SUMANGALAM FINANCIAL,272,KOTHITOLA,5166.00,,1600.000,0,8265600.00,,,1,
165,75000000.00,SUMANGALAM FINANCIAL,273,BAGREKASA,5022.00,,2200.000,0,11048400.00,,,1,
165,75000000.00,SUMANGALAM FINANCIAL,493,MALDAMAL,5454.00,,1000.000,0,5454000.00,,,1,
165,75000000.00,SUMANGALAM FINANCIAL,494,CHIORAKUTA,5679.00,,800.000,0,4543200.00,,,1,
165,75000000.00,SUMANGALAM FINANCIAL,409,DULLA(KOSMI),8469.00,,1500.000,0,12703500.00,,,1,
165,75000000.00,SUMANGALAM FINANCIAL,705,PASARKHET,7038.00,,2000.000,0,14076000.00,,,1,
165,75000000.00,SUMANGALAM FINANCIAL,467,SALDIH,5625.00,,1100.000,0,6187500.00,,,1,
168,15006250.00,SUNRISETRADERS,647,TOLMA,6109.00,,900.000,0,5498100.00,,,1,
169,75000000.00,SUNSHINE ENTERPRISES,182A,MACHPALLI,7689.00,,1800.000,0,13840200.00,,,1,
169,75000000.00,SUNSHINE ENTERPRISES,182B,MACHPALLI,7689.00,,1200.000,0,9226800.00,,,1,
169,75000000.00,SUNSHINE ENTERPRISES,168,RENGAWAHI,7089.00,,2000.000,0,14178000.00,,,1,
169,75000000.00,SUNSHINE ENTERPRISES,171,BELGAL,7639.00,,1800.000,0,13750200.00,,,1,
169,75000000.00,SUNSHINE ENTERPRISES,274,BORTALAB,5289.00,,2400.000,0,12693600.00,,,1,
169,75000000.00,SUNSHINE ENTERPRISES,270,LALBAHADUR NAGAR,5439.00,,1600.000,0,8702400.00,,,1,
169,75000000.00,SUNSHINE ENTERPRISES,116,KONGE,5089.00,,500.000,0,2544500.00,,,1,
178,17500000.00,UMIYA TRADING,174,KURENAR,5868.00,,900.000,0,5281200.00,,,1,
182,150000000.00,VYAS & CO.,490,PALIDIH,5999.00,,800.000,0,4799200.00,,,1,
182,150000000.00,VYAS & CO.,503,DEOPUR,6459.00,,1100.000,0,7104900.00,,,1,
182,150000000.00,VYAS & CO.,510,DHANSIR,7299.00,,2900.000,0,21167100.00,,,1,
182,150000000.00,VYAS & CO.,714,GURMA,8289.00,,1400.000,0,11604600.00,,,1,
182,150000000.00,VYAS & CO.,720,GARH,9109.00,,2800.000,0,25505200.00,,,1,
182,150000000.00,VYAS & CO.,721,LEMRU,9399.00,,2200.000,0,20677800.00,,,1,
182,150000000.00,VYAS & CO.,290,NALKASA,7209.00,,1600.000,0,11534400.00,,,1,
182,150000000.00,VYAS & CO.,292,KUWAGONDI,7119.00,,1300.000,0,9254700.00,,,1,
182,150000000.00,VYAS & CO.,296,PIPARKHAR,7599.00,,1500.000,0,11398500.00,,,1,
182,150000000.00,VYAS & CO.,297,LOHARTOLA,7319.00,,1300.000,0,9514700.00,,,1,
182,150000000.00,VYAS & CO.,108,MURVEND,8203.00,,1500.000,0,12304500.00,,,1,
184,29871000.00,YOGESHKUMARBHIKHUBHAI,245,TEKAMTOLA,6921.00,,1600.000,0,11073600.00,,,1,
184,29871000.00,YOGESHKUMARBHIKHUBHAI,150A,DAMKASA,7119.00,,1400.000,0,9966600.00,,,1,
184,29871000.00,YOGESHKUMARBHIKHUBHAI,150B,DAMKASA,7119.00,,1200.000,0,8542800.00,,,1,
185,42500000.00,ZAID ENTERPRISES,203,KANKER,7008.00,,1700.000,0,11913600.00,,,1,
185,42500000.00,ZAID ENTERPRISES,333,SEMRA,5858.00,,900.000,0,5272200.00,,,1,
185,42500000.00,ZAID ENTERPRISES,334,BELARGAON,6028.00,,1500.000,0,9042000.00,,,1,
185,42500000.00,ZAID ENTERPRISES,335,GHOTGAON,6028.00,,1200.000,0,7233600.00,,,1,
99,38700000.00,EVERGREEN TRADING CO(SAIDU),149B,LOHATTER,7309.00,,1400.000,0,10232600.00,,,1,SAIDU
99,38700000.00,EVERGREEN TRADING CO(SAIDU),149A,LOHATTER,7309.00,,1400.000,0,10232600.00,,,1,SAIDU
99,38700000.00,EVERGREEN TRADING CO(SAIDU),214,AMODA,5829.00,,1600.000,0,9326400.00,,,1,SAIDU
16,30000000.00,ASARMAL BALUMAL,802A,GHAGHRA,5799.00,,3100.000,0,17976900.00,,,1,
16,30000000.00,ASARMAL BALUMAL,889,CHALGALI KHAS,5559.00,,1700.000,0,9450300.00,,,1,
25,81250000.00,BHARATKUMAR H. SHAH,253,BANJARI,7587.00,,1900.000,0,14415300.00,,,1,
25,81250000.00,BHARATKUMAR H. SHAH,257,ARAJKUND,5886.00,,2200.000,0,12949200.00,,,1,
25,81250000.00,BHARATKUMAR H. SHAH,250,CHHURIYA,6291.00,,1200.000,0,7549200.00,,,1,
29,93750000.00,CH JEEVANREDDY(DESAI),148,PEDAWARI,8139.00,,2100.000,0,17091900.00,,,1,
29,93750000.00,CH JEEVANREDDY(DESAI),156,BHANUPRATAPPUR,8179.00,,1800.000,0,14722200.00,,,1,
29,93750000.00,CH JEEVANREDDY(DESAI),141B,DURGUKONDAL,7227.00,,1700.000,0,12285900.00,,,1,
29,93750000.00,CH JEEVANREDDY(DESAI),155,SAMBALPUR,7029.00,,1600.000,0,11246400.00,,,1,
29,93750000.00,CH JEEVANREDDY(DESAI),254,MUDPAR,6879.00,,2100.000,0,14445900.00,,,1,
29,93750000.00,CH JEEVANREDDY(DESAI),244,GOTATOLA,6739.00,,1500.000,0,10108500.00,,,1,
29,93750000.00,CH JEEVANREDDY(DESAI),247,MATEWA,7029.00,,1300.000,0,9137700.00,,,1,
31,43750000.00,CHANDRAKUMAR VINAYAK DONGARE,39A,MICHIGUDA,5029.00,,2400.000,0,12069600.00,,,1,
31,43750000.00,CHANDRAKUMAR VINAYAK DONGARE,114B,ADKA,5209.00,,1600.000,0,8334400.00,,,1,
32,41250000.00,CHETAN PATEL,225,KAREKATTA,8739.00,,1200.000,0,10486800.00,,,1,
32,41250000.00,CHETAN PATEL,178,PADENGA,7089.00,,1500.000,0,10633500.00,,,1,
32,41250000.00,CHETAN PATEL,173,SABER,6439.00,,1400.000,0,9014600.00,,,1,
32,41250000.00,CHETAN PATEL,276A,SHIVPURI,6089.00,,900.000,0,5480100.00,,,1,
41,100000000.00,DHRUVKUMAR PATEL(DESAI),624,KAYA,7419.00,,3200.000,0,23740800.00,,,1,ASHWIN
41,100000000.00,DHRUVKUMAR PATEL(DESAI),619,CHIMTAPANI,6719.00,,2400.000,0,16125600.00,,,1,ASHWIN
41,100000000.00,DHRUVKUMAR PATEL(DESAI),643,GERSA,6989.00,,900.000,0,6290100.00,,,1,ASHWIN
41,100000000.00,DHRUVKUMAR PATEL(DESAI),630,BANHAR,6719.00,,1000.000,0,6719000.00,,,1,ASHWIN
41,100000000.00,DHRUVKUMAR PATEL(DESAI),682,INCHPARA,7219.00,,2300.000,0,16603700.00,,,1,ASHWIN
41,100000000.00,DHRUVKUMAR PATEL(DESAI),831,TARA,6118.00,,3600.000,0,22024800.00,,,1,ASHWIN
49,62500000.00,GODISHALA RAJAMALLA REDDY,242,PANDARWANI,7677.00,,1900.000,0,14586300.00,,,1,SUNDRI
60,37500000.00,IMTIAZ AHMED,396,MUDIPANI,8230.00,,1200.000,0,9876000.00,,,1,
60,37500000.00,IMTIAZ AHMED,408,KOTHIGAON,7890.00,,1100.000,0,8679000.00,,,1,
67,25287562.50,K.BHIMARAO,7,CHERAMANGI,6006.00,,1800.000,0,10810800.00,,,1,
68,63750000.00,KAILASH AGRAWAL,913B,BIHARPUR,5370.00,,4200.000,0,22554000.00,,,1,
72,22500000.00,KANTILAL PUJARA,398,CHHINDOLI,8721.00,,1000.000,0,8721000.00,,,1,
73,281250000.00,KARAN KOTECHA(PATAKA),601,FARKANARA,5571.00,,1500.000,0,8356500.00,,,1,
73,281250000.00,KARAN KOTECHA(PATAKA),580,"SAHASPANI, KEDAR",5454.00,,1400.000,0,7635600.00,,,1,
73,281250000.00,KARAN KOTECHA(PATAKA),620,FAGURAM,6006.00,,700.000,0,4204200.00,,,1,
73,281250000.00,KARAN KOTECHA(PATAKA),609,GARE,5308.00,,800.000,0,4246400.00,,,1,
73,281250000.00,KARAN KOTECHA(PATAKA),608,DHOURABHATA,5706.00,,1800.000,0,10270800.00,,,1,
73,281250000.00,KARAN KOTECHA(PATAKA),583,MALDA,5607.00,,1500.000,0,8410500.00,,,1,
73,281250000.00,KARAN KOTECHA(PATAKA),584,MAHAPALLI,6037.00,,2200.000,0,13281400.00,,,1,
73,281250000.00,KARAN KOTECHA(PATAKA),599,"TARAIMAL,RABO",5335.00,,2000.000,0,10670000.00,,,1,
73,281250000.00,KARAN KOTECHA(PATAKA),593,JIWARI,5607.00,,1400.000,0,7849800.00,,,1,
73,281250000.00,KARAN KOTECHA(PATAKA),227,KUNDKAL,7708.00,,2200.000,0,16957600.00,,,1,
73,281250000.00,KARAN KOTECHA(PATAKA),233,MANPUR,7503.00,,2100.000,0,15756300.00,,,1,
73,281250000.00,KARAN KOTECHA(PATAKA),251,MOHLA,6880.00,,1300.000,0,8944000.00,,,1,
73,281250000.00,KARAN KOTECHA(PATAKA),139,KONDE,7330.00,,2400.000,0,17592000.00,,,1,
73,281250000.00,KARAN KOTECHA(PATAKA),133A,AAMAKOT,6630.00,,1600.000,0,10608000.00,,,1,
73,281250000.00,KARAN KOTECHA(PATAKA),133B,AAMAKOT,6630.00,,1800.000,0,11934000.00,,,1,
73,281250000.00,KARAN KOTECHA(PATAKA),119,BEHASALHEBHAT,7206.00,,1300.000,0,9367800.00,,,1,
73,281250000.00,KARAN KOTECHA(PATAKA),328,"TUMDIBAHAR,NIRRABEDA",7630.00,,1800.000,0,13734000.00,,,1,
81,93750000.00,KORALLA RAJA REDDY,160B,KOYLIBEDA,7389.00,,2300.000,0,16994700.00,,,1,SW
81,93750000.00,KORALLA RAJA REDDY,160A,KOYLIBEDA,7389.00,,1800.000,0,13300200.00,,,1,SW
81,93750000.00,KORALLA RAJA REDDY,299,RENGADABRI,6579.00,,1400.000,0,9210600.00,,,1,SW
81,93750000.00,KORALLA RAJA REDDY,42A,KERLAPAL,5079.00,,2000.000,0,10158000.00,,,1,SW
82,93750000.00,KORIVI SRINIVAS,8,ILMIDI,7821.00,,2300.000,0,17988300.00,,,1,
82,93750000.00,KORIVI SRINIVAS,9,PAMGAL,7521.00,,2800.000,0,21058800.00,,,1,
82,93750000.00,KORIVI SRINIVAS,11,DEPLA,7521.00,,1800.000,0,13537800.00,,,1,
82,93750000.00,KORIVI SRINIVAS,16A,MADDED,8321.00,,1500.000,0,12481500.00,,,1,
82,93750000.00,KORIVI SRINIVAS,16B,MADDED,8321.00,,1300.000,0,10817300.00,,,1,
85,12500000.00,LAKSHMAN KUMAR TIWARI,792,BELBEHRA,5260.00,,1900.000,0,9994000.00,,,1,
89,90000000.00,M SHYAMSUNDER REDDY(DESAI),23A,TOINAR,5819.00,,3100.000,0,18038900.00,,,1,DESAI
90,62500000.00,M.A. RAOOF(DESAI),64A,BHAIRAMGARH,6039.00,,2500.000,0,15097500.00,,,1,DESAI
90,62500000.00,M.A. RAOOF(DESAI),60,KODOLI,5859.00,,3200.000,0,18748800.00,,,1,DESAI
120,32625000.00,NALLANI THIRUPATHI RAO,30A,KONTA,7779.00,,400.000,0,3111600.00,,,1,
129,100000000.00,PATEL JIGNESHBHAI(DESAI),828,LAKHANPUR,6419.00,,4100.000,0,26317900.00,,,1,DESAI
129,100000000.00,PATEL JIGNESHBHAI(DESAI),829,UDAIPUR,6459.00,,2500.000,0,16147500.00,,,1,DESAI
129,100000000.00,PATEL JIGNESHBHAI(DESAI),823,KEDMA,6419.00,,2800.000,0,17973200.00,,,1,DESAI
129,100000000.00,PATEL JIGNESHBHAI(DESAI),834,RIKHI,6009.00,,3300.000,0,19829700.00,,,1,DESAI
129,100000000.00,PATEL JIGNESHBHAI(DESAI),881,GOVINDPUR,5009.00,,2500.000,0,12522500.00,,,1,DESAI
130,62500000.00,PRAVIN KUMAR KOTAK,165,SITRAM,7289.00,,1300.000,0,9475700.00,,,1,
130,62500000.00,PRAVIN KUMAR KOTAK,169,KANDADI,7089.00,,1300.000,0,9215700.00,,,1,
130,62500000.00,PRAVIN KUMAR KOTAK,167A,PANAWAR,6539.00,,1900.000,0,12424100.00,,,1,
130,62500000.00,PRAVIN KUMAR KOTAK,246,KUMHALI,8389.00,,1200.000,0,10066800.00,,,1,
130,62500000.00,PRAVIN KUMAR KOTAK,191A,PRATAPPUR,7439.00,,1500.000,0,11158500.00,,,1,
130,62500000.00,PRAVIN KUMAR KOTAK,191B,PRATAPPUR,7439.00,,1000.000,0,7439000.00,,,1,
148,20374550.00,SHAKEEL HUSSAIN,164,KAMTEDA,6500.00,,1600.000,0,10400000.00,,,1,
171,7250000.00,SYED FAROOQ ALI,31A,ERRABOR,7999.00,,900.000,0,7199100.00,,,1,
173,47500000.00,Shakeel Ahmed Khan,111A,BENOOR,5189.00,,2400.000,0,12453600.00,,,1,
173,47500000.00,Shakeel Ahmed Khan,111B,BENOOR,5189.00,,1700.000,0,8821300.00,,,1,
173,47500000.00,Shakeel Ahmed Khan,18A,SANTOSHPUR,6279.00,,2000.000,0,12558000.00,,,1,
173,47500000.00,Shakeel Ahmed Khan,18B,SANTOSHPUR,6159.00,,1600.000,0,9854400.00,,,1,
177,33750000.00,Thirupathirao Kodati,23B,TOINAR,6669.00,,1800.000,0,12004200.00,,,1,
180,45000000.00,VALLALA KISTAIAH(DESAI),5B,KORSAGUDA,6799.00,,2000.000,0,13598000.00,,,1,DESAI
181,70000000.00,VINOD KUMAR JAISWAL,874,MANIKPUR,5387.00,,4000.000,0,21548000.00,,,1,
181,70000000.00,VINOD KUMAR JAISWAL,847,SATYANAGAR,5030.00,,2000.000,0,10060000.00,,,1,
181,70000000.00,VINOD KUMAR JAISWAL,811A,BAIKUNTHPUR,5657.00,,1700.000,0,9616900.00,,,1,
183,95000000.00,YASH KETAN PATEL(SW),239,KHARDI,5679.00,,2100.000,0,11925900.00,,,1,SW
15,39375000.00,ARUNA REDDY,21A,BARDELA,6289.00,,1500.000,0,9433500.00,,,1,
15,39375000.00,ARUNA REDDY,21B,BARDELA,6289.00,,1700.000,0,10691300.00,,,1,
15,39375000.00,ARUNA REDDY,157B,KACCHE,7489.00,,1300.000,0,9735700.00,,,1,
30,50000000.00,CH.BHANUMATHI(DESAI),4,HEERAPUR,6219.00,,3000.000,0,18657000.00,,,1,30NO
30,50000000.00,CH.BHANUMATHI(DESAI),5A,KORSAGUDA,5919.00,,1600.000,0,9470400.00,,,1,30NO
30,50000000.00,CH.BHANUMATHI(DESAI),17B,DHANORA,6069.00,,1200.000,0,7282800.00,,,1,30NO
30,50000000.00,CH.BHANUMATHI(DESAI),64B,BHAIRAMGARH,5109.00,,1300.000,0,6641700.00,,,1,30NO
39,72500000.00,DEEPTHI REDDY K,159A,DHUNTA,7289.00,,2000.000,0,14578000.00,,,1,
39,72500000.00,DEEPTHI REDDY K,158,HURTARAI,7489.00,,1900.000,0,14229100.00,,,1,
39,72500000.00,DEEPTHI REDDY K,395,LITIPARA,7289.00,,2400.000,0,17493600.00,,,1,
39,72500000.00,DEEPTHI REDDY K,201A,PIDAPAL,7289.00,,1800.000,0,13120200.00,,,1,
39,72500000.00,DEEPTHI REDDY K,202,MARDAPOTI,7089.00,,1400.000,0,9924600.00,,,1,
42,6250000.00,ESHA BHOJANI,30B,KONTA,12345.00,,400.000,0,4938000.00,,,1,
126,31250000.00,PADMA KODATI,54B,NAKULNAR,5229.00,,1000.000,0,5229000.00,,,1,
126,31250000.00,PADMA KODATI,63B,BARSOOR,5229.00,,1400.000,0,7320600.00,,,1,
4,53750000.00,AJAY TRADERS,785,CHARAIDAND,5569.00,,1300.000,0,7239700.00,,,2,
4,53750000.00,AJAY TRADERS,786,"NARAYANPUR, GAILUNGA",5129.00,,3000.000,0,15387000.00,,,2,
4,53750000.00,AJAY TRADERS,854,BATAULI,5039.00,,2000.000,0,10078000.00,,,2,
5,50000000.00,ANAND BIRI FACTORY,43B,SUKMA,5229.00,,2000.000,0,10458000.00,,,2,
8,45625000.00,ATISHAY TRADING CO.,495,SINGBAHAL,5416.00,,1000.000,0,5416000.00,,,2,
8,45625000.00,ATISHAY TRADING CO.,473,PIRDA,5341.00,,1400.000,0,7477400.00,,,2,
8,45625000.00,ATISHAY TRADING CO.,730,BANDHAKAHAR,5932.00,,600.000,0,3559200.00,,,2,
8,45625000.00,ATISHAY TRADING CO.,469,MOHGAON,5416.00,,1200.000,0,6499200.00,,,2,
11,26250000.00,Bhomiyaji Enterprises,62B,GEEDUM,5125.00,,1800.000,0,9225000.00,,,2,
14,31250000.00,CHHOTA BHAI MUNNU BHAI,805A,MADISARAI,5319.00,,2900.000,0,15425100.00,,,2,
15,31250000.00,CRESCENT TRADE LINKS,260,KHUJJI,6089.00,,1700.000,0,10351300.00,,,2,
15,31250000.00,CRESCENT TRADE LINKS,219,JEPRA,5589.00,,1000.000,0,5589000.00,,,2,
15,31250000.00,CRESCENT TRADE LINKS,184A,SANGAM,5589.00,,1200.000,0,6706800.00,,,2,
15,31250000.00,CRESCENT TRADE LINKS,184B,SANGAM,5389.00,,1000.000,0,5389000.00,,,2,
38,62500000.00,GOLDEN LEAVES PROCESSORS,33A,KISTARAM,9260.00,,800.000,0,7408000.00,,,2,
38,62500000.00,GOLDEN LEAVES PROCESSORS,29A,GOLAPALLI,12345.00,,700.000,0,8641500.00,,,2,
38,62500000.00,GOLDEN LEAVES PROCESSORS,29B,GOLAPALLI,12345.00,,400.000,0,4938000.00,,,2,
22,37500000.00,HEENA ENTERPRISES,481,BASNA,6309.00,,1400.000,0,8832600.00,,,2,
22,37500000.00,HEENA ENTERPRISES,488,TOSHGAON,6309.00,,1700.000,0,10725300.00,,,2,
22,37500000.00,HEENA ENTERPRISES,474,DEWALGARH,5889.00,,900.000,0,5300100.00,,,2,
22,37500000.00,HEENA ENTERPRISES,482,BHANWARPUR,5609.00,,1200.000,0,6730800.00,,,2,
22,37500000.00,HEENA ENTERPRISES,483,CHANDRAKHURI,5609.00,,800.000,0,4487200.00,,,2,
24,16000000.00,HIMALAYAN TRADING CO.,284B,BAKARKATTA,6460.00,,1100.000,0,7106000.00,,,2,
24,16000000.00,HIMALAYAN TRADING CO.,107,KESHKAL,6290.00,,1200.000,0,7548000.00,,,2,
26,25000000.00,J.S.TOBACCO STORES,42B,KERLAPAL,6008.00,,2400.000,0,14419200.00,,,2,
26,25000000.00,J.S.TOBACCO STORES,41B,PONGABHEJI,5368.00,,1500.000,0,8052000.00,,,2,
39,20250000.00,Jatindranath Dutta & Sons,885,PRATAPPUR,5219.00,,2800.000,0,14613200.00,,,2,
29,35000000.00,KAREEM TRADING CO,177,BANDE,5689.00,,2000.000,0,11378000.00,,,2,
29,35000000.00,KAREEM TRADING CO,192A,P.V.34,5389.00,,1000.000,0,5389000.00,,,2,
29,35000000.00,KAREEM TRADING CO,183B,GHODAGAON,5289.00,,1000.000,0,5289000.00,,,2,
29,35000000.00,KAREEM TRADING CO,305,BALOD,5689.00,,1600.000,0,9102400.00,,,2,
30,12500000.00,KAVITA ENTERPRISES,684,UMRELI,5269.00,,1000.000,0,5269000.00,,,2,SHYAM
30,12500000.00,KAVITA ENTERPRISES,566,SAKTI,5149.00,,1400.000,0,7208600.00,,,2,SHYAM
33,120000000.00,KOHINOOR TOBACCO,538,KANCHANPUR,7599.00,,1300.000,0,9878700.00,,,2,TELE
33,120000000.00,KOHINOOR TOBACCO,528,TINGIPUR,6609.00,,900.000,0,5948100.00,,,2,TELE
33,120000000.00,KOHINOOR TOBACCO,533,RATANPUR,6489.00,,1500.000,0,9733500.00,,,2,TELE
33,120000000.00,KOHINOOR TOBACCO,540,PUDU,6839.00,,1100.000,0,7522900.00,,,2,TELE
33,120000000.00,KOHINOOR TOBACCO,541,BELGAHNA,6759.00,,1000.000,0,6759000.00,,,2,TELE
33,120000000.00,KOHINOOR TOBACCO,535,AMALI,6109.00,,1100.000,0,6719900.00,,,2,TELE
33,120000000.00,KOHINOOR TOBACCO,791,BHAUTA,7109.00,,2700.000,0,19194300.00,,,2,TELE
33,120000000.00,KOHINOOR TOBACCO,799,GADWAR,7109.00,,2000.000,0,14218000.00,,,2,TELE
33,120000000.00,KOHINOOR TOBACCO,803A,BELGAON,6109.00,,2300.000,0,14050700.00,,,2,TELE
33,120000000.00,KOHINOOR TOBACCO,803B,BELGAON,6109.00,,1800.000,0,10996200.00,,,2,TELE
33,120000000.00,KOHINOOR TOBACCO,804A,JANUWA,6109.00,,1500.000,0,9163500.00,,,2,TELE
49,100000000.00,MURSHIDABAD BIRI WORKS,489,KODOGUDA,6415.00,,1400.000,0,8981000.00,,,2,SUNDRI
49,100000000.00,MURSHIDABAD BIRI WORKS,497,"MOHANMUDA,KOSAMPALI",6419.00,,1800.000,0,11554200.00,,,2,SUNDRI
49,100000000.00,MURSHIDABAD BIRI WORKS,460,CHARBHATA,6095.00,,500.000,0,3047500.00,,,2,SUNDRI
49,100000000.00,MURSHIDABAD BIRI WORKS,484,BICHHIYA,5517.00,,1000.000,0,5517000.00,,,2,SUNDRI
49,100000000.00,MURSHIDABAD BIRI WORKS,459,BHITHIDIH,6515.00,,800.000,0,5212000.00,,,2,SUNDRI
49,100000000.00,MURSHIDABAD BIRI WORKS,618,CHHOTIGUDA,6727.00,,1700.000,0,11435900.00,,,2,SUNDRI
49,100000000.00,MURSHIDABAD BIRI WORKS,422,FINGESHWAR,5782.00,,1400.000,0,8094800.00,,,2,SUNDRI
49,100000000.00,MURSHIDABAD BIRI WORKS,423,JAMGAON,5567.00,,1100.000,0,6123700.00,,,2,SUNDRI
49,100000000.00,MURSHIDABAD BIRI WORKS,421,BELAR,5782.00,,1500.000,0,8673000.00,,,2,SUNDRI
49,100000000.00,MURSHIDABAD BIRI WORKS,281,PADADAH,5712.00,,2000.000,0,11424000.00,,,2,SUNDRI
49,100000000.00,MURSHIDABAD BIRI WORKS,289A,SALHEWARA,6169.00,,2400.000,0,14805600.00,,,2,SUNDRI
50,11250000.00,N H AGRO,860,DIPADIHKALA,5200.00,,1800.000,0,9360000.00,,,2,
51,30000000.00,N P TRADING CO,195A,GONDAHUR,6251.00,,1300.000,0,8126300.00,,,2,
51,30000000.00,N P TRADING CO,195B,GONDAHUR,6251.00,,1200.000,0,7501200.00,,,2,
51,30000000.00,N P TRADING CO,167B,PANAWAR,6009.00,,1700.000,0,10215300.00,,,2,
55,63750000.00,NUR BIRI WORK,818,RAMGARH,8099.00,,2800.000,0,22677200.00,,,2,NOOR BIDI
55,63750000.00,NUR BIRI WORK,732,PALI,6399.00,,1600.000,0,10238400.00,,,2,NOOR BIDI
55,63750000.00,NUR BIRI WORK,560,SEMERDARRI,5399.00,,1700.000,0,9178300.00,,,2,NOOR BIDI
55,63750000.00,NUR BIRI WORK,789,BAGICHA,7099.00,,2200.000,0,15617800.00,,,2,NOOR BIDI
57,72500000.00,R.H. ENTERPRISE,373,CHOTEGOBRA,8657.00,,1300.000,0,11254100.00,,,2,
57,72500000.00,R.H. ENTERPRISE,377,JARANDIH,8255.00,,1100.000,0,9080500.00,,,2,
57,72500000.00,R.H. ENTERPRISE,375,CHINDOLA,6978.00,,1100.000,0,7675800.00,,,2,
57,72500000.00,R.H. ENTERPRISE,115,SONPUR,6427.00,,1300.000,0,8355100.00,,,2,
57,72500000.00,R.H. ENTERPRISE,35A,DORNAPAL,6185.00,,1800.000,0,11133000.00,,,2,
57,72500000.00,R.H. ENTERPRISE,35B,DORNAPAL,6185.00,,2000.000,0,12370000.00,,,2,
57,72500000.00,R.H. ENTERPRISE,117,GAWADI,5169.00,,1100.000,0,5685900.00,,,2,
58,15000000.00,RADHA KISHAN TENDU,610,GHARGHODA,6520.00,,2300.000,0,14996000.00,,,2,
59,25000000.00,RADHASHYAM T. PAUL,637,LIBRA,7020.00,,2400.000,0,16848000.00,,,2,
60,75000000.00,ROYAL TRADE LINK,255,CHILHATI,5789.00,,1700.000,0,9841300.00,,,2,
60,75000000.00,ROYAL TRADE LINK,256,BHADSENA,5689.00,,1700.000,0,9671300.00,,,2,
60,75000000.00,ROYAL TRADE LINK,276B,SHIVPURI,5589.00,,700.000,0,3912300.00,,,2,
60,75000000.00,ROYAL TRADE LINK,277,MUDHIPAR,5089.00,,1300.000,0,6615700.00,,,2,
60,75000000.00,ROYAL TRADE LINK,105,VISRAMPURI,5089.00,,2200.000,0,11195800.00,,,2,
60,75000000.00,ROYAL TRADE LINK,259,PAREWADIH,5689.00,,1300.000,0,7395700.00,,,2,
72,31250000.00,Sunita Natural Forest,780,BATAIKELA,5849.00,,2900.000,0,16962100.00,,,2,
76,30000000.00,TWAARSH SUPPLIERS,591,KHARSIA,5090.00,,1100.000,0,5599000.00,,,2,
76,30000000.00,TWAARSH SUPPLIERS,605,AAMLIDIH,5420.00,,1200.000,0,6504000.00,,,2,
76,30000000.00,TWAARSH SUPPLIERS,671,GAHNAJHARIA,5022.00,,1000.000,0,5022000.00,,,2,
76,30000000.00,TWAARSH SUPPLIERS,574,BIRNIPALI,5020.00,,500.000,0,2510000.00,,,2,
76,30000000.00,TWAARSH SUPPLIERS,805B,MADISARAI,5290.00,,1900.000,0,10051000.00,,,2,
79,120000000.00,VIDARBHA TOBACCO,833,CHANDANNAGAR,7399.00,,3200.000,0,23676800.00,,,2,MH
79,120000000.00,VIDARBHA TOBACCO,832,PREMNAGAR,7069.00,,3000.000,0,21207000.00,,,2,MH
79,120000000.00,VIDARBHA TOBACCO,842,"SURAJPUR, BHAIYATHAN",6689.00,,3400.000,0,22742600.00,,,2,MH
79,120000000.00,VIDARBHA TOBACCO,883,DAWANKARA,6899.00,,2500.000,0,17247500.00,,,2,MH
79,120000000.00,VIDARBHA TOBACCO,884,GANESHPUR,5699.00,,2800.000,0,15957200.00,,,2,MH
79,120000000.00,VIDARBHA TOBACCO,913A,BIHARPUR,6109.00,,2200.000,0,13439800.00,,,2,MH
1,33750000.00,A A MUQEEM,6B,PUSNAR,7299.00,,1600.000,0,11678400.00,,,2,TELE
1,33750000.00,A A MUQEEM,19A,CHERPAL,7299.00,,1300.000,0,9488700.00,,,2,TELE
1,33750000.00,A A MUQEEM,19B,CHERPAL,7299.00,,1600.000,0,11678400.00,,,2,TELE
21,60000000.00,HARSHIT SONCHHATRA,113B,NARAYANPUR,6590.00,,2400.000,0,15816000.00,,,2,
21,60000000.00,HARSHIT SONCHHATRA,268,PANDARAPANI,6899.00,,1200.000,0,8278800.00,,,2,
21,60000000.00,HARSHIT SONCHHATRA,213,PALEWA,6590.00,,900.000,0,5931000.00,,,2,
21,60000000.00,HARSHIT SONCHHATRA,342,"MOGRAGAHAN, BARBANDA",6899.00,,1400.000,0,9658600.00,,,2,
21,60000000.00,HARSHIT SONCHHATRA,283B,THAKURTOLA,7390.00,,1200.000,0,8868000.00,,,2,
21,60000000.00,HARSHIT SONCHHATRA,283A,THAKURTOLA,7090.00,,1500.000,0,10635000.00,,,2,
25,15000000.00,IMTIAZ AHMED,867,SAWAG,5121.00,,2800.000,0,14338800.00,,,2,VADERA
27,29456250.00,K.BHIMARAO,43A,SUKMA,5556.00,,2600.000,0,14445600.00,,,2,
27,29456250.00,K.BHIMARAO,34A,JAGGAVARAM,5556.00,,2000.000,0,11112000.00,,,2,
27,29456250.00,K.BHIMARAO,32B,PALACHALMA,10200.00,,300.000,0,3060000.00,,,2,
31,37500000.00,KESHAV AGRAWAL,817,KOTADOL,6640.00,,3200.000,0,21248000.00,,,2,
31,37500000.00,KESHAV AGRAWAL,285,KUMHARWADA,5390.00,,2200.000,0,11858000.00,,,2,
35,43750000.00,M SHYAMSUNDER REDDY,1A,PAMED,16599.00,,600.000,0,9959400.00,,,2,TELE
35,43750000.00,M SHYAMSUNDER REDDY,1B,PAMED,16999.00,,600.000,0,10199400.00,,,2,TELE
35,43750000.00,M SHYAMSUNDER REDDY,2,PUJARI KANKER,17999.00,,700.000,0,12599300.00,,,2,TELE
48,16000000.00,MURLIDHAR DEWANGAN,284A,BAKARKATTA,6460.00,,1900.000,0,12274000.00,,,2,SW
52,10687500.00,NALLANI THIRUPATHI RAO,32A,PALACHALMA,9279.00,,500.000,0,4639500.00,,,2,
56,18000000.00,PRAVIR KUMAR SHAH,587,"TILGA, KOTARLIA",5472.00,,1500.000,0,8208000.00,,,2,
56,18000000.00,PRAVIR KUMAR SHAH,646,KESHLA,5652.00,,900.000,0,5086800.00,,,2,
56,18000000.00,PRAVIR KUMAR SHAH,572,KARNPALI,5328.00,,800.000,0,4262400.00,,,2,
68,25000000.00,SHIKHAR AGRAWAL,816,SONHAT,6290.00,,2500.000,0,15725000.00,,,2,
71,15000000.00,SIDDHARTH.D.PATEL,288,PAILIMETA,5199.00,,2500.000,0,12997500.00,,,2,MH
65,20000000.00,Shakeel Ahmed Khan,267,BANDADI,5589.00,,1400.000,0,7824600.00,,,2,
78,20000000.00,VALLALA KISTAIAH,39B,MICHIGUDA,5899.00,,2700.000,0,15927300.00,,,2,DESAI
81,90000000.00,YASH KETAN PATEL,289B,SALHEWARA,5369.00,,2300.000,0,12348700.00,,,2,SW
81,90000000.00,YASH KETAN PATEL,258,CHOWKI,5669.00,,1600.000,0,9070400.00,,,2,SW
81,90000000.00,YASH KETAN PATEL,813,KATGODI,6419.00,,2600.000,0,16689400.00,,,2,SW
81,90000000.00,YASH KETAN PATEL,815,KAILASHPUR,6369.00,,2000.000,0,12738000.00,,,2,SW
81,90000000.00,YASH KETAN PATEL,812B,JAMGAHANA(KHANDA),6129.00,,1300.000,0,7967700.00,,,2,SW
81,90000000.00,YASH KETAN PATEL,810,BANJARIDAND,6399.00,,2100.000,0,13437900.00,,,2,SW
81,90000000.00,YASH KETAN PATEL,807,PONDI,6369.00,,2000.000,0,12738000.00,,,2,SW
7,20000000.00,ARUNA REDDY,47A,GUMMA,5489.00,,1600.000,0,8782400.00,,,2,
17,31250000.00,FARHATH BEGUM,38A,BODKEL,5229.00,,1500.000,0,7843500.00,,,2,
17,31250000.00,FARHATH BEGUM,50B,PADWARAS,5129.00,,1500.000,0,7693500.00,,,2,
61,18750000.00,RUCHI AGRAWAL,62A,GEEDUM,5589.00,,1800.000,0,10060200.00,,,2,
1,31250000.00,AFAQUE TRADERS,559,DANIKUNDI,5039.00,,1000.000,0,5039000.00,,,3,TELE
1,31250000.00,AFAQUE TRADERS,902,BARTIKALLA,5039.00,,1900.000,0,9574100.00,,,3,TELE
3,30000000.00,ANAND BIRI FACTORY,440,KOMAKHAN,5329.00,,1400.000,0,7460600.00,,,3,
5,18750000.00,BANSIDHAR TRADING,40A,JAGARGUNDA,6126.00,,1400.000,0,8576400.00,,,3,
5,18750000.00,BANSIDHAR TRADING,40B,JAGARGUNDA,6026.00,,1500.000,0,9039000.00,,,3,
11,25000000.00,DHARMENDRA KUMAR JAIN,561,SEONI,5009.00,,2400.000,0,12021600.00,,,3,
13,35000000.00,HEENA ENTERPRISES,862,GAJADHARPUR,5181.00,,2000.000,0,10362000.00,,,3,
13,35000000.00,HEENA ENTERPRISES,863,UMKO,5181.00,,1700.000,0,8807700.00,,,3,
13,35000000.00,HEENA ENTERPRISES,891A,TRIKUNDA,5181.00,,1400.000,0,7253400.00,,,3,
13,35000000.00,HEENA ENTERPRISES,900B,KARAMDHIHA,5041.00,,1500.000,0,7561500.00,,,3,
14,55000000.00,IDEAL TRADING CO,485,BADESAJAPALI,6289.00,,1900.000,0,11949100.00,,,3,
14,55000000.00,IDEAL TRADING CO,303,BADBHUM,6027.00,,1900.000,0,11451300.00,,,3,
14,55000000.00,IDEAL TRADING CO,491,"GERRA,CHHIRRAKHAR",6257.00,,1700.000,0,10636900.00,,,3,
19,12500000.00,Lado Enterprises,61B,BADE TUMNAR,5026.00,,2000.000,0,10052000.00,,,3,
21,5869000.00,M/S MAHESH KUMAR AND CO.,625,KHEDAPALI,5869.00,,800.000,0,4695200.00,,,3,
25,3150000.00,MORARJI T. & CO.,505,SONPUR,5067.00,,600.000,0,3040200.00,,,3,VADERA
28,23750000.00,SALIM TRADERS,38B,BODKEL,5167.00,,2000.000,0,10334000.00,,,3,
29,13750000.00,SARAF TOBACCO COMPANY,37A,POLAMPALLI,5727.00,,2200.000,0,12599400.00,,,3,
30,75000000.00,SBW UDYOG LTD,826,PETLA,5127.00,,3800.000,0,19482600.00,,,3,SHYAM
30,75000000.00,SBW UDYOG LTD,825,SITAPUR,5027.00,,1900.000,0,9551300.00,,,3,SHYAM
30,75000000.00,SBW UDYOG LTD,563,BAROR,5145.00,,1400.000,0,7203000.00,,,3,SHYAM
30,75000000.00,SBW UDYOG LTD,891B,TRIKUNDA,5027.00,,2800.000,0,14075600.00,,,3,SHYAM
30,75000000.00,SBW UDYOG LTD,790,SANNA,5027.00,,1700.000,0,8545900.00,,,3,SHYAM
31,15000000.00,SHAKTI SWAROOP ENTERPRISES,34B,JAGGAVARAM,5229.00,,2500.000,0,13072500.00,,,3,
33,95000000.00,SHREE DHANLAXMI TRD,859,SHANKARGARH,5209.00,,4000.000,0,20836000.00,,,3,TELE
33,95000000.00,SHREE DHANLAXMI TRD,864,BASEN,6009.00,,5000.000,0,30045000.00,,,3,TELE
33,95000000.00,SHREE DHANLAXMI TRD,856,PARSA,5209.00,,2000.000,0,10418000.00,,,3,TELE
33,95000000.00,SHREE DHANLAXMI TRD,827,DARIMA,5219.00,,2700.000,0,14091300.00,,,3,TELE
33,95000000.00,SHREE DHANLAXMI TRD,858B,RAJPUR,5189.00,,1800.000,0,9340200.00,,,3,TELE
35,95000000.00,SHREE SITA SHANTA TRD,888,SHARDAPUR,5829.00,,2800.000,0,16321200.00,,,3,TELE
35,95000000.00,SHREE SITA SHANTA TRD,896A,SUNDARPUR,5109.00,,2500.000,0,12772500.00,,,3,TELE
35,95000000.00,SHREE SITA SHANTA TRD,875B,VIJAYNAGAR,5109.00,,2500.000,0,12772500.00,,,3,TELE
35,95000000.00,SHREE SITA SHANTA TRD,904,BAJRA,5539.00,,2100.000,0,11631900.00,,,3,TELE
35,95000000.00,SHREE SITA SHANTA TRD,908A,RAGHUNATHNAGAR,5109.00,,1400.000,0,7152600.00,,,3,TELE
35,95000000.00,SHREE SITA SHANTA TRD,892A,RAMCHANDRAPUR,5109.00,,2200.000,0,11239800.00,,,3,TELE
35,95000000.00,SHREE SITA SHANTA TRD,892B,RAMCHANDRAPUR,5109.00,,1800.000,0,9196200.00,,,3,TELE
35,95000000.00,SHREE SITA SHANTA TRD,905,MAHEWA,5109.00,,2700.000,0,13794300.00,,,3,TELE
38,6250000.00,SUPER LEAVES PROCESSORS,33B,KISTARAM,7011.00,,700.000,0,4907700.00,,,3,
7,7300000.00,BIPIN KUMAR MIRANI,592,GURDA,5355.00,,700.000,0,3748500.00,,,3,
15,11250000.00,IMTIAZ AHMED,782,DULDULA,5251.00,,1800.000,0,9451800.00,,,3,
27,9375000.00,NAVED KHAN,37B,POLAMPALLI,6668.00,,1400.000,0,9335200.00,,,3,
37,43750000.00,SIDDHARTH.D.PATEL,310,JUNWANI,5009.00,,1900.000,0,9517100.00,,,3,MH
37,43750000.00,SIDDHARTH.D.PATEL,312,SAHASPUR,5009.00,,2000.000,0,10018000.00,,,3,MH
37,43750000.00,SIDDHARTH.D.PATEL,317,KHADIA,5009.00,,1700.000,0,8515300.00,,,3,MH
39,13750000.00,SYED KHAJA NAIMUDDIN,48,CHHINDGARH,5139.00,,2200.000,0,11305800.00,,,3,
46,33750000.00,moqueet ahmed,911B,BALANGI,5159.00,,3100.000,0,15992900.00,,,3,
46,33750000.00,moqueet ahmed,898,VIRENDRANAGAR,5159.00,,1200.000,0,6190800.00,,,3,
46,33750000.00,moqueet ahmed,808,KHADGAWAN,5009.00,,1200.000,0,6010800.00,,,3,
