<svg width="73" height="78" viewBox="0 0 73 78" fill="none" xmlns="http://www.w3.org/2000/svg">
<path fill-rule="evenodd" clip-rule="evenodd" d="M28.1671 54.7136C28.1367 54.7136 28.4107 54.744 28.9284 54.744L29.3547 71.0353C29.4156 73.6237 31.5472 75.6334 34.1051 75.5725C36.6934 75.5116 38.7032 73.3801 38.6423 70.8222L38.216 54.4395L38.1855 53.3128C42.9663 51.7294 48.2343 48.5016 51.0358 41.8023C53.137 36.8693 54.4768 31.5099 54.4768 26.1201C54.4768 22.6182 53.6546 19.2381 52.0712 16.1321C47.534 7.20997 37.8201 2.18555 27.9844 2.18555C18.1487 2.18555 8.43484 7.20997 3.89764 16.1321C2.34464 19.2381 1.52246 22.6182 1.52246 26.1201C1.52246 31.5099 2.86231 36.8693 4.93298 41.8023C8.28259 49.7196 4.65892 57.5151 5.6638 66.894C5.93786 69.4519 8.25214 71.3094 10.81 71.0353C13.3679 70.7613 15.195 68.447 14.9209 65.8891C14.6773 63.3617 14.8905 57.7587 15.3472 52.3384C16.1694 52.7038 16.9916 53.0388 17.8138 53.2824L17.7833 54.4395L17.3265 70.8222C17.2656 73.3801 19.3059 75.5116 21.8638 75.5725C24.4216 75.6334 26.5532 73.6237 26.6446 71.0353L27.0709 54.744C27.7712 54.744 28.1671 54.7136 28.1671 54.7136Z" fill="#F54773"/>
<path fill-rule="evenodd" clip-rule="evenodd" d="M28.1672 54.7137C28.1672 54.7137 28.4413 54.7441 28.9285 54.7441L29.3548 71.0354C29.4157 73.6238 31.5473 75.6335 34.1052 75.5726C36.6935 75.5117 38.7033 73.3801 38.6424 70.8223L38.1856 53.3129C42.9664 51.7295 48.2344 48.5017 51.0359 41.8024C53.1371 36.8694 54.4769 31.51 54.4769 26.1201C54.4769 22.6183 53.6547 19.2382 52.0713 16.1322C47.5341 7.21006 37.8202 2.18564 27.9845 2.18564C18.1488 2.18564 8.43494 7.21006 3.89773 16.1322C2.34473 19.2382 1.52255 22.6183 1.52255 26.1201C1.52255 31.51 2.8624 36.8694 4.93307 41.8024C8.28268 49.7197 4.65901 57.5152 5.66389 66.8941C5.93795 69.452 8.25223 71.3095 10.8101 71.0354C13.368 70.7614 15.1951 68.4471 14.921 65.8892C14.6774 63.3618 14.8906 57.7588 15.3473 52.3385C16.1695 52.7039 16.9917 53.0389 17.8139 53.2825L17.3266 70.8223C17.2657 73.3801 19.306 75.5117 21.8638 75.5726C24.4217 75.6335 26.5533 73.6238 26.6447 71.0354L27.071 54.7441C27.7409 54.7441 28.1063 54.7137 28.1672 54.7137ZM29.7507 75.3899C28.898 74.5982 28.2586 73.5324 27.9845 72.3448C27.7104 73.5324 27.1014 74.5982 26.2488 75.3899C25.1221 76.4557 23.63 77.0952 21.9856 77.0952H21.8638H21.8334C20.1281 77.0343 18.6056 76.3339 17.5093 75.1768C16.4436 74.0501 15.8041 72.558 15.8041 70.9136V70.8223H15.8345L15.865 69.0866C15.6518 69.5129 15.4082 69.9087 15.1037 70.2741C14.1293 71.4922 12.6676 72.3448 10.9624 72.5275C9.25711 72.7102 7.64321 72.1926 6.42517 71.2181C5.20713 70.2132 4.32405 68.7516 4.17179 67.0463C3.74548 63.0877 4.11089 59.464 4.44585 55.9622C4.93307 51.2118 5.35938 46.7355 3.53232 42.4114C2.40563 39.7318 1.4921 36.9607 0.88308 34.1288C0.30451 31.51 0 28.7998 0 26.1201C0 24.2626 0.213157 22.4356 0.639472 20.639C1.06579 18.8424 1.70526 17.1066 2.55789 15.4623C4.90262 10.8337 8.55674 7.17961 12.8808 4.68262C17.418 2.06383 22.686 0.663086 27.9845 0.663086C33.283 0.663086 38.551 2.06383 43.0882 4.68262C47.4123 7.17961 51.0664 10.8337 53.4416 15.4623C54.2637 17.1066 54.9032 18.8424 55.3295 20.639C55.7863 22.4356 55.9994 24.2626 55.9994 26.1201C55.9994 28.7998 55.6645 31.4795 55.0859 34.1288C54.4769 36.9607 53.5634 39.7318 52.4367 42.4114C51.0664 45.6088 49.1784 48.1058 47.0468 50.0242C44.763 52.0644 42.2051 53.4347 39.7386 54.3787L40.1649 70.6396C40.1649 70.7005 40.1649 70.7614 40.1649 70.8223C40.1954 72.4971 39.5559 74.0501 38.4597 75.1768C37.4243 76.273 35.9627 77.0038 34.3183 77.0952C34.2574 77.0952 34.1965 77.0952 34.1052 77.0952C32.4303 77.1256 30.8773 76.4862 29.7507 75.3899Z" fill="#091570"/>
<path fill-rule="evenodd" clip-rule="evenodd" d="M27.9848 38.879C35.8717 38.879 42.3273 32.4539 42.3273 24.5366C42.3273 16.6498 35.8717 10.2246 27.9848 10.2246C20.098 10.2246 13.6729 16.6498 13.6729 24.5366C13.6729 32.4539 20.098 38.879 27.9848 38.879Z" fill="white"/>
<path fill-rule="evenodd" clip-rule="evenodd" d="M27.9845 30.1088C31.06 30.1088 33.557 27.6118 33.557 24.5362C33.557 21.4911 31.06 18.9941 27.9845 18.9941C24.9394 18.9941 22.4424 21.4911 22.4424 24.5362C22.4424 27.6118 24.9394 30.1088 27.9845 30.1088ZM26.8578 26.1197C28.3194 26.1197 29.507 24.9321 29.507 23.4704C29.507 22.0088 28.3194 20.8212 26.8578 20.8212C25.3961 20.8212 24.2085 22.0088 24.2085 23.4704C24.2085 24.9321 25.3961 26.1197 26.8578 26.1197Z" fill="#091570"/>
<path fill-rule="evenodd" clip-rule="evenodd" d="M36.1153 12.752C33.801 11.1686 30.9995 10.2246 27.9848 10.2246C20.098 10.2246 13.6729 16.6498 13.6729 24.5366C13.6729 31.0531 18.0273 36.5648 23.9958 38.3005C20.2503 35.7121 17.7837 31.3881 17.7837 26.5159C17.7837 18.6291 24.2394 12.2039 32.1262 12.2039C33.4965 12.2039 34.8363 12.3866 36.1153 12.752Z" fill="#E6E6E6"/>
<path fill-rule="evenodd" clip-rule="evenodd" d="M27.9844 39.6408C32.1562 39.6408 35.9321 37.9356 38.6423 35.2254C41.3828 32.4848 43.0881 28.7089 43.0881 24.5371C43.0881 20.3958 41.3828 16.6199 38.6423 13.8793C35.9321 11.1387 32.1562 9.46387 27.9844 9.46387C23.8431 9.46387 20.0671 11.1387 17.3265 13.8793C14.5859 16.6199 12.9111 20.3958 12.9111 24.5371C12.9111 28.7089 14.5859 32.4848 17.3265 35.2254C20.0671 37.9356 23.8431 39.6408 27.9844 39.6408ZM37.5765 34.1292C35.1099 36.5957 31.7299 38.1183 27.9844 38.1183C24.2694 38.1183 20.8589 36.5957 18.3923 34.1292C15.9562 31.6627 14.4337 28.2826 14.4337 24.5371C14.4337 20.8221 15.9562 17.4116 18.3923 14.9755C20.8589 12.509 24.2694 10.9864 27.9844 10.9864C31.7299 10.9864 35.1099 12.509 37.5765 14.9755C40.043 17.4116 41.5656 20.8221 41.5656 24.5371C41.5656 28.2826 40.043 31.6627 37.5765 34.1292Z" fill="#091570"/>
<path fill-rule="evenodd" clip-rule="evenodd" d="M41.4438 5.50471C37.3633 3.34269 32.6739 2.18555 27.9844 2.18555C18.1487 2.18555 8.43484 7.20997 3.89764 16.1321C2.34464 19.2381 1.52246 22.6182 1.52246 26.1201C1.52246 31.5099 2.86231 36.8693 4.93298 41.8023C8.28259 49.7196 4.65892 57.5151 5.6638 66.894C5.93786 69.4519 8.25214 71.3094 10.81 71.0353H10.8405C10.3533 70.3654 10.0183 69.5737 9.92695 68.721C8.92206 59.3421 12.5457 51.5467 9.19612 43.6294C7.12545 38.6963 5.78561 33.337 5.78561 27.9471C5.78561 24.4452 6.60778 21.0652 8.16079 17.9592C12.698 9.03703 22.4119 4.01261 32.2476 4.01261C35.384 4.01261 38.49 4.53028 41.4438 5.50471Z" fill="#D42D57"/>
<path d="M45.342 56.4797C43.8803 56.8755 42.3882 56.6319 41.1702 55.9315C39.9521 55.2312 39.0081 54.074 38.6427 52.6124C38.2469 51.1507 38.4905 49.6891 39.1909 48.471C39.8912 47.253 41.0484 46.309 42.51 45.9131C43.9108 45.5477 44.7938 44.3906 45.4638 42.8985C46.1641 41.2846 46.5905 39.2444 47.0168 37.2651C47.7171 33.9459 48.3566 30.7485 49.8792 28.1297C51.4322 25.4501 53.8073 23.4707 57.8878 22.7399C59.3799 22.4659 60.8415 22.8617 61.9987 23.6534C63.1254 24.4452 63.978 25.6937 64.252 27.1858C64.4957 28.6779 64.1302 30.1395 63.3385 31.2967C62.5163 32.4233 61.2678 33.276 59.7757 33.5196C59.4408 33.5805 59.1058 34.22 58.7709 35.1639C58.375 36.3211 58.04 37.8741 57.7051 39.488C57.0047 42.9289 56.2739 46.4917 54.5382 49.5368C52.772 52.6733 50.0314 55.2312 45.342 56.4797Z" fill="#F54773"/>
<path d="M47.7471 37.4172C47.6557 37.8435 47.2599 38.0871 46.864 37.9957C46.4377 37.9348 46.1941 37.5085 46.255 37.1126C46.6204 35.4378 46.9554 33.7935 47.4121 32.2405C47.8689 30.6266 48.417 29.1345 49.2087 27.7642C50.0309 26.333 51.0967 25.0845 52.4974 24.0796C53.8982 23.1052 55.6035 22.3743 57.7655 21.9785C58.5877 21.8567 59.4098 21.8871 60.2016 22.0394C61.0237 22.2221 61.7546 22.557 62.4245 23.0443C63.0944 23.501 63.673 24.1101 64.0993 24.78C64.5256 25.4803 64.8301 26.2416 64.9824 27.0638C65.1346 27.886 65.1042 28.7082 64.9215 29.4999C64.7388 30.2916 64.4038 31.0529 63.947 31.7228C63.4903 32.3927 62.8812 32.9713 62.1809 33.3976C61.5414 33.7935 60.8106 34.098 60.0493 34.2502C59.7752 34.6157 59.623 35.0115 59.5012 35.4074C59.3185 35.9555 59.1358 36.6254 58.9531 37.3258C58.7704 38.0871 58.6181 38.8788 58.4658 39.6401C58.1004 41.3758 57.735 43.1115 57.2478 44.8777C56.7301 46.6134 56.0907 48.3186 55.2076 49.9325C54.2636 51.5769 53.076 53.069 51.4926 54.3175C49.9396 55.566 47.9907 56.5709 45.5242 57.2103C44.702 57.4539 43.8798 57.4844 43.1185 57.393C42.2964 57.2712 41.5046 56.9972 40.8042 56.6013C39.2817 55.7182 38.5204 54.5611 38.155 53.343C37.82 52.1555 37.881 50.9374 38.0637 49.8716C38.3377 48.2577 39.099 47.801 40.1952 47.1615L40.6215 46.9179C40.987 46.6743 41.4437 46.7961 41.6569 47.1615C41.9005 47.4964 41.7787 47.9837 41.4133 48.1968L40.9565 48.4709C40.2257 48.8972 39.7385 49.2017 39.5558 50.1152C39.4035 51.0288 39.3426 52.0032 39.6167 52.9167C39.8603 53.7998 40.4388 54.622 41.5655 55.2919C42.0832 55.5964 42.6922 55.8096 43.3012 55.8705C43.8798 55.9618 44.5193 55.9314 45.1283 55.7487C47.3817 55.1397 49.1478 54.2566 50.5486 53.1299C51.9798 52.0032 53.0456 50.6633 53.8677 49.1712C54.6899 47.7096 55.2989 46.0957 55.7862 44.4513C56.2429 42.7765 56.6083 41.0408 56.9737 39.3356C57.1565 38.5134 57.3087 37.6912 57.4914 36.9908C57.6741 36.2296 57.8568 35.5292 58.07 34.9202C58.2527 34.4025 58.4354 33.9457 58.6181 33.6412C58.8922 33.154 59.2271 32.8495 59.6534 32.7886C60.2929 32.6668 60.8715 32.4536 61.3587 32.1187C61.9068 31.7837 62.3636 31.3574 62.6985 30.8397C63.064 30.3525 63.3076 29.7739 63.4598 29.1649C63.5816 28.5864 63.6121 27.9469 63.4903 27.3379C63.3685 26.6984 63.1553 26.1198 62.8203 25.6022C62.4854 25.0845 62.0591 24.6277 61.5414 24.2623C61.0542 23.9273 60.4756 23.6533 59.8666 23.5315C59.288 23.4097 58.679 23.3792 58.0395 23.501C56.0907 23.836 54.5986 24.4755 53.3805 25.3281C52.1625 26.1807 51.249 27.277 50.5181 28.5255C49.8178 29.7435 49.3001 31.1442 48.8738 32.6363C48.417 34.1893 48.082 35.7728 47.7471 37.4172Z" fill="#091570"/>
<path d="M23.4472 41.1025C26.3705 41.4984 29.3851 41.5289 32.5216 41.1025C32.9784 41.1025 33.3742 41.4984 33.3742 41.9552C33.3742 43.4168 32.7652 44.7567 31.7908 45.7311C30.8163 46.7055 29.4765 47.3145 27.9844 47.3145C26.5227 47.3145 25.1829 46.7055 24.2085 45.7311C23.234 44.7567 22.625 43.4168 22.625 41.9552C22.625 41.4984 22.9904 41.1025 23.4472 41.1025Z" fill="#091570"/>
<path fill-rule="evenodd" clip-rule="evenodd" d="M27.9848 45.6397C28.5938 45.6397 29.142 45.5179 29.6292 45.2439C29.2638 44.2999 28.7461 43.5691 27.9848 43.0514L24.3916 42.7773C24.5439 43.4777 24.8788 44.0867 25.366 44.574C26.036 45.2439 26.9799 45.6397 27.9848 45.6397Z" fill="#D42D57"/>
<path fill-rule="evenodd" clip-rule="evenodd" d="M46.8336 16.894C47.1381 16.6199 47.6253 16.6504 47.8994 16.9853C48.1735 17.2898 48.143 17.7771 47.8385 18.0511C46.9859 18.8124 46.255 19.6041 45.6765 20.4263C45.0979 21.2789 44.6411 22.1316 44.3366 23.0451C44.0626 23.9586 43.8799 24.9026 43.8494 25.9075C43.819 26.9428 43.9103 28.0086 44.1539 29.1353C44.2453 29.5312 43.9712 29.9575 43.5754 30.0184C43.149 30.1097 42.7532 29.8661 42.6618 29.4398C42.4182 28.1913 42.2964 27.0037 42.3269 25.877C42.3573 24.7199 42.5705 23.6237 42.9054 22.5579C43.2708 21.5225 43.7581 20.5176 44.428 19.5737C45.0675 18.6297 45.8592 17.7466 46.8336 16.894ZM49.7874 20.4567C49.5133 20.1218 49.0261 20.0913 48.7216 20.3654C48.143 20.8831 47.6558 21.4312 47.2599 22.0097C46.8336 22.5883 46.5291 23.1973 46.3159 23.8368V23.8673C46.1028 24.5067 45.981 25.1767 45.9505 25.877C45.9505 26.5774 46.0114 27.3082 46.1637 28.0695C46.255 28.4958 46.6509 28.7394 47.0772 28.6481C47.4731 28.5567 47.7471 28.1609 47.6558 27.765C47.5035 27.1255 47.4731 26.5165 47.4731 25.9379C47.5035 25.3898 47.5949 24.8417 47.7471 24.324C47.9299 23.8368 48.1735 23.3496 48.5084 22.8624C48.8434 22.4056 49.2392 21.9488 49.7265 21.5225C50.031 21.2485 50.0614 20.7613 49.7874 20.4567ZM65.3783 34.0379C65.6524 34.3424 66.1091 34.3729 66.4441 34.0988C67.0227 33.5811 67.5099 33.033 67.9057 32.4849C68.3016 31.9063 68.6366 31.2669 68.8497 30.6274C69.0629 29.9879 69.1847 29.318 69.1847 28.5872C69.2151 27.8868 69.1542 27.156 69.002 26.3947C68.9106 25.9988 68.4843 25.7248 68.0884 25.8161C67.6926 25.9075 67.4185 26.3033 67.5099 26.7297C67.6317 27.3691 67.6926 27.9781 67.6926 28.5567C67.6621 29.1048 67.5708 29.653 67.3881 30.1402C67.2358 30.6578 66.9922 31.1451 66.6572 31.6018C66.3223 32.089 65.9264 32.5458 65.4392 32.9721C65.1347 33.2462 65.0738 33.7029 65.3783 34.0379ZM67.2663 37.5093C67.5403 37.8138 68.0275 37.8443 68.332 37.5702C69.276 36.748 70.0982 35.8345 70.7377 34.921C71.4076 33.9466 71.8948 32.9721 72.2602 31.9063C72.5952 30.871 72.7779 29.7748 72.8388 28.6176C72.8692 27.4605 72.7474 26.2729 72.4734 25.0244C72.4125 24.6285 71.9862 24.3545 71.5903 24.4458C71.164 24.5372 70.9204 24.933 71.0117 25.3594C71.2249 26.486 71.3467 27.5518 71.3162 28.5567C71.2858 29.5616 71.1031 30.536 70.7986 31.4496C70.4941 32.3631 70.0678 33.2157 69.4892 34.0379C68.9106 34.8905 68.1798 35.6823 67.3272 36.4435C67.0226 36.7176 66.9922 37.2048 67.2663 37.5093Z" fill="#091570"/>
<path d="M59.3186 32.6978C59.684 32.8805 59.8363 33.3372 59.6536 33.7331C59.4709 34.0985 59.0141 34.2508 58.6487 34.0681L58.4355 33.9462C58.1919 33.4286 57.857 32.9718 57.4307 32.576C57.6438 32.2105 58.0701 32.0887 58.4355 32.2714L59.3186 32.6978Z" fill="#091570"/>
</svg>
