<svg width="793" height="352" viewBox="0 0 793 352" fill="none" xmlns="http://www.w3.org/2000/svg">
<path d="M788.742 68.3303C585.405 55.1769 327.484 136.253 14.8756 311.445C13.4303 312.255 12.9152 314.084 13.7252 315.529C14.5352 316.974 16.3636 317.49 17.8089 316.68C329.498 142.002 586.381 61.2526 788.355 74.3178C790.009 74.4247 791.436 73.1711 791.543 71.5177C791.649 69.8643 790.396 68.4372 788.742 68.3303Z" fill="url(#paint0_linear)"/>
<path fill-rule="evenodd" clip-rule="evenodd" d="M645.624 84.2751C643.553 84.4437 641.65 84.3233 639.628 83.938L637.581 96.2427C636.69 101.564 628.647 100.216 629.514 94.9183L631.754 81.5541C631.392 81.3615 631.031 81.1688 630.67 80.9521C630.092 83.4564 629.057 88.3927 628.985 90.897C628.816 96.2667 620.629 96.0019 620.797 90.6321C621.038 83.336 624.698 77.3884 622.989 71.0314C621.183 64.2168 620.87 56.4873 625.06 50.4674C634.643 36.718 658 39.9206 663.491 55.8372C665.874 62.7721 663.442 70.1163 659.83 76.1603C658.386 78.6164 656.411 80.5669 653.931 81.9635C653.786 85.6236 653.377 91.5953 652.51 95.0387C651.981 97.2299 649.741 98.5784 647.55 98.0245C645.383 97.4707 644.034 95.2554 644.588 93.0642C645.118 90.897 645.455 86.5627 645.624 84.2751Z" fill="#F54773"/>
<path fill-rule="evenodd" clip-rule="evenodd" d="M624.77 94.4364H624.819C622.627 90.4874 628.527 80.3499 626.528 72.813C624.746 66.143 624.409 58.5097 628.527 52.6102C634.547 43.9657 646.659 41.8467 655.954 46.47L655.905 46.1569C643.047 37.0067 624.217 43.5323 622.17 58.2208C621.592 62.4829 622.049 66.8413 623.157 70.983C624.867 77.4604 621.134 83.5043 620.966 90.6559C620.918 92.7509 622.507 94.4846 624.578 94.6772L624.77 94.4364Z" fill="#D42D57"/>
<path fill-rule="evenodd" clip-rule="evenodd" d="M646.056 83.841C645.816 87.6696 645.406 91.402 644.973 93.1598C643.793 97.8794 650.945 99.6613 652.125 94.9417C652.847 92.028 653.353 86.7064 653.545 81.6979C655.761 80.518 657.855 78.688 659.493 75.9429C663.033 70.0193 665.441 62.7714 663.105 55.9569C657.735 40.4015 634.787 37.1989 625.372 50.7075C621.255 56.607 621.616 64.2402 623.398 70.9103C625.131 77.4599 621.447 83.1908 621.206 90.6314C621.062 95.4714 628.43 95.7122 628.575 90.8722C628.647 88.8495 629.418 84.4911 630.405 80.3013C630.983 80.6866 631.609 81.0237 632.211 81.3126L629.923 94.9898C629.129 99.7576 636.377 100.962 637.171 96.1938L639.29 83.4557C641.602 83.9373 643.649 84.0577 646.056 83.841ZM644.371 89.307C644.515 88.079 644.66 86.6342 644.756 85.1172L640.277 84.8764L638.375 96.3864C637.34 102.575 627.636 101.419 628.791 94.5082L628.96 93.4728C626.239 97.5423 619.858 95.4714 620.002 90.6073C620.243 83.2631 623.855 77.3154 622.218 71.2233C620.364 64.168 620.051 56.2458 624.385 50.0092C634.378 35.7059 658.554 39.0771 664.237 55.5716C666.717 62.7473 664.237 70.3083 660.528 76.569C659.035 79.0732 657.085 81.0237 654.701 82.4203C654.557 86.2008 654.123 91.9317 653.28 95.2306C652.245 99.4445 646.586 100.287 644.347 96.555C643.047 94.3878 643.986 92.6541 644.371 89.307Z" fill="#091570"/>
<path d="M642.613 73.1024C641.529 72.958 641.433 73.3673 641.457 74.3546C641.602 78.1351 646.297 79.8929 648.874 77.0274C649.476 76.3773 650.607 74.2342 649.355 74.0415L642.613 73.1024Z" fill="#091570"/>
<path fill-rule="evenodd" clip-rule="evenodd" d="M642.806 74.4746L645.599 74.8599C646.105 75.4619 646.466 76.1843 646.634 76.9789C644.852 77.5809 642.974 76.3287 642.806 74.4746Z" fill="#D42D57"/>
<path fill-rule="evenodd" clip-rule="evenodd" d="M648.681 72.114C654.846 72.9568 660.601 68.6224 661.468 62.4581C662.334 56.2696 657.976 50.5146 651.812 49.6477C645.623 48.805 639.868 53.1393 639.025 59.3037C638.159 65.4921 642.493 71.2471 648.681 72.114Z" fill="white"/>
<path fill-rule="evenodd" clip-rule="evenodd" d="M657.879 52.5375C651.209 46.3732 640.277 50.2981 639.025 59.3039C638.303 64.4088 641.144 69.2247 645.623 71.2233C637.436 63.7105 643.889 50.1296 654.821 51.6466C655.905 51.8152 656.94 52.1041 657.879 52.5375Z" fill="#E6E6E6"/>
<path d="M648.753 71.512C658.12 72.8123 664.574 62.0728 658.794 54.4155C653.015 46.7582 640.927 50.033 639.603 59.4C638.784 65.2513 642.902 70.6933 648.753 71.512ZM657.422 70.4043C648.922 76.8336 636.954 69.6579 638.423 59.2314C639.868 48.805 653.328 45.193 659.758 53.6931C663.731 58.9665 662.695 66.4071 657.422 70.4043Z" fill="#091570"/>
<path fill-rule="evenodd" clip-rule="evenodd" d="M652.51 72.0176L657.182 73.8476L654.918 79.6267C652.775 79.9879 650.993 80.2769 649.211 80.4695L652.51 72.0176ZM651.378 88.6566C650.728 91.4739 646.827 91.5702 646.346 88.7288C647.935 88.9214 649.693 88.8974 651.378 88.6566Z" fill="#E6BC68"/>
<path d="M651.908 79.6277C653.329 76.5937 657.663 76.4492 659.252 79.4591L660.432 82.5413C661.636 89.9337 640.037 92.149 639.989 84.5158C639.964 82.2523 641.746 80.4223 643.986 80.3741C647.212 80.1333 648.97 80.037 651.908 79.6277Z" fill="#F54773"/>
<path d="M657.976 73.5115L656.748 76.6178C657.59 76.8104 658.361 77.2198 658.987 77.8218C659.878 78.6886 660.263 79.6759 660.6 80.8558C660.841 81.7227 661.034 82.6377 661.034 83.1674C660.962 86.4182 656.579 88.6576 651.763 89.38C650.68 92.125 647.044 92.0287 645.984 89.5726C645.912 89.38 638.134 88.9947 639.29 83.4564L640.47 83.6731C638.857 91.2341 660.913 88.9465 659.782 82.6136C659.637 81.7227 659.372 80.7836 659.011 79.9408C657.494 76.4252 652.437 77.2439 651.98 80.9039C651.546 80.9521 651.282 80.615 651.258 80.2297C650.342 80.326 649.452 80.4464 648.537 80.5428L652.173 71.248L657.976 73.5115ZM655.52 76.4733L656.411 74.1858L652.847 72.7891L650.367 79.1461L651.33 79.0498C652.148 77.4847 653.762 76.5215 655.52 76.4733ZM650.27 89.5485C649.331 89.6448 648.368 89.6689 647.453 89.6448C648.223 90.4635 649.548 90.4154 650.27 89.5485Z" fill="#091570"/>
<path fill-rule="evenodd" clip-rule="evenodd" d="M661.299 74.6182C664.068 71.7769 665.465 65.9496 665.224 60.7243C665.007 55.7399 663.274 51.3333 660.119 48.9013C654.846 48.7568 649.789 51.8871 647.742 57.0883C645.142 63.7343 648.416 71.223 655.062 73.8236C657.109 74.6182 659.252 74.859 661.299 74.6182Z" fill="#C7A4BA"/>
<path fill-rule="evenodd" clip-rule="evenodd" d="M652.991 72.7876C657.615 71.4632 661.251 67.5383 661.949 62.5056C662.72 57.1359 659.878 52.0551 655.303 49.6953C651.956 50.9234 649.139 53.524 647.742 57.0877C645.43 63.0113 647.766 69.585 652.991 72.7876Z" fill="#CCFFFF"/>
<path fill-rule="evenodd" clip-rule="evenodd" d="M653.858 68.9607C656.507 69.3219 658.963 67.4677 659.324 64.8431C659.685 62.1943 657.831 59.7382 655.206 59.377C652.558 59.0158 650.126 60.8699 649.74 63.4946C649.379 66.1434 651.233 68.5754 653.858 68.9607ZM653.376 65.3969C654.628 65.5655 655.808 64.6745 655.977 63.4224C656.17 62.1462 655.279 60.9903 654.002 60.7977C652.75 60.6292 651.57 61.5201 651.402 62.7722C651.233 64.0484 652.124 65.2043 653.376 65.3969Z" fill="#518BB8"/>
<path d="M652.245 72.2818C663.249 69.7535 664.694 54.6797 654.485 50.0323C655.014 49.7915 655.592 49.5748 656.17 49.4062C665.922 55.0649 664.502 69.609 653.786 73.2209C653.256 72.9561 652.727 72.643 652.245 72.2818Z" fill="#518BB8"/>
<path fill-rule="evenodd" clip-rule="evenodd" d="M663.153 72.9337C669.895 70.7906 672.375 63.3259 670.425 57.595C669.221 54.1757 665.922 51.7918 662.406 50.4434C666.596 58.3655 665.392 64.9152 663.153 72.9337Z" fill="#CCFFFF"/>
<path fill-rule="evenodd" clip-rule="evenodd" d="M661.299 74.6193C665.657 65.8784 666.621 56.8004 660.119 48.9023C660.721 48.9264 661.323 48.9746 661.925 49.0709C667.704 56.9449 666.958 65.734 662.912 74.3063C662.383 74.4508 661.853 74.5471 661.299 74.6193Z" fill="#518BB8"/>
<path fill-rule="evenodd" clip-rule="evenodd" d="M672.785 67.0098C675.65 59.6655 672.038 51.3581 664.67 48.4926C657.326 45.6031 649.018 49.2391 646.153 56.5834C643.263 63.9517 646.899 72.2351 654.244 75.1005C661.612 77.9901 669.895 74.3541 672.785 67.0098ZM663.731 50.8765C669.775 53.2363 672.737 60.0508 670.377 66.0707C668.017 72.1147 661.227 75.0765 655.183 72.7167C649.163 70.3569 646.177 63.5664 648.537 57.5225C650.896 51.5026 657.711 48.5167 663.731 50.8765Z" fill="#E6BC68"/>
<path d="M664.886 47.9392C677.215 52.7551 677.552 70.1405 665.44 75.438C653.304 80.7355 640.759 68.6957 645.599 56.367C648.609 48.7097 657.229 44.9292 664.886 47.9392ZM672.014 56.3189C667.102 45.0737 651.041 45.5794 646.706 56.8245C642.3 68.2864 653.906 79.1704 664.959 74.3544C671.87 71.3204 675.048 63.2297 672.014 56.3189Z" fill="#091570"/>
<path d="M663.948 50.323C674.158 54.2961 674.447 68.6957 664.405 73.1023C654.388 77.4847 643.986 67.5158 647.983 57.3061C650.463 50.9732 657.615 47.8428 663.948 50.323ZM669.655 57.3302C665.706 48.2762 652.703 48.5411 649.115 57.7395C645.503 66.962 654.87 75.9437 663.924 71.9946C669.558 69.5385 672.111 62.9648 669.655 57.3302Z" fill="#091570"/>
<defs>
<linearGradient id="paint0_linear" x1="59.1958" y1="333.055" x2="784.285" y2="69.1439" gradientUnits="userSpaceOnUse">
<stop stop-color="white"/>
<stop offset="0.214379" stop-color="#DCE4FF"/>
<stop offset="0.412006" stop-color="#A1B8FF"/>
<stop offset="0.586893" stop-color="#6A80FF"/>
<stop offset="1" stop-color="#FF5580"/>
</linearGradient>
</defs>
</svg>
