<svg width="158" height="35" viewBox="0 0 158 35" fill="none" xmlns="http://www.w3.org/2000/svg">
<path d="M63.6006 13.0846H68.798C67.932 7.56051 63.1469 3.71272 56.9179 3.71272C49.5479 3.71272 44.0203 9.1269 44.0203 18.1966C44.0203 27.1014 49.3003 32.6257 57.0692 32.6257C64.0406 32.6257 69.0319 28.1457 69.0319 20.8899V17.5094H57.6055V21.4947H64.0956C64.0132 25.5072 61.3317 28.0495 57.0969 28.0495C52.3805 28.0495 49.1493 24.5178 49.1493 18.1416C49.1493 11.8067 52.4355 8.28874 56.9869 8.28874C60.3831 8.28874 62.693 10.1026 63.6006 13.0846Z" fill="#fff"/>
<path d="M74.9697 7.79083C76.5509 7.79083 77.8433 6.58137 77.8433 5.09731C77.8433 3.59957 76.5509 2.39011 74.9697 2.39011C73.3747 2.39011 72.0822 3.59957 72.0822 5.09731C72.0822 6.58137 73.3747 7.79083 74.9697 7.79083ZM72.4671 32.2407H77.4446V11.1332H72.4671V32.2407Z" fill="#fff"/>
<path d="M92.3501 11.1332H88.1837V6.0762H83.2063V11.1332H80.2087V14.981H83.2063V26.7166C83.1791 30.688 86.0664 32.6392 89.8063 32.5292C91.2226 32.4882 92.1991 32.2134 92.7351 32.0345L91.8967 28.1457C91.6215 28.2144 91.0578 28.338 90.4389 28.338C89.1878 28.338 88.1837 27.8983 88.1837 25.8919V14.981H92.3501V11.1332Z" fill="#fff"/>
<path d="M96.2024 32.2407H113.706V27.9671H101.304V4.09745H96.2024V32.2407Z" fill="#fff"/>
<path d="M124.876 29.0115C122.799 29.0115 121.314 28.0631 121.314 26.2356C121.314 24.3255 122.978 23.5284 125.206 23.2123C126.512 23.0337 129.125 22.7039 129.771 22.1816V24.669C129.771 27.0188 127.873 29.0115 124.876 29.0115ZM123.239 32.6667C126.553 32.6667 128.533 31.114 129.44 29.3412H129.605V32.2407H134.391V18.1142C134.391 12.5349 129.839 10.8584 125.81 10.8584C121.369 10.8584 117.959 12.8373 116.859 16.6849L121.507 17.3445C122.002 15.9017 123.404 14.6649 125.838 14.6649C128.148 14.6649 129.413 15.8467 129.413 17.9217V18.0041C129.413 19.4334 127.914 19.502 124.188 19.9005C120.09 20.3402 116.172 21.5633 116.172 26.3179C116.172 30.4681 119.21 32.6667 123.239 32.6667Z" fill="#fff"/>
<path d="M142.944 21.687C142.944 17.592 144.704 14.9397 147.907 14.9397C151.221 14.9397 152.927 17.7569 152.927 21.687C152.927 25.6447 151.194 28.5305 147.907 28.5305C144.731 28.5305 142.944 25.782 142.944 21.687ZM138.063 32.2407H142.957V28.9152H143.246C144.03 30.4543 145.666 32.6118 149.296 32.6118C154.274 32.6118 158 28.668 158 21.7146C158 14.6786 154.164 10.8584 149.283 10.8584C145.556 10.8584 144.002 13.0983 143.246 14.6236H143.04V4.09747H138.063V32.2407Z" fill="#fff"/>
<path d="M34.9462 13.7378L34.8976 13.6105L30.0598 0.996159C29.9631 0.749157 29.7892 0.540928 29.563 0.397015C29.3373 0.252644 29.0728 0.184452 28.8047 0.198593C28.5379 0.212734 28.2816 0.31012 28.0726 0.476383C27.8649 0.644241 27.715 0.871174 27.6447 1.1273L24.3783 11.1182H11.1628L7.89642 1.1273C7.82591 0.871174 7.67597 0.644241 7.46853 0.476383C7.25949 0.31012 7.00321 0.212734 6.73644 0.198593C6.46806 0.184452 6.20357 0.252644 5.9781 0.397015C5.75172 0.540928 5.57782 0.749157 5.48129 0.996159L0.643491 13.6114L0.594654 13.7378C-0.838725 17.475 0.38265 21.6993 3.57483 24.1123L3.59218 24.1251L3.63485 24.1572L11.0039 29.6706L14.6487 32.428L16.8669 34.1041C17.4011 34.5084 18.1398 34.5084 18.6743 34.1041L20.8922 32.428L24.5363 29.6706L31.9489 24.1251L31.9683 24.11C35.1585 21.6972 36.3792 17.4741 34.9462 13.7378Z" fill="#DD4732"/>
<path d="M34.9464 13.7378L34.8978 13.6105C32.4975 14.1034 30.2871 15.1181 28.3941 16.5335C28.3635 16.5561 22.6421 20.8801 17.7708 24.5609C21.3879 27.2943 24.5365 29.6706 24.5365 29.6706L31.9491 24.125L31.9685 24.11C35.1587 21.6972 36.3794 17.474 34.9464 13.7378Z" fill="#EA6A34"/>
<path d="M11.004 29.6706L14.6488 32.428L16.8669 34.1041C17.4012 34.5084 18.1399 34.5084 18.6744 34.1041L20.8923 32.428L24.5364 29.6706C24.5364 29.6706 21.3878 27.2943 17.7706 24.5609C14.1526 27.2943 11.004 29.6706 11.004 29.6706Z" fill="#ED9533"/>
<path d="M7.1463 16.5335C5.25422 15.1188 3.04425 14.1034 0.643491 13.6114L0.594654 13.7378C-0.838725 17.475 0.38265 21.6993 3.57483 24.1123L3.59218 24.125L3.63485 24.1572L11.0039 29.6706C11.0039 29.6706 14.1525 27.2943 17.7706 24.5609C12.899 20.8801 7.17688 16.5561 7.1463 16.5335Z" fill="#EA6A34"/>
</svg>
