{
  "name": "flow-retail-source",
  "config": {
    "connector.class": "io.zeebe.kafka.connect.ZeebeSourceConnector",
    "tasks.max": "1",
    "key.converter": "org.apache.kafka.connect.storage.StringConverter",
    "value.converter": "org.apache.kafka.connect.storage.StringConverter",

    "__zeebe.client.gateway.address": "zeebe:26500",
    "__zeebe.client.requestTimeout": "10000",
    "__zeebe.client.security.plaintext": true,
    "zeebe.client.cloud.clusterId": "2d3589a9-4470-45d5-b3aa-1ee736576b98",
    "zeebe.client.cloud.region": "bru-2",
    "zeebe.client.cloud.clientId": "9mk~0th6hEKpLn13.D5019OuzrAvJ0GV",
    "zeebe.client.cloud.clientSecret": ".kzuRkyP0LzDHgp2VxNQwHAqr.hhVRCTczz1vC0~gKl.Hd2gmInVfUCv-NGrUMhZ",

    "zeebe.client.job.worker": "kafka-connector",
    "zeebe.client.worker.maxJobsActive": "100",
    "zeebe.client.job.pollinterval": "2000",
    "zeebe.client.job.timeout": "5000",
    "job.types": "sendMessage",
    "job.header.topics": "kafka-topic"
  }
}
