<?xml version="1.0" encoding="utf-8"?>
<!-- Generator: Adobe Illustrator 12.0.0, SVG Export Plug-In . SVG Version: 6.00 Build 51448)  -->
<!DOCTYPE svg PUBLIC "-//W3C//DTD SVG 1.1//EN" "http://www.w3.org/Graphics/SVG/1.1/DTD/svg11.dtd" [
	<!ENTITY ns_svg "http://www.w3.org/2000/svg">
	<!ENTITY ns_xlink "http://www.w3.org/1999/xlink">
]>
<svg  version="1.1" id="Calque_1" xmlns="&ns_svg;" xmlns:xlink="&ns_xlink;" width="512" height="512" viewBox="0 0 512 512"
	 overflow="visible" enable-background="new 0 0 512 512" xml:space="preserve">
<path fill="#FFFFFF" d="M-487,200.5V355h44.5h44.5V200.5V46h-44.5H-487V200.5z M-410.5,100.5v18h-31.8h-31.8v-17.8
	c0-9.7,0.1-17.9,0.1-18.2s14.3-0.399,31.8-0.3l31.7,0.3V100.5z"/>
<rect x="0.5" y="83" width="511" height="348.5"/>
<path fill="#FFFFFF" d="M322.095,254.786v154.989h36.07h36.07V254.786V99.797h-36.07h-36.07V254.786z M384.105,154.47v18.057
	h-25.777h-25.775v-17.856c0-9.731,0.081-17.957,0.081-18.258c0-0.3,11.591-0.4,25.775-0.3l25.696,0.3V154.47z"/>
<path fill="#FFFFFF" d="M190.926,99.64c-0.887,0.178-5.501,12.066-19.252,49.327c-4.969,13.397-10.024,26.793-11.18,29.72
	c-1.063,2.928-5.854,15.704-10.556,28.39c-4.704,12.687-10.38,27.857-12.599,33.712c-2.218,5.856-5.323,14.195-6.92,18.631
	c-1.598,4.347-7.63,20.317-13.308,35.487c-5.679,15.082-12.51,33.27-15.082,40.367c-2.661,7.097-6.831,18.276-9.315,24.841
	c-2.573,6.565-5.944,15.614-7.541,20.139l-3.017,8.163l5.944,2.218c3.283,1.241,15.969,6.032,28.301,10.733
	c12.244,4.614,22.534,8.429,22.712,8.429c0.266,0,2.662-5.854,5.322-13.13c12.688-33.535,20.85-55.449,27.769-74.258
	c4.171-11.266,9.76-25.994,12.333-32.825c2.661-6.831,8.072-21.203,11.977-31.938c3.992-10.735,8.96-24.132,11.09-29.721
	c2.129-5.589,9.493-25.373,16.412-43.916c6.921-18.542,14.905-40.011,17.833-47.642c2.839-7.718,5.234-14.46,5.234-15.17
	c0-0.622-2.572-2.041-6.032-3.283c-3.283-1.065-11.978-4.347-19.253-7.098c-7.363-2.839-17.122-6.564-21.734-8.25
	C195.45,100.794,191.281,99.463,190.926,99.64z M193.409,137.434c0.444,0.089,6.033,2.041,12.421,4.525
	c6.299,2.484,13.219,5.056,15.26,5.767l3.726,1.419l-2.927,8.073c-3.815,10.292-4.171,11.268-4.614,11.268
	s-30.874-11.622-31.229-11.977c-0.089-0.088,1.331-4.436,3.105-9.582C191.014,141.692,192.877,137.434,193.409,137.434z
	 M121.548,343.703c1.42,0.71,7.985,3.105,14.372,5.412c7.985,2.928,11.8,4.702,11.8,5.589c0,1.065-5.943,17.478-6.653,18.543
	c-0.089,0.088-6.565-2.218-14.284-5.234c-7.719-3.018-14.992-5.767-16.058-6.211c-1.863-0.71-1.863-0.799,1.774-10.025
	C116.403,341.752,116.669,341.484,121.548,343.703z"/>
<path fill="#FFFFFF" d="M249.109,254.821l0.279,154.779l31.981,0.28l31.889,0.186V255.007V100.042H281.09h-32.168L249.109,254.821z
	 M299.271,190.485v16.783H281.09h-18.182v-16.783v-16.783h18.182h18.182V190.485z M299.737,363.912v10.723l-17.902,0.28
	L263.84,375.1v-11.188v-11.189l17.995,0.188l17.902,0.279V363.912z"/>
</svg>
