{
    "0":{
        "a_star":{
            "min_steps":1,
            "num_nodes_visited":5,
            "search_time":0.0030069351196289062
        },
        "bfs":{
            "min_steps":1,
            "num_nodes_visited":6,
            "search_time":0.004995107650756836
        }
    },
    "19":{
        "a_star":{
            "min_steps":22,
            "num_nodes_visited":477,
            "search_time":0.5881261825561523
        },
        "bfs":{
            "min_steps":22,
            "num_nodes_visited":485,
            "search_time":0.5856616497039795
        }
    },
    "29":{
        "a_star":{
            "min_steps":31,
            "num_nodes_visited":4292,
            "search_time":20.6943039894104
        },
        "bfs":{
            "min_steps":31,
            "num_nodes_visited":4328,
            "search_time":10.094762802124023
        }
    },
    "3":{
        "a_star":{
            "min_steps":14,
            "num_nodes_visited":604,
            "search_time":1.1262457370758057
        },
        "bfs":{
            "min_steps":14,
            "num_nodes_visited":776,
            "search_time":0.8441975116729736
        }
    },
    "302":{
        "a_star":{
            "min_steps":23,
            "num_nodes_visited":3988,
            "search_time":19.947969913482666
        },
        "bfs":{
            "min_steps":23,
            "num_nodes_visited":4737,
            "search_time":12.339816808700562
        }
    },
    "303":{
        "a_star":{
            "min_steps":23,
            "num_nodes_visited":4792,
            "search_time":40.926507234573364
        },
        "bfs":{
            "min_steps":23,
            "num_nodes_visited":5795,
            "search_time":22.233192443847656
        }
    },
    "304":{
        "a_star":{
            "min_steps":23,
            "num_nodes_visited":116,
            "search_time":0.10002350807189941
        },
        "bfs":{
            "min_steps":23,
            "num_nodes_visited":116,
            "search_time":0.08302497863769531
        }
    },
    "321":{
        "a_star":{
            "min_steps":28,
            "num_nodes_visited":821,
            "search_time":1.0692410469055176
        },
        "bfs":{
            "min_steps":28,
            "num_nodes_visited":853,
            "search_time":0.755692720413208
        }
    },
    "325":{
        "a_star":{
            "min_steps":27,
            "num_nodes_visited":7110,
            "search_time":89.44524836540222
        },
        "bfs":{
            "min_steps":27,
            "num_nodes_visited":8482,
            "search_time":54.244248390197754
        }
    },
    "332":{
        "a_star":{
            "min_steps":34,
            "num_nodes_visited":1908,
            "search_time":4.929656505584717
        },
        "bfs":{
            "min_steps":34,
            "num_nodes_visited":2299,
            "search_time":3.413337230682373
        }
    },
    "333":{
        "a_star":{
            "min_steps":34,
            "num_nodes_visited":558,
            "search_time":0.7151613235473633
        },
        "bfs":{
            "min_steps":34,
            "num_nodes_visited":648,
            "search_time":0.5778005123138428
        }
    },
    "340":{
        "a_star":{
            "min_steps":43,
            "num_nodes_visited":2999,
            "search_time":8.47748613357544
        },
        "bfs":{
            "min_steps":43,
            "num_nodes_visited":3043,
            "search_time":4.259862661361694
        }
    },
    "7":{
        "a_star":{
            "min_steps":13,
            "num_nodes_visited":2213,
            "search_time":8.009096384048462
        },
        "bfs":{
            "min_steps":13,
            "num_nodes_visited":4945,
            "search_time":16.366950273513794
        }
    },
    "8":{
        "a_star":{
            "min_steps":12,
            "num_nodes_visited":894,
            "search_time":1.3192968368530273
        },
        "bfs":{
            "min_steps":12,
            "num_nodes_visited":952,
            "search_time":0.8455719947814941
        }
    },
    "801":{
        "a_star":{
            "min_steps":13,
            "num_nodes_visited":2104,
            "search_time":6.446798324584961
        },
        "bfs":{
            "min_steps":13,
            "num_nodes_visited":3062,
            "search_time":5.630371332168579
        }
    }
}