testCaseName,lenderName,propertyOwner,creditHistory,vehicleCondition,assetAge,employmentStatus,productCode,interestRateMin,interestRateMax
PropertyOwner = True And CreditImpairments = No Impairments,PepperTierAPeA1,Homeowner,No impairments,New,0,,PeA1,3.99,5.99
,PepperTierAPeA1,Homeowner,No impairments,New,1,,PeA1,3.99,5.99
,PepperTierAPeA1,Homeowner,No impairments,New,2,,PeA1,3.99,5.99
,PepperTierAPeA1,Homeowner,No impairments,Used,2,,PeA1,3.99,5.99
,PepperTierAPeA1,Homeowner,No impairments,Used,0,,PeA1,3.99,5.99
,PepperTierAPeA1,Homeowner,No impairments,Used,1,,PeA1,3.99,5.99
,PepperTierAPeA1,Homeowner,No impairments,Used,2,,PeA1,3.99,5.99
,PepperTierAPeA2,Homeowner,No impairments,Used,3,,PeA2,5.39,7.39
,PepperTierAPeA2,Homeowner,No impairments,Used,5,,PeA2,5.39,7.39
,PepperTierAPeA3,Homeowner,No impairments,Used,6,,PeA3,5.89,7.89
,PepperTierAPeA3,Homeowner,No impairments,Used,9,,PeA3,5.89,7.89
,PepperTierAPeA4,Homeowner,No impairments,Used,10,,PeA4,7.74,9.74
,PepperTierAPeA4,Homeowner,No impairments,Used,11,,PeA4,7.74,9.74
PropertyOwner = false AndCreditImpairments = No Impairments,PepperTierBPeB1,Renter,No impairments,New,0,,PeB1,5.39,7.39
,PepperTierBPeB1,Renter,No impairments,New,1,,PeB1,5.39,7.39
,PepperTierBPeB1,Renter,No impairments,New,2,,PeB1,5.39,7.39
,PepperTierBPeB1,Renter,No impairments,Used,2,,PeB1,5.39,7.39
,PepperTierBPeB1,Renter,No impairments,Used,0,,PeB1,5.39,7.39
,PepperTierBPeB1,Renter,No impairments,Used,1,,PeB1,5.39,7.39
,PepperTierBPeB1,Renter,No impairments,Used,2,,PeB1,5.39,7.39
,PepperTierBPeB2,Boarder,No impairments,Used,3,,PeB2,5.89,7.89
,PepperTierBPeB2,Renter,No impairments,Used,5,,PeB2,5.89,7.89
,PepperTierBPeB3,Renter,No impairments,Used,6,,PeB3,7.24,9.24
,PepperTierBPeB3,Boarder,No impairments,Used,9,,PeB3,7.24,9.24
,PepperTierBPeB4,Renter,No impairments,Used,10,,PeB4,8.24,10.24
,PepperTierBPeB4,Renter,No impairments,Used,11,,PeB4,8.24,10.24
"PropertyOwner = false, CreditImpairments = No Impairments And Casual Employment",PepperTierCPeC1,Boarder,No impairments,New,0,Casual,PeC1,7.99,9.99
,PepperTierCPeC1,Renter,No impairments,New,1,Casual,PeC1,7.99,9.99
,PepperTierCPeC1,Renter,No impairments,New,2,Casual,PeC1,7.99,9.99
,PepperTierCPeC1,Renter,No impairments,Used,2,Casual,PeC1,7.99,9.99
,PepperTierCPeC1,Other,No impairments,Used,0,Casual,PeC1,7.99,9.99
,PepperTierCPeC1,Renter,No impairments,Used,1,Casual,PeC1,7.99,9.99
,PepperTierCPeC1,Other,No impairments,Used,2,Casual,PeC1,7.99,9.99
,PepperTierCPeC2,Renter,No impairments,Used,3,Casual,PeC2,8.39,10.39
,PepperTierCPeC2,Other,No impairments,Used,5,Casual,PeC2,8.39,10.39
,PepperTierCPeC3,Renter,No impairments,Used,6,Casual,PeC3,8.89,10.89
,PepperTierCPeC3,Renter,No impairments,Used,9,Casual,PeC3,8.89,10.89
,PepperTierCPeC4,Renter,No impairments,Used,10,Casual,PeC4,9.99,11.99
,PepperTierCPeC4,Renter,No impairments,Used,11,Casual,PeC4,9.99,11.99
