<svg xmlns="http://www.w3.org/2000/svg" width="40" height="40" viewBox="0 0 40 40">
    <g fill="none" fill-rule="evenodd">
        <rect width="40" height="40" fill="#FFFAD7" rx="20"/>
        <path fill="#ECCF00" fill-rule="nonzero" d="M26.22 24.934l-3.94-7.444v-3.78h.39c.172 0 .312-.14.312-.315v-.636a.313.313 0 0 0-.313-.315h-4.753a.313.313 0 0 0-.312.315v.636c0 .175.14.315.312.315h.357v3.78l-3.627 7.412c-.927 1.465-.282 2.654 1.442 2.654h8.739c1.723 0 2.347-1.174 1.393-2.622zm-6.828-6.886l.129-.264V13.71h1.51v4.095l.147.278 1.689 3.19h-5.053l1.578-3.225z"/>
    </g>
</svg>
