<svg xmlns="http://www.w3.org/2000/svg" width="213" height="180" viewBox="0 0 213 180">
    <g fill="none" fill-rule="evenodd">
        <path fill="#F2F6F9" fill-rule="nonzero" d="M90.012 165.712h.005a3.507 3.507 0 1 1 .468 6.999h-.005a3.507 3.507 0 0 1-3.733-3.266h-.001a3.507 3.507 0 0 1 3.266-3.734z"/>
        <path fill="#FFF" fill-rule="nonzero" d="M.881 63.318h197.863v69.033H.881z"/>
        <path fill="#E6EEF4" fill-rule="nonzero" d="M9.34 97.959c42.65 41.03 15.6 54.316 37.992 61.31 23.824 7.446 31.319-13.676 59.22 6.794 20.08 14.723 37.382 17.87 56.016 6.731 7.268-4.343 13.749-8.148 22.151-18.337 29.95-36.34 44.72-113.21-.39-145.115-45.11-31.905-56.3 36.022-98.17 25.507C44.29 24.335-22.758 67.074 9.34 97.96z"/>
        <path fill="#FFF" fill-rule="nonzero" d="M150.315 146.855H66.427a5.345 5.345 0 0 1-5.467-5.187l-2.319-57.32a5.453 5.453 0 0 1 1.5-4.04 5.462 5.462 0 0 1 3.967-1.692h88.533a5.455 5.455 0 0 1 3.964 1.692 5.446 5.446 0 0 1 1.496 4.04l-2.319 57.349a5.423 5.423 0 0 1-5.467 5.158z"/>
        <path stroke="#00AAFA" stroke-linecap="round" stroke-linejoin="round" stroke-width="1.417" d="M150.152 146.855H66.271a5.345 5.345 0 0 1-5.467-5.187l-2.326-57.32a5.453 5.453 0 0 1 1.487-4.057 5.462 5.462 0 0 1 3.973-1.704h88.54a5.462 5.462 0 0 1 3.967 1.692 5.453 5.453 0 0 1 1.5 4.04l-2.326 57.35a5.423 5.423 0 0 1-5.467 5.186z" opacity=".28"/>
        <path fill="#3BB4FF" fill-rule="nonzero" d="M152.641 78.587H64.108v-19.13a4.253 4.253 0 0 1 4.098-4.251h30.192c.662 0 1.299.254 1.78.708l7.09 6.285h41.254a4.142 4.142 0 0 1 4.105 4.251l.014 12.137z"/>
        <ellipse cx="97.342" cy="107.028" fill="#0093FF" fill-rule="nonzero" rx="2.021" ry="2.019"/>
        <ellipse cx="126.193" cy="105.193" fill="#0093FF" fill-rule="nonzero" rx="4.985" ry="4.981"/>
        <path stroke="#00AAFA" stroke-linecap="round" stroke-linejoin="round" stroke-width="1.417" d="M44.091 146.855h127.532M177.714 146.855h5.211" opacity=".28"/>
        <path stroke="#0093FF" stroke-linecap="round" stroke-linejoin="round" stroke-width="2.126" d="M102.894 120.83h8.083"/>
        <path fill="#FFB500" fill-rule="nonzero" d="M139.077 122.651l3.616 4.868"/>
        <path fill="#3BB4FF" fill-rule="nonzero" d="M138.436 123.13l1.28-.95 3.618 4.861-1.28.951z"/>
        <path fill="#3BB4FF" fill-rule="nonzero" d="M142.578 127.31h.005a3.99 3.99 0 0 1 5.579.824l9.47 12.727a3.99 3.99 0 0 1-.822 5.58l-.002.002-.007-.002a3.99 3.99 0 0 1-5.579-.823l-9.469-12.727a3.99 3.99 0 0 1 .821-5.58l.003-.003z"/>
        <path fill="#3BB4FF" fill-rule="nonzero" d="M144.062 126.86s11.082 14.822 11.579 15.495c.496.674.843 2.473.361 4.344 0 0 4-1.68 1.66-5.668l-9.927-13.32s-1.787-1.694-3.673-.851z" opacity=".26" style="mix-blend-mode:multiply"/>
        <ellipse cx="127.548" cy="107.141" fill="#007CA3" fill-rule="nonzero" opacity=".07" rx="15.465" ry="15.453"/>
        <path fill="#3BB4FF" fill-rule="nonzero" d="M143.445 107.928a15.444 15.444 0 0 0-8.28-14.487 15.467 15.467 0 0 0-16.63 1.485 15.416 15.416 0 0 1 13.196 3.382 15.391 15.391 0 0 1 5.353 12.518 15.414 15.414 0 0 1-5.998 11.45 15.45 15.45 0 0 0 12.359-14.348z" opacity=".2"/>
        <path fill="#3BB4FF" fill-rule="nonzero" d="M116.018 91.638c-8.565 6.365-10.346 18.462-3.978 27.022 6.367 8.56 18.473 10.342 27.04 3.98 8.568-6.36 10.354-18.457 3.989-27.02a19.34 19.34 0 0 0-27.05-3.982zm20.754 27.91a15.474 15.474 0 0 1-17.162.858 15.45 15.45 0 0 1 4.17-28.249 15.47 15.47 0 0 1 16.183 5.773c5.092 6.85 3.663 16.528-3.19 21.618z"/>
        <path fill="#3BB4FF" fill-rule="nonzero" d="M115.976 91.773a19.366 19.366 0 0 0-3.297 3.103 20.282 20.282 0 0 1 1.864-1.58c7.868-5.792 18.823-4.807 25.531 2.294 6.708 7.101 7.059 18.087.818 25.602 7.38-7.058 7.99-18.634 1.394-26.427-6.596-7.793-18.12-9.113-26.31-3.013v.021z" opacity=".26" style="mix-blend-mode:multiply"/>
        <path stroke="#00AAFA" stroke-linecap="round" stroke-linejoin="round" stroke-width="2.126" d="M157.044 118.846s19.386-.708 7.417 12.754-9.054 10.848-9.054 10.848M59.038 113.433s-8.267-1.332-8.643 13.583c-.376 14.914.312 16.154.312 16.154"/>
        <ellipse cx="126.867" cy="103.173" fill="#FFF" fill-rule="nonzero" rx="1.425" ry="1.424"/>
        <path stroke="#00AAFA" stroke-linecap="round" stroke-linejoin="round" stroke-width="2.126" d="M90.237 100.205s.865-4.96 6.211-2.664M121.776 96.931s3.85-4.874 8.835-.46"/>
        <ellipse cx="44.091" cy="80.181" fill="#3BB4FF" fill-rule="nonzero" rx="1.595" ry="1.594"/>
        <ellipse cx="157.952" cy="52.208" fill="#3BB4FF" fill-rule="nonzero" rx="1.595" ry="1.594"/>
    </g>
</svg>
