<svg xmlns="http://www.w3.org/2000/svg" width="12" height="11" viewBox="0 0 12 11">
    <g fill="#00ABFB" fill-rule="evenodd">
        <path d="M3.143 4.286h1.429v1.429H3.143zM3.143 6.429h1.429v1.429H3.143zM5.286 4.286h1.429v1.429H5.286zM5.286 6.429h1.429v1.429H5.286zM7.429 4.286h1.429v1.429H7.429z"/>
        <path fill-rule="nonzero" stroke="#00ABFB" stroke-width=".714" d="M10.167.938H8.813V.313a.312.312 0 1 0-.626 0v.625H6.313V.313a.312.312 0 1 0-.625 0v.625H3.813V.313a.312.312 0 1 0-.626 0v.625H1.833A.833.833 0 0 0 1 1.77v7.396c0 .46.373.833.833.833h8.334c.46 0 .833-.373.833-.833V1.77a.833.833 0 0 0-.833-.833zm.208 8.229a.209.209 0 0 1-.208.208H1.833a.209.209 0 0 1-.208-.208V1.77c0-.115.093-.208.208-.208h1.355v.625a.312.312 0 1 0 .624 0v-.626h1.876v.625a.312.312 0 1 0 .625 0v-.624h1.875v.625a.312.312 0 1 0 .624 0v-.626h1.355c.115 0 .208.094.208.209v7.396z"/>
        <path d="M7.429 6.429h1.429v1.429H7.429z"/>
    </g>
</svg>
