<svg xmlns="http://www.w3.org/2000/svg" width="132" height="110" viewBox="0 0 132 110">
    <g fill="none" fill-rule="nonzero">
        <path fill="#F2F6F9" d="M103.514 1.921c11.793 2.777 19.333 18.95 23.996 34.888 4.663 15.938 6.494 31.545 1.224 43.885-5.27 12.34-17.652 21.323-30.1 25.833-12.449 4.51-25.109 4.515-34.985.557-9.876-3.958-17.112-11.874-28.447-19.737C23.866 79.483 8.412 71.649 2.65 59.045-3.112 46.44.79 29.013 11.914 21.73c11.123-7.282 29.44-4.323 46.59-8.166 17.15-3.843 33.24-14.454 45.01-11.644z"/>
        <path fill="#FFF" d="M47.804 19.392h52.463c1.08 0 2.114.427 2.877 1.189a4.048 4.048 0 0 1 1.189 2.87v52.925l-4.288 15.448H50.497c-3.739-.01-6.77-3.026-6.788-6.754V25.262l.049-1.922a4.041 4.041 0 0 1 4.046-3.948z"/>
        <path fill="#FFF" d="M55.642 88.149l1.397-11.356h53.653v5.385c0 5.335-4.337 9.66-9.688 9.66H51.952"/>
        <path fill="#00AAFA" d="M56.143 76.376h54.55V83.1c0 4.807-3.91 8.704-8.73 8.704H50.497l5.646-15.428z"/>
        <path fill="#FFF" d="M43.84 73.013h12.294v12.792c-.006 3.322-2.7 6.017-6.032 6.033a6.243 6.243 0 0 1-4.427-1.81 6.207 6.207 0 0 1-1.836-4.406V73.013z"/>
        <path fill="#9FBEF6" d="M56.143 48.362h35.168v1.931H56.143zM56.143 60.971h35.168v1.931H56.143z"/>
        <path fill="#00AAFA" d="M47.525 19.392h52.959a3.848 3.848 0 0 1 3.854 3.842v8.08H43.839v-8.257a3.66 3.66 0 0 1 1.08-2.595 3.681 3.681 0 0 1 2.606-1.07z"/>
        <ellipse cx="49.89" cy="25.194" fill="#FFF" rx="1.426" ry="1.422"/>
        <ellipse cx="55.271" cy="25.194" fill="#FFF" rx="1.426" ry="1.422"/>
        <ellipse cx="60.648" cy="25.194" fill="#FFF" rx="1.426" ry="1.422"/>
        <ellipse cx="85.415" cy=".73" fill="#009ABF" opacity=".36" rx="1" ry="1"/>
        <ellipse cx="35.197" cy="62.902" fill="#009ABF" opacity=".36" rx="1" ry="1"/>
        <ellipse cx="118.207" cy="31.314" fill="#009ABF" opacity=".36" rx="1" ry="1"/>
        <ellipse cx="94.486" cy="26.611" fill="#8571DA" rx="16.616" ry="16.567"/>
        <path fill="#FFF" d="M93.224 18.09h2.529v10.486h-2.529zM93.224 31.28h2.529v2.522h-2.529z"/>
    </g>
</svg>
