<svg xmlns="http://www.w3.org/2000/svg" width="11" height="7" viewBox="0 0 11 7">
    <path fill="#00022C" fill-rule="evenodd" d="M9.637.134s.755-.34 1.149.062.124 1.237.124 1.237L5.455 7 0 1.433S.131.621.36.388c.228-.232.913-.254.913-.254l4.182 4.268L9.637.134z"/>
</svg>
