<svg id="Maestro_DI" xmlns="http://www.w3.org/2000/svg" xmlns:xlink="http://www.w3.org/1999/xlink" width="390.811" height="360" viewBox="0 0 390.811 360">
  <defs>
    <clipPath id="clip-path">
      <ellipse id="Ellipse_194" data-name="Ellipse 194" cx="162.88" cy="162.15" rx="162.88" ry="162.15" transform="translate(18.45 17.84)" fill="none"/>
    </clipPath>
    <clipPath id="clip-path-2">
      <path id="Path_6129" data-name="Path 6129" d="M180,0A180,180,0,1,0,360,180,179.989,179.989,0,0,0,180,0Zm.08,336.05c-86.61,0-156.8-69.87-156.8-156.05S93.47,23.92,180.05,23.92,336.82,93.8,336.82,180,266.63,336.05,180.05,336.05Z" fill="none"/>
    </clipPath>
    <linearGradient id="linear-gradient" x1="0.35" y1="-0.1" x2="0.766" y2="1.561" gradientUnits="objectBoundingBox">
      <stop offset="0" stop-color="#e8e63e"/>
      <stop offset="0.03" stop-color="#e7e240"/>
      <stop offset="0.19" stop-color="#e5d748"/>
      <stop offset="0.4" stop-color="#e4d04d"/>
      <stop offset="1" stop-color="#e4ce4e"/>
    </linearGradient>
  </defs>
  <g id="Layer_1" data-name="Layer 1">
    <g id="Group_6780" data-name="Group 6780" clip-path="url(#clip-path)">
      <ellipse id="Ellipse_192" data-name="Ellipse 192" cx="162.88" cy="162.15" rx="162.88" ry="162.15" transform="translate(17.09 17.73)" fill="#4a4a88"/>
      <ellipse id="Ellipse_193" data-name="Ellipse 193" cx="156.77" cy="156.06" rx="156.77" ry="156.06" transform="translate(23.29 23.82)" fill="none"/>
    </g>
    <g id="Group_6781" data-name="Group 6781" clip-path="url(#clip-path-2)">
      <rect id="Rectangle_1151" data-name="Rectangle 1151" width="313.54" height="312.13" transform="translate(23.28 23.92)" fill="#7fc5ed"/>
      <rect id="Rectangle_1152" data-name="Rectangle 1152" width="359.94" height="359.98" fill="url(#linear-gradient)"/>
    </g>
    <g id="Group_6782" data-name="Group 6782" opacity="0.08">
      <path id="Path_6130" data-name="Path 6130" d="M249.37,270.42c0-40.33,33.23-73,74.22-73a75.641,75.641,0,0,1,14.13,1.34,151.259,151.259,0,0,0-6-65.39C305.52,51.92,215.89,6.09,133.12,31.83q-3.06.95-6.09,2l53.78,146.41,47.68,148.44A157.472,157.472,0,0,0,263.33,313,71.93,71.93,0,0,1,249.37,270.42Z" fill="#fff"/>
    </g>
    <circle id="Ellipse_195" data-name="Ellipse 195" cx="68.78" cy="68.78" r="68.78" transform="translate(251.25 200.02)" fill="#7570b2" stroke="#fff" stroke-miterlimit="10" stroke-width="4"/>
    <path id="Path_6131" data-name="Path 6131" d="M242.08,238.8s-3.5-15.43,6.61-51.75a306.418,306.418,0,0,1,26.1-64l-7.17-2.89s-25.93,38.63-36.94,26.36c-14.39-16-10.37-36.33-10.37-36.33h-8.15v.43c.16,10-2,20.47-8.9,28.83s-16,14.41-26.35,14.62c-12.34.25-24-6.12-28.78-17.87-.68-1.66-8-26-6.2-26h-8.15S136.72,126,125,144s-38.5-23.79-38.5-23.79l-7.18,2.89a305.782,305.782,0,0,1,26.1,64c10.1,36.27,6.58,51.7,6.58,51.7Z" fill="#f8d543"/>
    <path id="Path_6132" data-name="Path 6132" d="M241.62,240.17c0,5.82-29,10.54-64.83,10.54S112,246,112,240.17s28.4-9.62,64.21-9.62S241.62,234.36,241.62,240.17Z" fill="#e08926"/>
    <path id="Path_6133" data-name="Path 6133" d="M112,240.17a2.29,2.29,0,0,1,.51-1.38,9,9,0,0,1,3.47-2.45,64.5,64.5,0,0,1,14.71-4.08,212.824,212.824,0,0,1,21.42-2.62c7.88-.56,16.29-.87,24.72-.91s16.84.35,24.72.91a209.987,209.987,0,0,1,21.42,2.62,64.391,64.391,0,0,1,14.7,4.08,9.06,9.06,0,0,1,3.48,2.45,2.36,2.36,0,0,1,.51,1.38,2.43,2.43,0,0,0-.59-1.32,9.38,9.38,0,0,0-3.54-2.19c-3.38-1.38-8.53-2.45-14.73-3.39s-13.52-1.55-21.36-2.05-16.22-.7-24.62-.67-16.76.19-24.6.67-15.16,1.1-21.36,2.05-11.35,2-14.73,3.39a9.38,9.38,0,0,0-3.54,2.19,2.33,2.33,0,0,0-.59,1.32Z" fill="#ffdf86"/>
    <path id="Path_6134" data-name="Path 6134" d="M239.33,206.53c-7.51-4.46-32.66-7.75-62.54-7.75-28.68,0-53,3-61.56,7.22h0s-8.85,3.6-8,9.22c.61,4,4.73,3.74,4.73,3.74,0-5.82,29-10.53,64.83-10.53S242.2,213.15,242.2,219c0,0,4.3-2.52,1.85-7.77a9.7,9.7,0,0,0-4.72-4.7Z" fill="#fbb223"/>
    <path id="Path_6135" data-name="Path 6135" d="M239.33,227.75c-7.51-4.47-32.66-7.75-62.54-7.75-28.68,0-53,3-61.56,7.22h0s-8.85,3.6-8,9.21c.61,4,4.73,3.74,4.73,3.74,1.69-5.72,28-9.62,63.4-9.62,34.79,0,66.26,3.81,66.26,9.62a5.73,5.73,0,0,0,2.43-7.77,9.65,9.65,0,0,0-4.72-4.65Z" fill="#fbb223"/>
    <path id="Path_6136" data-name="Path 6136" d="M77.63,120.72c-3.38,1.53-6.59.9-9.2.56a13.09,13.09,0,0,0,24.58-6,12.6,12.6,0,0,0-1-5,28.259,28.259,0,0,1-4.61,2.8C84,115.08,81,119.06,77.63,120.72Z" fill="#eca524"/>
    <path id="Path_6137" data-name="Path 6137" d="M80,102.4a13,13,0,0,0-13,12.851,12.66,12.66,0,0,0,1.52,6c2.61.34,5.82,1,9.2-.56s6.4-5.64,9.76-7.63a28.259,28.259,0,0,0,4.61-2.8A13.06,13.06,0,0,0,80,102.4Z" fill="#fcba37"/>
    <path id="Path_6138" data-name="Path 6138" d="M138,93.19a13,13,0,0,0-12.58,9.49c3.07.92,4.34,3.06,7,6.43,1.35,1.66,2.69,4.31,5.05,4.64s2.69-2,4.71-2.32c2.51-.41,5.14.84,7.42.42a12.62,12.62,0,0,0,1.42-5.8A13,13,0,0,0,138,93.19Z" fill="#fcba37"/>
    <path id="Path_6139" data-name="Path 6139" d="M142.24,111.43c-2,.33-2.36,2.66-4.71,2.32s-3.7-3-5.05-4.64c-2.69-3.37-4-5.51-7-6.43a12.471,12.471,0,0,0-.47,3.37,13.08,13.08,0,0,0,24.68,5.8C147.38,112.27,144.75,111,142.24,111.43Z" fill="#eca524"/>
    <path id="Path_6140" data-name="Path 6140" d="M222,108.78c-3,.66-5.05,3.32-8.08,3-4.37-1-5.38-8.28-10.09-9.94a6.68,6.68,0,0,0-1.2-.2,12.51,12.51,0,0,0-.33,2.82A13.07,13.07,0,0,0,227.54,109C225.86,109,224,108.47,222,108.78Z" fill="#eca524"/>
    <path id="Path_6141" data-name="Path 6141" d="M215.34,91.58a13,13,0,0,0-12.72,10,6.68,6.68,0,0,1,1.2.2c4.71,1.66,5.72,9,10.09,9.94,3,.34,5.05-2.32,8.08-3,2-.31,3.87.17,5.55.2a12.67,12.67,0,0,0,.85-4.54A13,13,0,0,0,215.34,91.58Z" fill="#fcba37"/>
    <path id="Path_6142" data-name="Path 6142" d="M285.48,117.3a13.07,13.07,0,0,0-24.1-6.81,7.647,7.647,0,0,0,.32,1.61c1.68,5.63,7.4,4.31,9.76,7.62,2,2.65-.68,7,2.35,9.95.12.13.24.24.37.36a12.92,12.92,0,0,0,11.3-12.73Z" fill="#fcba37"/>
    <path id="Path_6143" data-name="Path 6143" d="M271.46,119.72c-2.36-3.31-8.08-2-9.76-7.62a7.649,7.649,0,0,1-.32-1.61,12.61,12.61,0,0,0-2,6.81,13,13,0,0,0,13.05,12.86,14.409,14.409,0,0,0,1.75-.13c-.13-.12-.25-.23-.37-.36C270.78,126.68,273.47,122.37,271.46,119.72Z" fill="#eca524"/>
    <path id="Path_6144" data-name="Path 6144" d="M178,161.1a1.76,1.76,0,0,0-2.78.31,45.761,45.761,0,0,1-7.41,8.63c-1.7,1.62-3.43,3.16-5,4.55a2.57,2.57,0,0,0-.18,3.71c3.8,4,7.91,8,11.72,12a2.92,2.92,0,0,0,4.16.11c.93-.91,1.89-1.9,2.86-2.92,3.09-3.25,6.28-6.94,9-10.18a2.58,2.58,0,0,0-.12-3.47C186.91,170.51,180.89,164.17,178,161.1Z" fill="#7570b2"/>
    <path id="Path_6145" data-name="Path 6145" d="M175.59,164.39a2.5,2.5,0,0,0,.57,2.78c1.27,1.33,2.28,1.71,2.87,3.53.29,1,.41,3.27,1.45,3.78,1.24.69,2-.75,2.22-1.64a4.51,4.51,0,0,0-1.16-4.59c-1.15-1.16-2.63-2.95-4.22-3.54Z" fill="#fff"/>
    <rect id="Rectangle_1153" data-name="Rectangle 1153" width="71.37" height="76.71" rx="3.54" transform="translate(285.8 230.35)" fill="#fff"/>
    <rect id="Rectangle_1154" data-name="Rectangle 1154" width="6.75" height="62.22" rx="3.375" transform="translate(293.07 240.62)" fill="#5c4fa0"/>
    <rect id="Rectangle_1155" data-name="Rectangle 1155" width="6.75" height="54.2" rx="3.375" transform="translate(310.58 248.46)" fill="#8886c0"/>
    <rect id="Rectangle_1156" data-name="Rectangle 1156" width="6.75" height="36.9" rx="3.375" transform="translate(325.24 265.77)" fill="#5c4fa0"/>
    <rect id="Rectangle_1157" data-name="Rectangle 1157" width="6.75" height="24.24" rx="3.375" transform="translate(341.59 277.75)" fill="#8886c0"/>
    <line id="Line_141" data-name="Line 141" x2="60.13" transform="translate(291.83 304.59)" fill="none" stroke="#36368c" stroke-miterlimit="10" stroke-width="0.1" opacity="0.58"/>
    <path id="Path_6146" data-name="Path 6146" d="M357.38,226.24H293.1a3.54,3.54,0,0,0-3.54,3.54v.57h64.07a3.53,3.53,0,0,1,3.54,3.54V303h.21a3.55,3.55,0,0,0,3.55-3.55V229.78a3.55,3.55,0,0,0-3.55-3.54Z" fill="#36368c" opacity="0.16"/>
    <path id="Path_6147" data-name="Path 6147" d="M296.44,238.29l18.33,3.2,14.24,21.6,16.91,13.53" fill="none" stroke="#36368c" stroke-miterlimit="10" stroke-width="0.1"/>
    <circle id="Ellipse_196" data-name="Ellipse 196" cx="0.9" cy="0.9" r="0.9" transform="translate(295.7 237.24)" fill="#7570b2"/>
    <circle id="Ellipse_197" data-name="Ellipse 197" cx="0.9" cy="0.9" r="0.9" transform="translate(313.95 240.62)" fill="#7570b2"/>
    <circle id="Ellipse_198" data-name="Ellipse 198" cx="0.9" cy="0.9" r="0.9" transform="translate(327.72 262.07)" fill="#7570b2"/>
    <circle id="Ellipse_199" data-name="Ellipse 199" cx="0.9" cy="0.9" r="0.9" transform="translate(344.97 275.56)" fill="#7570b2"/>
  </g>
</svg>
