<svg xmlns="http://www.w3.org/2000/svg" width="76" height="75" viewBox="0 0 76 75">
    <g fill="none" fill-rule="evenodd" stroke-linecap="round" stroke-width="1.381">
        <path fill="#856ED8" stroke="#856ED8" d="M5.427 11.838H4.02A3.137 3.137 0 0 1 .893 8.711V4.019A3.136 3.136 0 0 1 4.02.893h67.544a3.136 3.136 0 0 1 3.128 3.126v4.692a3.137 3.137 0 0 1-3.128 3.127H69.76"/>
        <path stroke="#00ABFB" stroke-linejoin="round" d="M37.793 15.851c-16.032 0-29.028 12.998-29.028 29.03 0 16.031 12.998 29.028 29.03 29.027 16.031 0 29.028-12.996 29.028-29.028a29.029 29.029 0 0 0-29.03-29.029zm0 51.09c-12.184-.001-22.06-9.878-22.06-22.062 0-12.184 9.878-22.06 22.061-22.06 12.184 0 22.06 9.877 22.06 22.06A22.06 22.06 0 0 1 37.794 66.94z"/>
        <circle cx="37.623" cy="44.88" r="22.062" stroke="#00ABFB" stroke-linejoin="round"/>
        <circle cx="37.621" cy="44.88" r="29.029" stroke="#00ABFB" stroke-linejoin="round"/>
        <path fill="#856ED8" stroke="#856ED8" d="M37.623 31.19l3.073 9.46h9.947l-8.047 5.846 3.074 9.46-8.046-5.846-8.047 5.846 3.074-9.46-8.046-5.846h9.946z"/>
        <path stroke="#00ABFB" stroke-linejoin="round" d="M5.583 7.615v17.043l7.262 5.086M69.762 7.615v17.043L62.5 29.744"/>
        <path fill="#FFF" stroke="#00ABFB" stroke-linejoin="round" d="M12.848 29.744l-7.262-5.086V7.615h64.178v17.043l-7.262 5.086a29.405 29.405 0 0 0-24.88-13.893S22.612 14.66 12.847 29.744z"/>
        <path stroke="#00ABFB" stroke-linejoin="round" d="M18.926 7.615v15.06M56.035 8.321v14.117M44.152 8.088v8.46M30.288 7.608v8.46"/>
        <path stroke="#856ED8" stroke-linejoin="round" d="M3.707 7.615h67.235"/>
    </g>
</svg>
