<svg xmlns="http://www.w3.org/2000/svg" width="7" height="11" viewBox="0 0 7 11">
    <path fill="#7E919A" fill-rule="evenodd" d="M.134 1.363S-.206.608.196.214 1.433.09 1.433.09L7 5.545 1.433 11s-.812-.131-1.045-.36c-.232-.228-.254-.913-.254-.913l4.268-4.182L.134 1.363z" opacity=".5"/>
</svg>
