<svg xmlns="http://www.w3.org/2000/svg" width="28" height="27" viewBox="0 0 28 27">
    <g fill="none" fill-rule="evenodd" stroke="#FFF" stroke-width="2" transform="translate(1.5 1)">
        <circle cx="12.5" cy="12.5" r="12.5"/>
        <path fill="#FFF" stroke-linecap="round" stroke-linejoin="round" d="M9 8v9l7.459-4.5z"/>
    </g>
</svg>
