<svg xmlns="http://www.w3.org/2000/svg" width="22" height="22" viewBox="0 0 22 22">
    <defs>
        <linearGradient id="a" x1="0%" x2="102%" y1="0%" y2="101%">
            <stop offset="0%" stop-color="#3380CC"/>
            <stop offset="100%" stop-color="#886DD7"/>
        </linearGradient>
    </defs>
    <g fill="none" fill-rule="evenodd" stroke-width="2" transform="translate(1 1)">
        <circle cx="10" cy="10" r="10" stroke="url(#a)"/>
        <path stroke="#00ABFB" stroke-linecap="round" stroke-linejoin="round" d="M7.2 6.4v7.2l5.967-3.6z"/>
    </g>
</svg>
