{
  "type": "service_account",
  "project_id": "iron-century-387210",
  "private_key_id": "98062289191113cd14141ab9fc16978bfd5de4ce",
  "private_key": "-----BEGIN PRIVATE KEY-----\nMIIEvgIBADANBgkqhkiG9w0BAQEFAASCBKgwggSkAgEAAoIBAQC47xhnTtRnuEn5\nnlEZfxkgeLdANwSJzlHAFAI1gQGM9/+dS1tmmIa6o58Vt2Q1uJ0aYHXsUHqt3D4q\nniZ90koDvWkfxH9I/2N8rIx7iwYACmvutZGunEfauuIF22hT7CbuYXEpQKJ/xCyy\nPvYVg2iiDSCzLYaeylDvQSZb1jXgk12/KDwtZOPBHzrWPN2azsYHOJ1qoCuq62GM\nvsh5NVk6NRQj7EZmfA/loY28WWFuKdWQtSzdCawF9La5ACJEG9BohkT4getbHGSd\nyAi5rpJFHmn0aXhh1ytOqvxN4LYy5QFX96MBmC7CX3TZculbUDmsxIK17e27TQTd\n25+OypWdAgMBAAECggEAJMK4P97aV3S5VbJr7gzG7p64VH4rO4Zk1zDTAJYwe/hX\nGgn+9O2oSGTabFtsQsZ8CiB3CF62CCXRwLB3t8aLmmM2CI/LenPzr3ZwJWWs72ii\n7Eww1Xvwx5Ci+aWTvyzfzz5U222i75FMDjF4Qq4AqEfCQoOv8RQH0wtJB/PUeVuT\nEEIQG0hGDOiJ4CijSYKIGpAKpORPjzKVWJh69rdssKP/ICQPYfL8Avkj1awrX1jO\n6SBWlEZSFWExxoh7Cb8bxi691Ilhbh9dek/Q3n4kmPSOpP8mPxDAuX3tbll4rQ/P\nKRPdGQlo+ZN8Cu+Y3AQkSZ2Ux0eUl+RX8KlZ5S2wYQKBgQDo+FqG0iE/axEW6jPO\net3gx2Z88plg3yvKo3vLV3xwYggSkUQWKczF7a688NT3DrbVBAOsxJsUUMjtWzJT\n6brbJ2lDQCp4AmXg823U3FXRpwPTzW2M1pPQlC0rTZ0qcuTozi75kiULpF3SfKbf\nStZ09yDM9gNszrbF4Q56cQeWIQKBgQDLNx3016xCCGRsO/dOLCce2s0n7D/Ae9qe\nZk9fbDjNBGWgJ5lWLaJz3tdaHuRWLlZo3SjoBeco73Ik9K9hPFqXNU18W3OYtovP\nexr080+9mCRAv1pg09RsTndfUt6GH8zDRPNOZgqoKRNfN1gbTlUab/gTBEAqUn5x\nKB3TkYZX/QKBgQCftaJZyrQAReXxT500cAarkgcwoR+EyXm78Vdsjw0//fSKxgtn\nJkC7b7Xa0T8uH2g3oAjk5+Noifk0vtBBtnniw6Hl+JckroApNriUtHggwd5d1PbF\nFlU/KFXO2eZks186Oh75+LZsxMGNCudbLHLYvJI/8GdosE2cWi0Sw2nwAQKBgQCh\n+mboWFi3sZTKKOow50SvdVv9rHQMayyRAZ/WwZ5s3Epc4/N3G5zXmxIwhVsfzoOV\nxmLqvnnIyUNEbby1VrQmvpfqvcJgQXEjik6sXJx81R5gdaYGdBJn2guQca9pXUOL\nihQds3xfGY6VYLnb2g4/qmwkTEkQ8vxSGdXcY6yfyQKBgBOjdHUqEXefWAHrzzhL\no1+OavbNrenl749ILLJHLvOAAmIbpvsIPjIvRWmliIWWIAntPH7sjMU3Z8iQK9Sc\n8LD3lH23GL2VYIGD1rdC+tcOUNyRbYIoyF/sqVW4glR91RljqnuuE2RiifFBhRWb\nbAM2ZHSfJq1u5I1TsZxKW7D8\n-----END PRIVATE KEY-----\n",
  "client_email": "sonar-google-service-account@iron-century-387210.iam.gserviceaccount.com",
  "client_id": "112128176016280539739",
  "auth_uri": "https://accounts.google.com/o/oauth2/auth",
  "token_uri": "https://oauth2.googleapis.com/token",
  "auth_provider_x509_cert_url": "https://www.googleapis.com/oauth2/v1/certs",
  "client_x509_cert_url": "https://www.googleapis.com/robot/v1/metadata/x509/sonar-google-service-account%40iron-century-387210.iam.gserviceaccount.com",
  "universe_domain": "googleapis.com"
}