[
    {
        "package": {
            "key": "django",
            "package_name": "django",
            "installed_version": "1.4.7"
        },
        "dependencies": [
            {
                "key": "pytz",
                "package_name": "pytz",
                "installed_version": "2019.3",
                "required_version": null
            }
        ]
    },
    {
        "package": {
            "key": "cryptography",
            "package_name": "cryptography",
            "installed_version": "2.2.2"
        },
        "dependencies": [
            {
                "key": "asn1crypto",
                "package_name": "asn1crypto",
                "installed_version": "1.2.0",
                "required_version": ">=0.21.0"
            },
            {
                "key": "idna",
                "package_name": "idna",
                "installed_version": "2.8",
                "required_version": ">=2.1"
            },
            {
                "key": "six",
                "package_name": "six",
                "installed_version": "1.12.0",
                "required_version": ">=1.4.1"
            },
            {
                "key": "cffi",
                "package_name": "cffi",
                "installed_version": "1.13.1",
                "required_version": ">=1.7"
            }
        ]
    },
    {
        "package": {
            "key": "cffi",
            "package_name": "cffi",
            "installed_version": "1.13.1"
        },
        "dependencies": [
            {
                "key": "pycparser",
                "package_name": "pycparser",
                "installed_version": "2.19",
                "required_version": null
            }
        ]
    },
    {
        "package": {
            "key": "elastic_apm",
            "package_name": "elastic_apm",
            "installed_version": "5.0.0"
        },
        "dependencies": []
    }
]
