[
    {
        "id": "1",
        "price": "30 USD",
        "name": "GUCCI G8850U",
        "image": "GlassesImage/v1.png",
        "desc": "Light pink square lenses define these sunglasses, ending with amother of pearl effect tip. "
    },
    {
        "id": "2",
        "price": "50 USD",
        "name": "GUCCI G8759H",
        "image": "GlassesImage/v2.png",
        "desc": "Light pink square lenses define these sunglasses, ending with amother of pearl effect tip. "
    },
    {
        "id": "3",
        "price": "30 USD",
        "name": "DIOR D6700HQ",
        "image": "GlassesImage/v3.png",
        "desc": "Light pink square lenses define these sunglasses, ending with amother of pearl effect tip. "
    },
    {
        "id": "4",
        "price": "70 USD",
        "name": "DIOR D6005U",
        "image": "GlassesImage/v4.png",
        "desc": "Light pink square lenses define these sunglasses, ending with amother of pearl effect tip. "
    },
    {
        "id": "5",
        "price": "40 USD",
        "name": "PRADA P8750",
        "image": "GlassesImage/v5.png",
        "desc": "Light pink square lenses define these sunglasses, ending with amother of pearl effect tip. "
    },
    {
        "id": "6",
        "price": "60 USD",
        "name": "PRADA P9700",
        "image": "GlassesImage/v6.png",
        "desc": "Light pink square lenses define these sunglasses, ending with amother of pearl effect tip. "
    },
    {
        "id": "7",
        "price": "80 USD",
        "name": "FENDI F8750",
        "image": "GlassesImage/v7.png",
        "desc": "Light pink square lenses define these sunglasses, ending with amother of pearl effect tip. "
    },
    {
        "id": "8",
        "price": "100 USD",
        "name": "FENDI F8500",
        "image": "GlassesImage/v8.png",
        "desc": "Light pink square lenses define these sunglasses, ending with amother of pearl effect tip. "
    },
    {
        "id": "9",
        "price": "60 USD",
        "name": "FENDI F4300",
        "image": "GlassesImage/v9.png",
        "desc": "Light pink square lenses define these sunglasses, ending with amother of pearl effect tip. "
    }
]