2017-12-18 23:37:36,668 - ***************************************************************************
2017-12-18 23:37:36,669 - C: 1000
2017-12-18 23:37:36,669 - multi_class: ovo
2017-12-18 23:37:36,670 - kernel: poly
2017-12-18 23:37:36,670 - gamma: None
2017-12-18 23:37:36,670 - degree: 3
2017-12-18 23:38:48,797 - fit_time: 72.12610387802124 seconds
2017-12-18 23:38:48,974 - model is saved in bin\svm-models\ovo_poly_1000_None_3.pkl
2017-12-18 23:39:45,923 - score on train set: 0.998211731044349
2017-12-18 23:39:49,100 - score on test set: 0.12578616352201258
2017-12-18 23:39:49,127 - confusion_matrix:
 [[0 0 0 0 0 0 0 0 0 0 0 0 0 0 0 0 0 0 0 0 0 0 0 0 0 0 0 0 0 0 0 0 0 0 0 0 0 0 0 0 0 0 0 0 0 0 0 1 0 0 0 0 0 0 0 0 0 0 0 0 0 0 0 0 0 0 0 0 0 0 0 0 0 0 0 0 0 0 0 2 0 0 0 0 0 0 0 0 0 0 0 0 0 0 0 0 0 0 0 0]
 [0 2 0 0 0 0 0 0 0 0 0 0 0 0 0 0 0 0 1 0 0 0 0 0 0 0 0 0 0 0 0 0 0 0 0 0 0 0 0 0 0 0 0 0 0 0 0 0 0 0 0 0 0 0 0 0 0 0 0 0 0 0 0 0 0 0 0 0 0 0 0 0 0 0 0 0 0 0 0 0 0 0 0 0 0 0 0 0 0 0 0 0 0 0 0 0 0 0 0 0]
 [0 0 0 0 0 0 0 0 0 0 0 0 0 0 0 0 0 0 0 0 0 0 0 0 0 0 0 0 0 0 1 0 0 0 0 0 0 0 0 0 0 0 0 0 0 0 0 0 0 0 0 0 0 0 0 0 0 0 0 0 0 0 0 0 0 0 0 0 0 0 0 0 0 0 1 0 0 0 0 1 0 0 0 0 0 0 0 0 0 0 0 0 0 0 0 0 0 0 0 0]
 [0 0 0 1 0 0 0 0 0 0 0 0 0 0 0 0 0 0 0 0 0 0 0 0 0 0 0 0 0 0 0 0 0 0 0 0 0 0 0 0 0 0 0 0 0 0 0 0 0 0 0 0 0 0 0 0 0 0 0 0 0 0 0 0 0 0 0 0 0 0 0 0 0 0 0 0 0 0 0 0 0 0 0 0 0 0 0 1 0 0 0 0 0 0 0 0 0 0 0 0]
 [0 0 0 0 0 0 0 0 0 0 0 0 0 0 0 0 0 0 0 0 0 0 0 0 0 0 0 0 0 0 0 0 0 0 0 0 0 0 0 0 0 0 0 0 0 0 0 1 0 0 0 0 0 0 0 0 0 0 0 0 0 0 0 0 0 0 0 0 0 0 0 0 0 0 0 0 0 0 0 2 0 0 0 0 0 0 0 0 0 0 0 0 0 0 0 0 0 0 0 0]
 [0 0 0 0 0 0 0 0 0 0 0 0 0 0 0 0 0 0 0 0 0 0 0 0 0 0 0 0 0 0 0 0 0 0 0 0 0 0 0 0 0 0 0 0 0 0 0 1 0 0 0 0 0 0 0 0 0 0 0 0 0 0 0 0 0 0 0 0 0 0 0 0 0 0 0 0 0 0 0 0 0 0 1 0 0 0 0 1 0 0 0 0 0 0 0 0 0 0 0 0]
 [0 0 0 0 0 0 0 0 0 0 0 0 0 0 0 0 0 0 0 0 0 0 0 0 0 0 0 0 0 0 0 0 0 0 0 0 0 0 0 0 0 0 0 0 0 0 0 0 0 0 0 0 0 0 0 0 0 0 0 0 0 0 0 0 0 0 0 0 0 0 0 0 0 0 0 0 0 0 0 0 0 0 3 0 0 0 0 0 0 0 0 0 0 0 0 0 0 0 0 0]
 [0 0 0 0 0 0 0 0 0 0 0 0 0 0 0 0 0 0 0 0 0 0 0 0 0 0 0 0 0 0 0 0 0 0 0 0 0 0 0 0 0 0 0 0 0 0 0 0 0 0 0 0 0 0 1 0 0 0 0 0 0 0 0 0 0 0 0 0 0 0 0 0 1 0 0 0 0 0 0 0 0 0 1 0 0 0 0 0 0 0 0 0 0 0 0 0 0 0 0 0]
 [0 0 0 1 0 0 0 0 0 0 0 0 0 0 0 0 0 0 0 0 0 0 0 0 0 0 0 0 0 0 0 0 0 0 0 0 0 0 0 0 0 0 0 0 0 0 0 0 0 0 0 0 0 0 0 0 0 0 0 0 0 0 0 0 0 0 0 0 0 0 0 0 1 0 0 0 0 0 0 0 0 0 1 0 0 0 0 0 0 0 0 0 0 0 0 0 0 0 0 0]
 [0 0 0 0 0 0 0 0 0 0 0 1 0 0 0 0 0 0 0 0 0 0 0 0 0 0 0 0 1 0 0 0 0 0 0 0 1 0 0 0 0 0 0 0 0 0 0 0 0 0 0 0 0 0 0 0 0 0 0 0 0 0 0 0 0 0 0 0 0 0 0 0 0 0 0 0 0 0 0 0 0 0 0 0 0 0 0 0 0 0 0 0 0 0 0 0 0 0 0 0]
 [0 0 0 0 0 0 0 0 0 0 0 0 0 0 0 0 0 0 0 0 0 0 0 0 0 0 0 0 0 0 0 0 0 0 0 0 0 0 0 0 0 0 0 0 0 0 0 3 0 0 0 0 0 0 0 0 0 0 0 0 0 0 0 0 0 0 0 0 0 0 0 0 0 0 0 0 0 0 0 0 0 0 0 0 0 0 0 0 0 0 0 0 1 0 0 0 0 0 0 0]
 [0 0 0 0 0 0 0 0 0 0 0 1 0 0 0 0 0 0 1 0 0 0 0 0 0 0 0 0 0 0 0 0 0 0 0 0 0 0 0 0 0 0 0 1 0 0 0 0 0 0 0 0 1 0 0 0 0 0 0 0 0 0 0 0 0 0 0 0 0 0 0 0 0 0 0 0 0 0 0 0 0 0 0 0 0 0 0 0 0 0 0 0 0 0 0 0 0 0 0 0]
 [0 0 0 0 0 0 0 0 0 0 0 0 0 0 0 0 0 0 0 0 0 0 0 0 0 0 0 0 0 0 0 0 0 0 0 0 0 0 0 0 0 0 0 0 0 0 0 1 0 0 0 0 0 0 0 0 0 0 0 0 0 0 0 0 0 0 0 0 0 0 0 0 0 1 0 0 0 0 0 0 0 0 0 0 0 1 0 0 1 0 0 0 0 0 0 0 0 0 0 0]
 [0 0 0 0 0 0 0 0 0 0 0 0 0 0 0 0 0 0 0 0 0 0 0 0 0 0 0 0 0 0 0 0 0 0 0 0 0 0 0 0 0 0 1 0 0 0 0 0 0 0 0 0 1 0 0 0 0 0 0 0 0 0 0 0 0 0 0 0 0 0 0 0 0 0 0 0 0 0 0 1 0 0 0 0 0 0 0 0 0 0 0 0 0 0 0 0 0 0 0 0]
 [0 0 0 0 0 0 0 0 0 0 0 1 0 0 0 0 0 0 0 0 0 0 0 0 0 0 0 0 0 0 0 0 0 0 0 0 0 0 0 0 0 0 0 0 0 1 0 0 1 0 0 0 0 0 0 0 0 0 0 0 0 0 0 0 0 0 0 0 0 0 0 0 0 0 0 0 0 0 0 0 0 0 0 0 1 0 0 0 0 0 0 0 0 0 0 0 0 0 0 0]
 [0 0 0 1 0 0 0 0 0 0 0 0 0 0 0 0 0 0 0 0 0 0 0 0 0 0 0 0 0 0 0 0 0 0 0 0 0 0 0 0 0 0 0 0 0 0 0 0 0 0 0 0 0 0 0 0 0 0 0 0 0 0 0 0 0 0 0 0 0 0 0 0 0 0 0 0 0 0 0 0 0 1 1 0 0 1 0 0 0 0 0 0 0 0 0 0 0 0 0 0]
 [0 0 0 0 0 0 0 0 0 0 0 0 0 0 0 0 0 0 0 0 0 0 0 0 0 0 0 0 0 0 1 0 0 0 0 0 0 0 0 0 0 0 0 0 0 0 0 1 0 0 0 0 0 0 0 0 0 0 0 0 0 0 0 0 0 0 0 0 0 0 0 0 0 0 0 0 0 0 0 1 0 0 0 0 0 0 0 0 0 0 0 0 0 0 0 0 0 0 0 0]
 [0 0 0 0 0 0 0 0 0 0 0 0 0 0 0 0 0 0 0 0 0 0 0 0 0 0 0 0 0 0 0 0 0 0 0 0 0 0 0 0 0 0 0 0 0 0 0 1 1 0 0 0 0 0 0 0 0 0 0 0 0 0 0 0 0 0 0 0 0 0 0 0 0 0 0 0 0 0 0 0 0 0 0 0 0 0 0 0 0 0 0 0 0 0 0 0 0 1 0 0]
 [0 0 0 0 1 0 0 1 0 0 0 0 0 0 0 0 0 0 1 0 0 0 0 0 0 0 0 0 0 0 0 0 0 0 0 0 0 1 0 0 0 0 0 0 0 0 0 0 0 0 0 0 0 0 0 0 0 0 0 0 0 0 0 0 0 0 0 0 0 0 0 0 0 0 0 0 0 0 0 0 0 0 0 0 0 0 0 0 0 0 0 0 0 0 0 0 0 0 0 0]
 [0 0 0 0 0 0 0 0 0 0 0 0 0 0 0 0 0 0 0 0 0 0 0 0 0 0 0 0 0 0 0 0 0 0 0 0 0 0 0 0 0 0 0 0 0 0 0 3 0 0 0 0 0 0 0 0 0 0 0 0 0 0 0 0 0 0 0 0 0 0 0 0 0 0 0 0 0 0 0 1 0 0 0 0 0 0 0 0 0 0 0 0 0 0 0 0 0 0 0 0]
 [0 0 0 0 0 0 0 0 0 0 0 0 0 0 0 0 0 0 0 0 0 0 0 0 0 0 0 0 0 0 0 1 0 0 0 0 0 0 0 0 0 0 0 0 0 1 0 1 0 0 0 0 0 0 0 0 0 0 0 0 0 0 0 1 0 0 0 0 0 0 0 0 0 0 0 0 0 0 0 0 0 0 0 0 0 0 0 0 0 0 0 0 0 0 0 0 0 0 0 0]
 [0 0 0 0 0 0 0 0 0 0 0 0 0 0 0 0 0 0 0 0 0 0 0 0 0 0 0 0 0 0 0 0 0 0 0 0 0 1 0 0 0 0 1 0 0 0 0 0 0 0 0 0 0 0 0 0 0 0 0 0 0 0 0 0 0 0 0 0 0 0 0 0 0 0 0 0 0 0 0 0 0 0 1 0 0 0 0 0 0 0 0 0 0 0 0 0 0 1 0 0]
 [0 0 0 0 0 0 0 0 0 0 0 0 0 0 0 0 0 0 0 0 0 0 0 0 0 0 0 0 0 0 0 0 0 0 0 0 0 0 0 0 0 0 0 0 0 0 0 1 0 0 0 0 0 0 0 0 0 0 0 0 0 0 0 0 0 0 0 0 0 0 0 0 0 0 0 0 0 0 1 0 0 0 1 0 0 0 0 1 1 0 0 0 0 0 0 0 0 0 0 0]
 [0 0 0 0 0 0 0 0 0 0 0 0 0 0 0 0 0 0 2 0 0 0 0 0 0 0 0 0 0 0 0 0 0 0 0 0 0 0 0 0 0 0 0 1 0 0 0 0 0 0 0 0 0 0 0 0 0 0 0 0 0 0 0 0 0 0 0 0 0 1 0 0 0 0 0 0 0 0 0 0 0 0 0 0 0 0 0 0 0 0 0 0 0 0 0 0 0 0 0 0]
 [0 0 0 0 0 0 0 0 0 0 0 1 1 0 0 0 0 0 0 0 0 0 0 0 0 0 0 0 0 0 0 0 0 0 0 0 0 0 0 0 0 0 0 0 0 0 0 0 0 0 0 0 0 0 0 0 0 0 0 0 0 0 0 0 0 0 0 0 0 0 0 0 2 0 0 0 0 0 0 0 0 0 0 0 0 0 0 0 0 0 0 0 0 0 0 0 0 0 0 0]
 [0 0 0 0 0 0 0 0 0 0 0 0 0 0 0 0 0 0 0 0 0 0 0 0 0 0 0 0 0 0 1 0 0 0 0 0 0 0 0 0 0 0 0 0 0 0 0 1 0 0 0 0 1 0 0 0 0 0 0 0 0 0 0 0 0 0 0 0 0 0 0 0 0 0 0 0 0 0 0 0 0 1 0 0 0 0 0 0 0 0 0 0 0 0 0 0 0 0 0 0]
 [0 0 0 0 0 0 0 0 0 0 0 0 0 0 0 0 0 0 0 0 0 0 0 0 0 0 0 0 0 0 0 0 0 0 0 0 0 0 0 0 0 0 0 0 0 0 0 0 0 0 0 0 0 0 0 0 0 0 0 1 0 0 0 0 0 0 0 0 0 0 0 0 0 0 0 0 0 0 0 1 0 0 1 0 0 0 0 1 0 0 0 0 0 0 0 0 0 0 0 0]
 [0 0 0 0 0 0 0 0 0 0 0 0 0 0 0 0 0 0 0 0 0 0 0 0 0 0 0 0 0 0 0 0 0 0 0 0 0 0 0 0 0 0 0 1 0 0 1 0 0 0 0 0 0 0 0 0 0 0 0 0 0 0 0 0 0 0 0 0 0 0 0 0 0 0 0 0 0 0 0 0 0 0 0 0 0 0 0 0 2 0 0 0 0 0 0 0 0 0 0 0]
 [0 0 0 0 0 0 0 0 0 0 0 0 0 0 0 0 0 0 0 0 0 0 0 0 0 0 0 0 0 0 0 0 0 0 0 0 0 0 0 0 0 0 0 2 0 0 0 0 0 0 0 0 0 0 0 0 0 0 0 0 0 0 0 0 0 0 0 0 0 0 0 0 0 0 0 0 0 0 0 0 0 0 0 0 0 0 0 0 2 0 0 0 0 0 0 0 0 0 0 0]
 [0 0 0 0 0 0 0 0 0 0 0 0 0 0 0 0 0 0 0 0 0 0 0 0 0 0 0 0 0 0 0 0 0 0 0 0 0 0 0 0 0 0 0 0 0 0 0 1 0 0 0 0 0 0 0 0 0 0 0 1 0 0 0 0 0 0 0 0 0 0 0 0 0 0 0 0 0 0 0 0 0 0 0 0 0 0 0 0 1 0 0 0 0 0 0 0 0 0 0 0]
 [0 0 0 0 0 0 0 0 0 0 0 0 1 0 0 0 0 0 0 0 0 0 0 0 0 0 0 0 0 0 1 0 0 0 0 0 0 0 0 0 0 0 0 1 0 0 0 1 0 0 0 0 0 0 0 0 0 0 0 0 0 0 0 0 0 0 0 0 0 0 0 0 0 0 0 0 0 0 0 0 0 0 0 0 0 0 0 0 0 0 0 0 0 0 0 0 0 0 0 0]
 [0 0 0 0 0 0 0 0 0 0 0 0 0 0 0 0 0 0 0 0 0 0 0 0 0 0 0 0 0 0 0 3 0 0 0 0 0 0 0 0 0 0 0 0 0 0 0 0 0 0 0 0 0 0 0 0 0 0 0 0 0 0 0 0 0 0 0 0 0 0 0 0 0 0 0 0 0 0 0 0 0 0 0 0 0 0 0 0 0 0 0 0 0 0 0 0 0 0 0 0]
 [0 0 1 0 0 0 0 0 0 0 0 0 0 0 0 0 0 0 0 0 0 0 0 0 0 0 0 0 0 0 0 0 0 0 0 0 0 0 0 0 0 0 0 0 0 0 0 2 0 0 0 0 0 0 0 0 0 0 0 0 0 0 0 0 0 0 0 0 0 0 0 0 0 0 0 0 0 0 0 0 0 0 0 0 0 0 0 0 1 0 0 0 0 0 0 0 0 0 0 0]
 [0 1 0 0 0 0 0 0 0 0 0 0 0 0 0 0 0 0 1 0 0 0 0 0 0 0 0 0 0 0 0 0 0 0 0 0 0 0 0 0 0 0 0 0 0 0 0 0 0 0 0 0 0 0 0 0 0 0 0 0 0 0 0 0 0 0 0 0 0 0 0 0 0 0 0 0 0 0 1 0 0 0 1 0 0 0 0 0 0 0 0 0 0 0 0 0 0 0 0 0]
 [0 0 0 0 0 0 0 0 0 0 0 0 0 0 0 0 0 0 0 0 0 0 0 0 0 0 0 0 0 0 0 0 0 0 0 0 1 0 0 0 0 0 1 0 0 0 0 0 0 0 0 0 0 0 0 0 0 0 0 0 0 0 0 0 0 0 0 1 0 0 0 0 0 0 0 0 0 0 0 0 0 0 0 0 0 0 0 0 1 0 0 0 0 0 0 0 0 0 0 0]
 [0 0 0 0 0 0 0 0 0 0 0 0 0 0 0 0 0 0 0 0 0 0 0 0 0 0 0 0 0 0 0 0 0 0 0 0 0 0 0 0 0 0 0 0 0 0 0 2 0 0 0 1 0 0 0 0 0 0 0 0 0 0 0 0 0 0 0 0 0 0 0 0 0 0 0 0 0 0 0 0 0 0 0 0 0 1 0 0 0 0 0 0 0 0 0 0 0 0 0 0]
 [0 0 0 0 0 0 0 0 0 0 0 1 0 0 0 0 0 0 0 0 0 0 0 0 0 0 0 0 0 0 0 0 0 0 0 0 0 0 0 0 0 0 0 0 0 0 0 0 0 0 0 0 0 0 0 0 0 0 0 0 0 0 0 0 0 0 0 0 0 0 0 0 0 0 0 0 0 0 0 0 0 0 1 0 0 0 0 0 1 0 0 0 0 0 0 0 0 0 0 0]
 [0 0 0 0 0 0 0 0 0 0 0 0 0 0 0 0 0 0 0 0 0 0 0 0 0 0 0 0 0 0 0 0 0 0 0 0 0 2 0 0 0 0 0 0 0 0 0 0 0 0 0 0 0 0 0 0 0 0 0 0 0 0 0 0 0 0 0 0 0 0 0 0 0 0 0 0 0 0 0 1 0 0 0 0 0 0 0 0 0 0 0 0 0 0 0 0 0 0 0 0]
 [1 1 0 0 0 0 0 0 0 0 0 0 0 0 0 0 0 0 0 0 0 0 0 0 0 0 0 0 0 0 0 0 0 0 0 0 0 0 0 0 0 0 0 0 0 0 0 0 0 0 0 0 0 0 0 0 0 0 0 0 0 0 0 0 0 0 0 0 0 0 0 0 0 0 0 0 0 0 0 0 0 0 0 0 0 0 0 0 0 0 0 0 0 0 0 0 0 0 0 1]
 [0 0 0 1 0 0 0 0 0 0 0 0 0 0 0 0 0 0 0 0 0 0 0 0 0 0 0 0 0 0 0 0 0 0 0 0 1 0 0 0 0 0 0 0 0 1 0 0 0 0 0 0 0 0 0 0 0 0 0 0 0 0 0 0 0 0 0 0 0 0 0 0 0 0 0 0 0 0 0 0 0 0 0 0 0 0 0 0 0 0 0 0 0 0 0 0 0 0 0 0]
 [0 0 0 0 0 0 0 0 0 0 0 0 0 0 0 0 0 0 1 0 0 0 0 0 0 0 0 0 0 0 0 0 0 0 0 0 0 0 0 0 0 0 0 1 0 0 0 0 0 0 0 0 0 0 1 0 0 0 0 0 0 0 0 0 0 0 0 0 0 0 0 0 0 0 0 0 0 0 0 0 0 0 0 0 0 0 0 0 0 0 0 0 0 0 0 0 0 0 0 0]
 [0 0 1 0 0 0 0 0 0 0 0 0 0 0 0 0 0 0 0 0 0 0 0 0 0 0 0 0 0 0 0 0 0 0 0 0 0 0 0 0 0 0 0 0 0 0 0 1 0 0 0 0 0 0 0 0 0 0 0 0 0 0 0 0 0 0 0 0 0 0 0 0 0 0 0 0 0 0 1 0 0 0 0 0 0 0 0 0 0 0 0 0 0 0 0 0 0 0 0 0]
 [0 0 0 0 0 0 0 0 0 0 0 0 0 0 0 0 0 0 0 0 0 0 0 0 0 0 0 0 0 0 0 0 0 0 0 0 0 0 0 0 0 0 2 0 0 0 0 0 0 0 0 0 1 0 0 0 0 0 0 0 0 0 0 0 0 0 0 0 0 0 0 0 0 0 0 0 0 0 0 0 0 0 0 0 0 0 0 0 0 0 0 0 0 0 0 0 0 0 0 0]
 [0 0 0 0 0 0 0 0 0 0 0 1 0 0 0 0 0 0 0 0 0 0 0 0 0 0 0 0 0 0 0 0 0 0 0 0 0 0 0 0 0 0 0 0 0 0 0 0 0 0 0 0 0 0 0 0 0 0 0 0 0 0 0 0 0 0 0 0 0 0 0 0 0 0 0 0 0 0 0 0 0 0 0 0 0 1 0 0 1 0 0 0 0 0 0 0 0 0 0 0]
 [0 0 1 0 0 0 0 0 0 0 0 0 0 0 0 0 0 0 0 0 0 0 0 0 0 0 0 0 0 0 0 0 0 0 0 0 0 0 0 0 0 0 1 0 0 0 0 0 1 0 0 0 0 0 0 0 0 0 0 0 0 0 0 0 0 0 0 0 0 0 0 0 0 0 0 0 0 0 0 0 0 0 0 0 0 0 0 0 0 0 0 0 0 0 0 0 0 0 0 0]
 [0 0 0 0 0 0 0 0 0 0 0 0 0 0 0 0 0 0 0 0 0 0 0 0 0 0 0 0 0 0 0 0 0 0 0 0 0 0 0 0 0 0 0 0 0 2 0 1 0 0 0 0 0 0 0 0 0 0 0 0 0 0 0 0 0 0 0 0 0 0 0 0 0 0 0 0 0 0 0 0 0 0 0 0 0 0 0 0 0 0 0 0 0 0 0 0 0 0 0 0]
 [0 0 0 0 0 0 0 0 0 0 0 0 0 0 0 0 0 0 0 0 0 0 0 0 0 0 0 0 0 0 0 0 0 0 0 0 0 0 0 0 0 0 0 0 0 0 1 0 1 0 0 0 0 0 0 0 0 0 0 0 0 0 0 0 0 0 0 0 0 0 0 0 0 0 0 0 0 0 0 0 0 0 0 0 0 0 0 0 1 0 0 0 0 0 0 0 0 0 0 0]
 [0 0 0 0 0 0 0 0 0 0 0 0 0 0 0 0 0 0 0 0 0 0 0 0 0 0 0 0 0 0 0 0 0 0 0 0 0 0 0 0 0 0 0 0 0 0 0 2 0 0 0 0 0 0 0 0 0 0 0 0 0 0 0 0 0 0 0 0 0 0 0 0 0 0 0 0 0 0 0 0 0 0 0 0 0 0 0 0 0 0 0 0 0 0 0 0 0 0 0 0]
 [0 0 0 0 0 0 0 0 0 0 0 0 0 0 0 0 0 0 0 0 0 0 0 0 0 0 0 0 0 0 0 0 0 0 0 0 0 0 0 0 0 0 0 0 0 0 0 0 2 0 0 0 0 0 0 0 0 0 0 0 0 0 0 0 0 0 0 0 0 0 0 0 0 0 0 0 0 0 0 0 0 1 0 0 0 0 0 0 0 0 0 0 0 0 0 0 0 0 0 0]
 [0 0 0 0 0 0 0 0 0 0 0 0 0 0 0 0 0 0 0 0 0 0 0 0 0 0 0 0 0 0 0 0 0 0 0 0 0 0 0 0 0 0 0 0 0 0 0 0 0 0 0 0 0 0 1 0 0 0 0 0 0 0 0 0 0 0 0 0 0 0 0 0 0 0 0 0 0 0 1 0 0 0 0 0 0 0 0 0 0 0 0 0 0 0 0 0 0 1 0 0]
 [0 0 0 0 0 0 0 0 0 0 0 0 0 0 0 0 0 0 0 0 0 0 0 0 0 0 0 0 0 0 0 0 0 0 0 0 0 0 0 0 0 0 0 1 0 0 1 0 0 0 0 0 0 0 0 0 0 0 0 0 0 0 0 0 0 0 0 0 0 0 0 0 0 0 0 0 0 0 0 0 0 0 0 0 0 0 0 1 0 0 0 0 0 0 0 0 0 0 0 0]
 [0 0 0 0 0 0 0 0 0 0 0 0 0 0 0 0 0 0 0 0 0 0 0 0 0 0 0 0 0 0 0 0 0 0 0 0 0 0 0 0 0 0 1 0 0 0 0 0 0 0 0 0 0 0 0 0 0 0 0 0 0 0 0 0 0 0 0 0 0 0 0 0 0 0 0 0 0 0 0 1 0 0 1 0 0 0 0 0 0 0 0 0 0 0 0 0 0 0 0 0]
 [0 0 0 0 0 0 0 0 0 0 0 1 0 0 0 0 0 0 0 0 0 0 0 0 0 0 0 0 0 0 0 0 0 0 0 0 0 0 0 0 0 0 0 0 0 0 0 0 0 0 0 0 2 0 0 0 0 0 0 0 0 0 0 0 0 0 0 0 0 0 0 0 0 0 0 0 0 0 0 0 0 0 0 0 0 0 0 0 0 0 0 0 0 0 0 0 0 0 0 0]
 [0 0 0 0 0 0 0 0 0 0 0 0 0 0 0 0 0 0 0 0 0 0 0 0 0 0 0 0 0 0 0 0 0 0 0 0 0 0 0 0 0 0 0 1 0 0 0 0 0 0 0 0 0 0 0 0 0 0 0 0 0 0 0 0 0 0 0 0 0 0 0 0 0 0 0 0 0 0 0 0 0 0 0 0 0 0 0 0 2 0 0 0 0 0 0 0 0 0 0 0]
 [0 0 0 0 0 0 0 0 0 0 0 0 0 0 0 0 0 0 0 0 0 0 0 0 0 0 0 0 0 0 0 0 0 0 0 0 0 0 0 0 0 0 0 0 0 0 0 0 0 0 0 0 0 0 0 0 0 0 0 0 0 0 0 0 0 0 0 0 0 0 0 0 0 0 0 0 0 0 1 0 0 0 0 0 2 0 0 0 0 0 0 0 0 0 0 0 0 0 0 0]
 [0 1 0 0 0 0 0 0 0 0 0 0 0 0 0 0 0 0 0 0 0 0 0 0 0 0 0 0 0 0 0 0 0 0 0 0 0 0 0 0 0 0 0 0 0 0 0 0 0 0 0 0 0 0 0 0 0 0 0 1 0 0 0 0 0 0 0 0 0 0 0 0 0 0 0 0 0 0 0 1 0 0 0 0 0 0 0 0 0 0 0 0 0 0 0 0 0 0 0 0]
 [0 0 0 0 0 0 0 0 0 0 0 0 0 0 0 0 0 0 0 0 0 0 0 0 0 0 0 0 0 0 0 0 0 0 0 0 0 0 0 0 0 0 0 0 0 0 0 0 0 0 0 0 0 0 0 0 0 0 0 0 0 0 0 1 0 0 0 0 0 0 0 0 0 0 0 0 0 0 0 1 0 0 0 0 0 0 0 0 0 0 0 0 1 0 0 0 0 0 0 0]
 [0 0 0 0 0 0 0 0 0 0 0 1 0 0 0 0 0 0 0 0 0 0 0 0 0 0 0 0 0 0 0 0 0 0 0 0 0 0 0 0 0 0 0 1 0 0 0 0 0 0 0 0 0 0 0 0 0 0 0 0 0 0 0 0 0 0 0 0 0 0 0 0 0 0 0 0 0 0 0 0 0 0 0 0 0 0 0 0 1 0 0 0 0 0 0 0 0 0 0 0]
 [0 0 0 0 0 0 0 0 0 0 0 0 0 0 0 0 0 0 0 0 0 0 0 0 0 0 0 0 0 0 0 0 0 0 0 0 0 0 0 0 0 0 0 0 0 0 0 1 0 0 0 0 0 0 0 0 0 0 0 0 0 0 0 0 0 0 0 0 0 0 0 0 0 0 0 0 0 0 0 0 0 0 0 0 1 0 0 0 0 0 0 0 0 0 0 0 0 1 0 0]
 [0 0 0 0 0 0 0 0 0 0 0 0 0 0 0 0 0 0 0 0 0 0 0 0 0 0 0 0 0 0 0 0 0 0 0 0 0 0 0 0 0 0 0 0 0 0 0 0 0 0 0 0 0 0 0 0 0 0 0 2 0 0 0 0 0 0 0 0 0 0 0 0 0 0 0 0 0 0 0 0 0 0 0 0 0 0 0 0 0 0 0 0 0 0 1 0 0 0 0 0]
 [0 0 0 0 0 0 0 0 0 0 0 0 0 0 0 0 0 0 0 0 0 0 0 0 0 0 0 0 0 0 0 0 0 0 1 0 0 0 0 0 0 0 0 0 0 0 0 0 0 0 0 0 0 0 0 0 0 0 0 0 0 0 0 0 0 0 0 0 0 0 0 0 0 0 0 0 0 0 0 0 0 0 0 0 0 0 0 0 1 0 0 0 0 0 0 0 0 0 0 0]
 [0 0 0 0 0 0 0 0 0 0 0 0 0 0 0 0 0 0 0 0 0 0 0 0 0 0 0 1 0 0 0 0 0 0 0 0 0 0 0 0 0 0 1 0 0 0 0 0 0 0 0 0 0 0 0 0 0 0 0 0 0 0 0 0 0 0 0 0 0 0 0 0 0 0 0 0 0 0 0 0 0 0 0 0 0 0 0 0 0 0 0 0 0 0 0 0 0 0 0 0]
 [0 0 0 0 0 0 0 0 0 0 0 0 0 0 0 0 0 0 0 0 0 0 0 0 0 1 0 0 0 0 0 0 0 0 0 0 0 0 0 0 0 0 0 1 0 0 0 0 0 0 0 0 0 0 0 0 0 0 0 0 0 0 0 0 0 0 0 0 0 0 0 0 0 0 0 0 0 0 0 0 0 0 1 0 0 0 0 0 0 0 0 0 0 0 0 0 0 0 0 0]
 [0 0 0 0 0 0 0 0 0 0 0 0 0 0 0 0 0 0 0 0 0 0 0 0 0 0 0 0 0 0 0 0 0 0 0 0 0 0 0 0 0 0 0 0 0 0 0 0 0 0 0 0 0 0 1 0 0 0 0 0 0 0 0 0 0 0 0 0 0 0 0 0 0 0 0 0 0 0 0 0 0 0 0 0 0 0 0 1 0 0 0 0 0 0 0 0 0 0 0 0]
 [0 0 0 0 1 0 0 0 0 0 0 0 0 0 0 0 0 0 0 0 0 0 0 0 0 0 0 0 0 0 0 0 0 0 0 0 0 0 0 0 0 0 0 0 0 1 0 0 0 0 0 0 0 0 1 0 0 0 0 0 0 0 0 0 0 0 0 0 0 0 0 0 0 0 0 0 0 0 0 0 0 0 0 0 0 0 0 0 0 0 0 0 0 0 0 0 0 0 0 0]
 [0 0 0 0 0 0 0 0 0 0 0 0 0 0 0 0 0 0 0 0 0 0 0 0 0 0 0 0 0 0 0 0 0 0 0 0 0 0 0 0 0 0 1 0 0 0 0 1 0 0 0 0 0 0 0 0 0 0 0 0 0 0 0 0 0 0 0 0 1 0 0 0 0 0 0 0 0 0 0 0 0 0 0 0 0 0 0 0 0 0 0 0 0 0 0 0 0 0 0 0]
 [0 0 0 0 0 0 0 0 0 0 0 0 0 0 0 0 0 0 1 0 0 0 0 0 0 0 0 0 0 0 0 0 0 0 0 0 0 1 0 0 0 0 0 0 0 0 0 0 0 0 0 0 0 0 0 0 0 0 0 0 0 0 0 0 0 0 0 0 0 0 0 0 0 0 0 0 0 0 0 0 0 0 0 0 0 0 0 0 0 0 0 0 0 0 0 0 0 0 0 0]
 [0 0 0 0 0 0 0 0 0 0 0 0 0 0 0 0 0 0 0 0 0 0 0 0 0 0 0 0 0 0 0 0 0 0 0 0 0 1 0 0 0 0 0 0 0 0 0 0 0 0 0 0 0 0 0 0 0 0 0 0 0 0 0 0 0 0 0 0 0 0 0 0 0 0 0 0 0 0 0 0 0 0 0 0 0 0 0 0 1 0 0 0 0 0 0 0 0 0 0 0]
 [0 0 0 1 0 0 0 0 0 0 0 0 0 0 0 0 0 0 0 0 0 0 0 0 0 0 0 0 0 0 0 0 0 0 0 0 0 0 0 0 0 0 0 0 0 1 0 0 0 0 0 0 0 0 0 0 0 0 0 0 0 0 0 0 0 0 0 0 0 0 0 0 0 0 0 0 0 0 0 0 0 0 0 0 0 0 0 0 1 0 0 0 0 0 0 0 0 0 0 0]
 [0 0 0 0 0 0 0 0 0 0 0 0 0 0 0 0 0 0 0 0 0 0 0 0 0 0 0 0 0 0 0 0 0 0 0 0 0 0 0 0 0 0 0 0 0 0 1 0 0 0 0 0 0 0 0 0 0 0 0 0 0 0 0 0 0 0 0 0 0 1 0 0 0 0 0 0 0 0 0 0 0 0 0 0 0 0 0 0 1 0 0 0 0 0 0 0 0 0 0 0]
 [0 0 0 0 0 0 0 0 0 0 0 0 0 0 0 0 0 0 0 0 0 0 0 0 0 0 0 0 0 0 0 0 0 0 0 0 0 0 0 0 0 0 0 1 0 0 0 0 0 0 0 0 0 0 0 0 0 0 0 0 0 0 0 0 0 0 0 0 0 0 0 0 0 0 0 0 0 0 0 0 0 0 1 0 1 0 0 0 0 0 0 0 0 0 0 0 0 0 0 0]
 [0 0 0 0 0 0 0 0 0 0 0 0 0 0 0 0 0 0 0 0 0 0 0 0 0 0 0 0 0 0 0 0 0 0 0 0 0 0 0 0 0 0 0 2 0 0 0 0 0 0 0 0 0 0 0 0 0 0 0 0 0 0 0 0 0 0 0 0 0 0 0 0 0 0 0 0 0 0 0 0 0 0 0 0 0 1 0 0 1 0 0 0 0 0 0 0 0 0 0 0]
 [0 0 0 0 0 0 0 0 0 0 0 0 0 0 0 0 0 0 0 1 0 0 0 0 0 0 0 0 0 0 0 0 0 0 0 0 0 0 0 0 0 0 1 0 0 0 0 0 0 0 0 0 0 0 0 0 0 0 0 0 0 0 0 0 0 0 0 0 0 0 0 0 0 0 0 0 0 0 0 0 0 0 0 0 0 0 0 0 1 0 0 0 0 0 0 0 0 0 0 0]
 [0 0 0 0 0 0 0 0 0 0 0 0 0 0 0 0 0 0 0 0 0 0 0 0 0 0 0 0 0 0 0 0 0 0 0 0 0 0 0 0 0 0 0 0 0 0 0 0 0 0 0 0 1 0 0 0 0 0 0 0 0 0 0 0 0 0 0 0 0 0 0 0 0 0 0 0 0 0 0 0 0 0 0 0 0 1 0 0 0 0 0 0 2 0 0 0 0 0 0 0]
 [0 0 1 0 0 0 0 0 0 0 0 0 0 0 0 0 0 0 0 0 0 0 0 0 0 0 0 0 0 0 0 0 0 0 0 0 0 0 0 0 0 0 0 0 0 0 0 0 0 0 0 0 0 0 0 0 0 0 0 0 0 0 0 0 0 0 0 0 0 0 0 0 0 0 0 0 0 0 1 0 0 0 0 0 0 0 0 0 0 0 0 0 0 0 0 0 0 1 0 0]
 [0 0 0 0 0 0 0 0 0 0 0 1 0 0 0 0 0 0 0 0 0 0 0 0 0 0 0 0 0 0 0 0 0 0 0 0 0 0 0 0 0 0 0 0 0 0 0 0 0 0 0 0 0 0 0 0 0 0 0 0 0 0 0 0 0 0 0 0 0 0 0 0 0 0 0 0 0 0 0 0 0 0 0 0 0 0 0 0 1 0 0 0 0 0 1 0 0 0 0 0]
 [0 0 0 0 0 0 0 0 0 0 0 0 0 0 0 0 0 0 0 0 0 0 0 0 0 0 0 0 0 0 0 0 0 0 0 0 0 0 0 0 0 0 0 0 0 0 0 1 0 0 0 0 1 0 0 0 0 0 0 0 0 0 0 0 0 0 0 0 0 0 0 0 0 0 0 0 0 0 0 0 0 0 0 0 1 0 0 0 0 0 0 0 0 0 0 0 0 0 0 0]
 [0 0 0 0 0 0 0 0 0 0 0 0 0 0 0 0 0 0 0 0 0 0 0 0 0 0 0 0 0 0 0 0 0 0 0 0 0 1 0 0 0 0 0 0 0 0 0 1 0 0 0 0 0 0 0 0 0 0 0 0 0 0 0 0 0 0 0 0 0 0 0 0 0 0 0 0 0 0 0 0 0 1 0 0 0 0 0 0 0 0 0 0 0 0 0 0 0 0 0 0]
 [0 0 0 0 0 0 0 0 0 0 0 0 0 0 0 0 0 0 0 0 0 0 0 0 0 0 0 0 0 0 0 0 0 0 0 0 0 1 0 0 0 0 0 0 0 0 0 1 0 0 0 0 0 0 0 0 0 0 0 0 0 0 0 0 0 0 0 0 0 0 0 0 0 0 0 0 0 0 1 1 0 0 0 0 0 0 0 0 0 0 0 0 0 0 0 0 0 0 0 0]
 [0 0 0 0 0 0 0 0 0 0 0 0 0 0 0 0 0 0 0 0 0 0 0 0 0 0 0 0 0 0 0 0 0 0 0 0 0 0 0 0 0 0 0 0 0 0 0 0 0 1 1 0 0 0 1 0 0 0 0 0 0 0 0 0 0 0 0 0 0 0 0 0 0 0 0 0 0 0 0 0 0 0 0 0 0 0 0 0 0 0 0 0 0 0 0 0 0 0 0 0]
 [0 0 0 0 0 0 0 0 0 0 0 0 0 0 0 0 0 0 0 0 0 0 0 0 0 0 0 0 0 0 0 0 0 0 0 0 0 0 0 0 0 0 0 1 0 0 0 2 0 0 0 0 0 0 0 0 0 0 0 0 0 0 0 0 0 0 0 0 0 0 0 0 0 0 0 0 0 0 0 0 0 0 0 0 0 0 0 0 0 0 0 0 0 0 0 0 0 0 0 0]
 [0 0 1 0 0 0 0 0 0 0 0 0 0 0 0 0 0 0 0 0 0 0 0 0 0 0 0 0 0 0 0 0 0 0 0 0 0 0 0 0 0 0 0 0 0 0 0 0 0 0 0 0 0 0 0 0 0 0 0 0 0 0 0 0 0 0 0 0 0 0 0 0 1 0 0 0 0 0 0 0 0 0 0 0 0 0 0 0 1 0 0 0 0 0 0 0 0 0 0 0]
 [0 0 0 0 0 0 0 0 0 0 0 0 0 0 0 0 0 0 0 0 0 0 0 0 0 0 0 0 0 0 0 0 0 0 0 0 0 0 0 0 0 0 0 0 0 0 0 0 0 0 0 0 0 0 0 0 0 0 0 0 0 0 0 0 0 0 0 0 0 0 0 0 0 0 0 0 0 0 0 0 0 0 2 0 0 0 0 0 0 0 0 0 0 0 0 0 0 1 0 0]
 [0 0 0 0 0 0 0 0 0 0 0 0 0 0 0 0 0 0 0 0 0 0 0 0 0 0 0 0 0 0 0 0 0 0 0 0 0 0 0 0 0 0 0 0 0 1 0 1 0 0 0 0 0 0 0 0 0 0 0 0 0 0 0 0 0 0 0 0 0 0 0 0 0 0 0 0 0 0 0 0 0 0 0 1 0 0 0 0 0 0 0 0 0 0 0 0 0 0 0 0]
 [0 0 0 0 0 0 0 0 0 0 0 0 0 0 0 0 0 0 0 0 0 0 0 0 0 0 0 0 0 0 0 0 0 0 0 0 0 0 0 0 0 0 0 0 0 1 0 1 0 0 0 0 0 0 0 0 0 0 0 0 0 0 0 0 0 0 0 0 0 0 0 0 0 0 0 0 0 0 0 0 0 0 0 0 1 0 0 0 0 0 0 0 0 0 0 0 0 0 0 0]
 [0 1 0 0 0 0 0 0 0 0 0 0 0 0 0 0 0 0 0 0 0 0 0 0 0 0 0 0 0 0 0 0 0 0 0 0 0 0 0 0 0 0 0 0 0 0 0 0 0 0 0 0 0 0 0 0 0 0 0 0 0 0 0 0 0 0 0 0 0 0 0 0 0 0 0 0 0 0 0 0 0 1 0 0 0 0 0 0 0 0 0 0 0 0 1 0 0 0 0 0]
 [0 0 0 0 0 0 0 0 0 0 0 1 1 0 0 0 0 0 0 0 0 0 0 0 0 0 0 0 0 0 0 0 0 0 0 0 0 0 0 0 0 0 0 0 0 0 0 0 0 0 0 0 1 0 0 0 0 0 0 0 0 0 0 0 0 0 0 0 0 0 0 0 0 0 0 0 0 0 0 0 0 0 0 0 0 0 0 0 0 0 0 0 0 0 0 0 0 0 0 0]
 [0 0 0 0 0 0 0 0 0 0 0 0 0 0 0 0 0 0 0 0 0 0 0 0 0 0 0 0 0 0 0 0 0 0 0 0 0 0 0 0 0 0 0 0 0 0 0 0 0 0 0 0 0 0 0 0 0 0 0 0 0 0 0 0 0 0 0 0 0 0 0 0 0 0 0 0 0 0 0 0 0 0 0 0 0 0 0 2 1 0 0 0 0 0 0 0 0 0 0 0]
 [0 0 0 0 0 0 0 0 0 0 0 0 0 0 0 0 0 0 0 0 0 0 0 0 0 0 0 0 0 0 0 0 0 0 0 0 0 0 0 0 0 0 0 0 0 0 0 0 0 0 0 0 0 0 0 0 0 0 0 0 0 0 0 0 0 0 0 0 0 0 0 0 0 0 0 0 0 0 0 0 0 0 0 0 0 0 0 0 3 0 0 0 0 0 0 0 0 0 0 0]
 [0 0 0 0 0 0 0 0 0 0 0 0 0 0 0 0 0 0 0 0 0 0 0 0 0 0 0 0 0 0 0 0 0 0 0 0 0 0 0 0 0 0 0 0 0 0 0 0 0 0 0 1 1 0 0 0 0 0 0 0 0 0 0 0 0 0 0 0 0 0 0 0 0 0 0 0 0 0 0 0 0 0 1 0 0 0 0 0 0 0 0 0 0 0 0 0 0 0 0 0]
 [0 0 0 0 0 0 0 0 0 0 0 0 0 0 0 0 0 0 0 0 0 0 0 0 0 0 0 0 0 0 0 0 0 0 0 0 0 0 0 0 0 0 2 0 0 0 0 0 0 0 0 0 0 0 0 0 0 0 0 0 0 0 0 0 0 0 0 0 0 0 0 0 0 0 0 0 0 0 0 0 0 0 1 0 0 0 0 0 0 0 0 0 0 0 0 0 0 0 0 0]
 [0 1 0 1 0 0 0 0 0 0 0 0 0 0 0 0 0 0 0 0 0 0 0 0 0 0 0 0 0 0 0 0 0 0 0 0 0 0 0 0 0 0 1 0 0 0 0 0 0 0 0 0 0 0 0 0 0 0 0 0 0 0 0 0 0 0 0 0 0 0 0 0 0 0 0 0 0 0 0 0 0 0 0 0 0 0 0 0 0 0 0 0 0 0 0 0 0 0 0 0]
 [0 0 0 0 0 0 0 0 0 0 0 0 0 0 0 0 0 0 0 0 0 0 0 0 0 0 0 0 0 0 0 0 0 0 0 0 0 0 0 0 0 0 0 0 0 0 0 1 0 0 0 0 0 0 0 0 0 0 0 0 0 0 0 0 0 0 0 0 0 0 0 0 0 0 0 0 0 0 1 0 0 0 0 0 0 0 0 0 0 0 0 0 1 0 0 0 0 0 0 0]
 [0 0 0 0 0 0 0 0 0 0 0 0 0 0 0 0 0 0 0 0 0 0 0 0 0 0 0 0 0 0 0 1 0 0 0 0 0 0 0 0 0 0 1 0 0 0 0 0 0 0 0 0 0 0 0 0 0 0 0 0 0 0 0 1 0 0 0 0 0 0 0 0 0 0 0 0 0 0 0 0 0 0 0 0 0 0 0 0 0 0 0 0 0 0 0 0 0 0 0 0]
 [0 0 0 0 0 0 0 0 0 0 0 0 0 0 0 0 0 0 0 0 0 0 0 0 0 0 0 0 0 0 0 0 0 0 0 0 0 0 0 0 0 0 0 0 0 0 0 1 0 0 0 0 0 0 0 0 0 0 0 0 0 0 0 0 0 0 0 0 0 0 0 0 0 0 0 0 0 0 0 0 0 0 0 0 0 0 0 0 0 1 0 0 0 0 1 0 0 0 0 0]
 [0 0 0 0 0 0 0 0 0 0 0 0 0 0 0 0 0 0 0 0 0 0 0 0 0 0 0 0 0 0 0 0 0 0 0 0 0 0 0 0 0 0 1 0 0 0 0 0 1 0 0 0 0 0 0 0 0 0 0 0 0 0 0 0 0 0 0 0 0 0 0 0 0 0 0 0 0 0 0 0 0 0 0 0 0 0 0 1 0 0 0 0 0 0 0 0 0 0 0 0]
 [0 0 0 0 0 0 0 0 0 0 0 0 0 0 0 0 0 0 0 0 0 0 0 0 0 0 0 0 0 0 0 0 0 0 0 0 0 0 0 0 0 0 0 1 0 0 0 0 2 0 0 0 0 0 0 0 0 0 0 0 0 0 0 0 0 0 0 0 0 0 0 0 0 0 0 0 0 0 0 0 0 0 0 0 0 0 0 0 0 0 0 0 0 0 0 0 0 0 0 0]
 [0 0 0 0 0 0 0 0 0 0 0 0 0 0 0 0 0 0 0 0 0 0 0 0 0 0 0 0 0 0 0 0 0 0 0 0 0 0 0 0 0 0 0 0 0 0 0 0 0 0 0 0 0 0 0 0 0 0 0 0 0 0 0 0 0 0 0 0 0 0 0 0 0 0 0 0 0 0 0 0 0 0 0 0 0 0 0 0 0 0 0 0 0 0 0 0 0 3 0 0]
 [0 0 0 0 0 0 0 0 0 0 0 0 0 0 0 0 0 0 0 0 0 0 0 0 0 0 0 0 0 0 0 0 0 0 0 0 0 0 0 0 0 0 0 0 0 0 0 1 0 0 0 0 0 0 0 0 0 0 0 0 0 0 0 0 0 0 0 0 0 0 0 0 0 0 0 0 0 0 0 1 0 0 0 0 0 0 0 0 0 0 0 0 0 0 0 0 0 1 0 0]
 [0 0 0 0 0 0 0 0 0 0 0 0 0 0 0 0 0 0 0 0 0 0 0 0 0 0 0 0 0 0 0 1 0 0 0 0 0 0 0 0 0 0 0 0 0 1 0 0 0 0 0 0 0 0 0 0 0 0 0 0 0 0 0 0 0 0 0 0 0 0 0 0 0 0 0 0 0 0 0 0 0 0 0 1 0 0 0 0 0 0 0 0 0 0 0 0 0 0 0 0]]
2017-12-18 23:39:49,131 - y_test         	y_pred_test    
2017-12-18 23:39:49,144 - accordion      	stop_sign      
2017-12-18 23:39:49,144 - accordion      	accordion      
2017-12-18 23:39:49,145 - airplanes      	scissors       
2017-12-18 23:39:49,145 - airplanes      	headphone      
2017-12-18 23:39:49,145 - airplanes      	scissors       
2017-12-18 23:39:49,145 - anchor         	snoopy         
2017-12-18 23:39:49,145 - anchor         	stop_sign      
2017-12-18 23:39:49,145 - anchor         	headphone      
2017-12-18 23:39:49,146 - ant            	snoopy         
2017-12-18 23:39:49,146 - ant            	snoopy         
2017-12-18 23:39:49,146 - ant            	snoopy         
2017-12-18 23:39:49,146 - barrel         	snoopy         
2017-12-18 23:39:49,146 - barrel         	platypus       
2017-12-18 23:39:49,146 - barrel         	ketch          
2017-12-18 23:39:49,146 - bass           	snoopy         
2017-12-18 23:39:49,147 - bass           	accordion      
2017-12-18 23:39:49,147 - bass           	platypus       
2017-12-18 23:39:49,147 - beaver         	crocodile_head 
2017-12-18 23:39:49,147 - beaver         	bonsai         
2017-12-18 23:39:49,147 - beaver         	emu            
2017-12-18 23:39:49,147 - binocular      	headphone      
2017-12-18 23:39:49,147 - binocular      	headphone      
2017-12-18 23:39:49,148 - binocular      	headphone      
2017-12-18 23:39:49,148 - binocular      	umbrella       
2017-12-18 23:39:49,148 - bonsai         	gerenuk        
2017-12-18 23:39:49,148 - bonsai         	bonsai         
2017-12-18 23:39:49,149 - bonsai         	joshua_tree    
2017-12-18 23:39:49,149 - bonsai         	car_side       
2017-12-18 23:39:49,149 - brain          	strawberry     
2017-12-18 23:39:49,150 - brain          	pyramid        
2017-12-18 23:39:49,150 - brain          	starfish       
2017-12-18 23:39:49,150 - brain          	headphone      
2017-12-18 23:39:49,150 - brontosaurus   	joshua_tree    
2017-12-18 23:39:49,150 - brontosaurus   	scissors       
2017-12-18 23:39:49,150 - brontosaurus   	garfield       
2017-12-18 23:39:49,151 - buddha         	bonsai         
2017-12-18 23:39:49,151 - buddha         	hedgehog       
2017-12-18 23:39:49,151 - buddha         	stapler        
2017-12-18 23:39:49,151 - buddha         	grand_piano    
2017-12-18 23:39:49,151 - butterfly      	snoopy         
2017-12-18 23:39:49,152 - butterfly      	sea_horse      
2017-12-18 23:39:49,152 - butterfly      	starfish       
2017-12-18 23:39:49,152 - butterfly      	accordion      
2017-12-18 23:39:49,152 - camera         	headphone      
2017-12-18 23:39:49,152 - camera         	dalmatian      
2017-12-18 23:39:49,153 - camera         	scissors       
2017-12-18 23:39:49,153 - cannon         	windsor_chair  
2017-12-18 23:39:49,153 - cannon         	hedgehog       
2017-12-18 23:39:49,154 - cannon         	headphone      
2017-12-18 23:39:49,154 - car_side       	airplanes      
2017-12-18 23:39:49,154 - car_side       	euphonium      
2017-12-18 23:39:49,154 - car_side       	barrel         
2017-12-18 23:39:49,154 - car_side       	car_side       
2017-12-18 23:39:49,155 - ceiling_fan    	headphone      
2017-12-18 23:39:49,155 - ceiling_fan    	headphone      
2017-12-18 23:39:49,155 - ceiling_fan    	headphone      
2017-12-18 23:39:49,155 - ceiling_fan    	scissors       
2017-12-18 23:39:49,155 - cellphone      	metronome      
2017-12-18 23:39:49,155 - cellphone      	dollar_bill    
2017-12-18 23:39:49,155 - cellphone      	headphone      
2017-12-18 23:39:49,156 - cellphone      	grand_piano    
2017-12-18 23:39:49,156 - chair          	snoopy         
2017-12-18 23:39:49,156 - chair          	windsor_chair  
2017-12-18 23:39:49,156 - chair          	garfield       
2017-12-18 23:39:49,156 - chair          	euphonium      
2017-12-18 23:39:49,156 - chandelier     	headphone      
2017-12-18 23:39:49,156 - chandelier     	schooner       
2017-12-18 23:39:49,156 - chandelier     	stop_sign      
2017-12-18 23:39:49,157 - chandelier     	strawberry     
2017-12-18 23:39:49,157 - chandelier     	snoopy         
2017-12-18 23:39:49,157 - cougar_body    	gerenuk        
2017-12-18 23:39:49,157 - cougar_body    	car_side       
2017-12-18 23:39:49,157 - cougar_body    	car_side       
2017-12-18 23:39:49,157 - cougar_body    	panda          
2017-12-18 23:39:49,157 - cougar_face    	platypus       
2017-12-18 23:39:49,157 - cougar_face    	brain          
2017-12-18 23:39:49,158 - cougar_face    	bonsai         
2017-12-18 23:39:49,158 - cougar_face    	platypus       
2017-12-18 23:39:49,158 - crab           	sea_horse      
2017-12-18 23:39:49,158 - crab           	headphone      
2017-12-18 23:39:49,158 - crab           	dalmatian      
2017-12-18 23:39:49,158 - crab           	joshua_tree    
2017-12-18 23:39:49,159 - crayfish       	scissors       
2017-12-18 23:39:49,159 - crayfish       	stop_sign      
2017-12-18 23:39:49,159 - crayfish       	lotus          
2017-12-18 23:39:49,159 - crayfish       	snoopy         
2017-12-18 23:39:49,159 - crocodile      	gerenuk        
2017-12-18 23:39:49,159 - crocodile      	strawberry     
2017-12-18 23:39:49,160 - crocodile      	strawberry     
2017-12-18 23:39:49,160 - crocodile      	hawksbill      
2017-12-18 23:39:49,160 - crocodile_head 	strawberry     
2017-12-18 23:39:49,160 - crocodile_head 	gerenuk        
2017-12-18 23:39:49,160 - crocodile_head 	strawberry     
2017-12-18 23:39:49,160 - crocodile_head 	gerenuk        
2017-12-18 23:39:49,160 - cup            	headphone      
2017-12-18 23:39:49,160 - cup            	strawberry     
2017-12-18 23:39:49,161 - cup            	lotus          
2017-12-18 23:39:49,161 - dalmatian      	gerenuk        
2017-12-18 23:39:49,161 - dalmatian      	brain          
2017-12-18 23:39:49,161 - dalmatian      	headphone      
2017-12-18 23:39:49,161 - dalmatian      	dalmatian      
2017-12-18 23:39:49,161 - dollar_bill    	dollar_bill    
2017-12-18 23:39:49,161 - dollar_bill    	dollar_bill    
2017-12-18 23:39:49,162 - dollar_bill    	dollar_bill    
2017-12-18 23:39:49,162 - dolphin        	headphone      
2017-12-18 23:39:49,162 - dolphin        	headphone      
2017-12-18 23:39:49,162 - dolphin        	strawberry     
2017-12-18 23:39:49,163 - dolphin        	Motorbikes     
2017-12-18 23:39:49,163 - dragonfly      	schooner       
2017-12-18 23:39:49,163 - dragonfly      	car_side       
2017-12-18 23:39:49,163 - dragonfly      	Leopards       
2017-12-18 23:39:49,163 - dragonfly      	snoopy         
2017-12-18 23:39:49,164 - electric_guitar	okapi          
2017-12-18 23:39:49,164 - electric_guitar	strawberry     
2017-12-18 23:39:49,164 - electric_guitar	emu            
2017-12-18 23:39:49,164 - electric_guitar	garfield       
2017-12-18 23:39:49,164 - elephant       	headphone      
2017-12-18 23:39:49,165 - elephant       	starfish       
2017-12-18 23:39:49,165 - elephant       	inline_skate   
2017-12-18 23:39:49,165 - elephant       	headphone      
2017-12-18 23:39:49,165 - emu            	strawberry     
2017-12-18 23:39:49,166 - emu            	bonsai         
2017-12-18 23:39:49,166 - emu            	snoopy         
2017-12-18 23:39:49,166 - euphonium      	euphonium      
2017-12-18 23:39:49,166 - euphonium      	euphonium      
2017-12-18 23:39:49,166 - euphonium      	scissors       
2017-12-18 23:39:49,167 - ewer           	yin_yang       
2017-12-18 23:39:49,167 - ewer           	Faces_easy     
2017-12-18 23:39:49,168 - ewer           	Leopards       
2017-12-18 23:39:49,168 - Faces_easy     	scissors       
2017-12-18 23:39:49,168 - Faces_easy     	scissors       
2017-12-18 23:39:49,168 - Faces_easy     	headphone      
2017-12-18 23:39:49,169 - ferry          	grand_piano    
2017-12-18 23:39:49,170 - ferry          	emu            
2017-12-18 23:39:49,170 - ferry          	accordion      
2017-12-18 23:39:49,171 - flamingo       	gerenuk        
2017-12-18 23:39:49,177 - flamingo       	car_side       
2017-12-18 23:39:49,177 - flamingo       	ketch          
2017-12-18 23:39:49,177 - flamingo_head  	Motorbikes     
2017-12-18 23:39:49,177 - flamingo_head  	schooner       
2017-12-18 23:39:49,177 - flamingo_head  	headphone      
2017-12-18 23:39:49,178 - garfield       	joshua_tree    
2017-12-18 23:39:49,178 - garfield       	garfield       
2017-12-18 23:39:49,178 - garfield       	garfield       
2017-12-18 23:39:49,178 - gerenuk        	bonsai         
2017-12-18 23:39:49,178 - gerenuk        	strawberry     
2017-12-18 23:39:49,178 - gerenuk        	starfish       
2017-12-18 23:39:49,178 - gramophone     	hedgehog       
2017-12-18 23:39:49,178 - gramophone     	Motorbikes     
2017-12-18 23:39:49,179 - gramophone     	garfield       
2017-12-18 23:39:49,179 - grand_piano    	grand_piano    
2017-12-18 23:39:49,179 - grand_piano    	grand_piano    
2017-12-18 23:39:49,179 - grand_piano    	headphone      
2017-12-18 23:39:49,179 - hawksbill      	hawksbill      
2017-12-18 23:39:49,180 - hawksbill      	strawberry     
2017-12-18 23:39:49,180 - hawksbill      	hedgehog       
2017-12-18 23:39:49,180 - headphone      	headphone      
2017-12-18 23:39:49,181 - headphone      	headphone      
2017-12-18 23:39:49,181 - hedgehog       	hedgehog       
2017-12-18 23:39:49,181 - hedgehog       	hedgehog       
2017-12-18 23:39:49,181 - hedgehog       	sea_horse      
2017-12-18 23:39:49,182 - helicopter     	ketch          
2017-12-18 23:39:49,182 - helicopter     	windsor_chair  
2017-12-18 23:39:49,182 - helicopter     	schooner       
2017-12-18 23:39:49,182 - ibis           	hawksbill      
2017-12-18 23:39:49,183 - ibis           	gerenuk        
2017-12-18 23:39:49,183 - ibis           	stop_sign      
2017-12-18 23:39:49,183 - inline_skate   	snoopy         
2017-12-18 23:39:49,183 - inline_skate   	scissors       
2017-12-18 23:39:49,183 - inline_skate   	garfield       
2017-12-18 23:39:49,183 - joshua_tree    	joshua_tree    
2017-12-18 23:39:49,184 - joshua_tree    	bonsai         
2017-12-18 23:39:49,184 - joshua_tree    	joshua_tree    
2017-12-18 23:39:49,184 - kangaroo       	strawberry     
2017-12-18 23:39:49,184 - kangaroo       	strawberry     
2017-12-18 23:39:49,185 - kangaroo       	gerenuk        
2017-12-18 23:39:49,185 - ketch          	schooner       
2017-12-18 23:39:49,185 - ketch          	stapler        
2017-12-18 23:39:49,185 - ketch          	stapler        
2017-12-18 23:39:49,185 - lamp           	scissors       
2017-12-18 23:39:49,185 - lamp           	Leopards       
2017-12-18 23:39:49,186 - lamp           	lotus          
2017-12-18 23:39:49,186 - laptop         	scissors       
2017-12-18 23:39:49,186 - laptop         	metronome      
2017-12-18 23:39:49,186 - laptop         	umbrella       
2017-12-18 23:39:49,186 - Leopards       	car_side       
2017-12-18 23:39:49,187 - Leopards       	Leopards       
2017-12-18 23:39:49,187 - Leopards       	Leopards       
2017-12-18 23:39:49,187 - llama          	strawberry     
2017-12-18 23:39:49,187 - llama          	bonsai         
2017-12-18 23:39:49,187 - llama          	gerenuk        
2017-12-18 23:39:49,187 - lobster        	windsor_chair  
2017-12-18 23:39:49,188 - lobster        	headphone      
2017-12-18 23:39:49,188 - lobster        	stapler        
2017-12-18 23:39:49,188 - lotus          	water_lilly    
2017-12-18 23:39:49,188 - lotus          	lotus          
2017-12-18 23:39:49,188 - lotus          	lotus          
2017-12-18 23:39:49,188 - mandolin       	strawberry     
2017-12-18 23:39:49,189 - mandolin       	electric_guitar
2017-12-18 23:39:49,190 - mayfly         	garfield       
2017-12-18 23:39:49,190 - mayfly         	crocodile      
2017-12-18 23:39:49,190 - menorah        	gerenuk        
2017-12-18 23:39:49,190 - menorah        	snoopy         
2017-12-18 23:39:49,190 - menorah        	crab           
2017-12-18 23:39:49,191 - metronome      	stop_sign      
2017-12-18 23:39:49,191 - metronome      	ketch          
2017-12-18 23:39:49,191 - minaret        	airplanes      
2017-12-18 23:39:49,192 - minaret        	grand_piano    
2017-12-18 23:39:49,192 - minaret        	ketch          
2017-12-18 23:39:49,192 - Motorbikes     	revolver       
2017-12-18 23:39:49,192 - Motorbikes     	scissors       
2017-12-18 23:39:49,193 - Motorbikes     	dalmatian      
2017-12-18 23:39:49,193 - nautilus       	pagoda         
2017-12-18 23:39:49,193 - nautilus       	headphone      
2017-12-18 23:39:49,193 - nautilus       	garfield       
2017-12-18 23:39:49,193 - octopus        	car_side       
2017-12-18 23:39:49,194 - octopus        	euphonium      
2017-12-18 23:39:49,194 - okapi          	euphonium      
2017-12-18 23:39:49,194 - okapi          	strawberry     
2017-12-18 23:39:49,194 - pagoda         	accordion      
2017-12-18 23:39:49,194 - pagoda         	grand_piano    
2017-12-18 23:39:49,194 - pagoda         	strawberry     
2017-12-18 23:39:49,194 - panda          	hawksbill      
2017-12-18 23:39:49,194 - panda          	panda          
2017-12-18 23:39:49,195 - panda          	strawberry     
2017-12-18 23:39:49,195 - pigeon         	stapler        
2017-12-18 23:39:49,195 - pigeon         	snoopy         
2017-12-18 23:39:49,195 - pigeon         	gerenuk        
2017-12-18 23:39:49,195 - pizza          	starfish       
2017-12-18 23:39:49,195 - pizza          	strawberry     
2017-12-18 23:39:49,195 - pizza          	gerenuk        
2017-12-18 23:39:49,195 - pizza          	gerenuk        
2017-12-18 23:39:49,195 - platypus       	garfield       
2017-12-18 23:39:49,196 - platypus       	strawberry     
2017-12-18 23:39:49,196 - platypus       	ceiling_fan    
2017-12-18 23:39:49,196 - pyramid        	starfish       
2017-12-18 23:39:49,196 - pyramid        	umbrella       
2017-12-18 23:39:49,196 - pyramid        	joshua_tree    
2017-12-18 23:39:49,196 - pyramid        	umbrella       
2017-12-18 23:39:49,197 - revolver       	Motorbikes     
2017-12-18 23:39:49,197 - revolver       	windsor_chair  
2017-12-18 23:39:49,197 - revolver       	schooner       
2017-12-18 23:39:49,197 - rhino          	strawberry     
2017-12-18 23:39:49,197 - rhino          	water_lilly    
2017-12-18 23:39:49,198 - rhino          	bonsai         
2017-12-18 23:39:49,198 - rooster        	stapler        
2017-12-18 23:39:49,199 - rooster        	joshua_tree    
2017-12-18 23:39:49,199 - rooster        	headphone      
2017-12-18 23:39:49,199 - saxophone      	headphone      
2017-12-18 23:39:49,199 - saxophone      	sea_horse      
2017-12-18 23:39:49,199 - saxophone      	euphonium      
2017-12-18 23:39:49,199 - schooner       	schooner       
2017-12-18 23:39:49,199 - schooner       	euphonium      
2017-12-18 23:39:49,199 - schooner       	headphone      
2017-12-18 23:39:49,200 - schooner       	scissors       
2017-12-18 23:39:49,200 - scissors       	helicopter     
2017-12-18 23:39:49,200 - scissors       	ibis           
2017-12-18 23:39:49,200 - scissors       	ketch          
2017-12-18 23:39:49,200 - scorpion       	gerenuk        
2017-12-18 23:39:49,200 - scorpion       	headphone      
2017-12-18 23:39:49,200 - scorpion       	headphone      
2017-12-18 23:39:49,200 - sea_horse      	strawberry     
2017-12-18 23:39:49,201 - sea_horse      	Motorbikes     
2017-12-18 23:39:49,201 - sea_horse      	platypus       
2017-12-18 23:39:49,201 - snoopy         	snoopy         
2017-12-18 23:39:49,201 - snoopy         	snoopy         
2017-12-18 23:39:49,201 - snoopy         	windsor_chair  
2017-12-18 23:39:49,201 - soccer_ball    	soccer_ball    
2017-12-18 23:39:49,201 - soccer_ball    	grand_piano    
2017-12-18 23:39:49,201 - soccer_ball    	headphone      
2017-12-18 23:39:49,202 - stapler        	stapler        
2017-12-18 23:39:49,203 - stapler        	grand_piano    
2017-12-18 23:39:49,212 - stapler        	headphone      
2017-12-18 23:39:49,212 - starfish       	sea_horse      
2017-12-18 23:39:49,213 - starfish       	water_lilly    
2017-12-18 23:39:49,213 - starfish       	Leopards       
2017-12-18 23:39:49,213 - stegosaurus    	joshua_tree    
2017-12-18 23:39:49,213 - stegosaurus    	brain          
2017-12-18 23:39:49,213 - stegosaurus    	bonsai         
2017-12-18 23:39:49,214 - stop_sign      	strawberry     
2017-12-18 23:39:49,214 - stop_sign      	stop_sign      
2017-12-18 23:39:49,214 - stop_sign      	stop_sign      
2017-12-18 23:39:49,214 - strawberry     	strawberry     
2017-12-18 23:39:49,214 - strawberry     	strawberry     
2017-12-18 23:39:49,215 - strawberry     	strawberry     
2017-12-18 23:39:49,215 - sunflower      	snoopy         
2017-12-18 23:39:49,215 - sunflower      	joshua_tree    
2017-12-18 23:39:49,215 - sunflower      	inline_skate   
2017-12-18 23:39:49,215 - tick           	garfield       
2017-12-18 23:39:49,215 - tick           	snoopy         
2017-12-18 23:39:49,215 - tick           	garfield       
2017-12-18 23:39:49,216 - trilobite      	Leopards       
2017-12-18 23:39:49,216 - trilobite      	accordion      
2017-12-18 23:39:49,216 - trilobite      	garfield       
2017-12-18 23:39:49,216 - umbrella       	umbrella       
2017-12-18 23:39:49,216 - umbrella       	schooner       
2017-12-18 23:39:49,216 - umbrella       	headphone      
2017-12-18 23:39:49,217 - watch          	dollar_bill    
2017-12-18 23:39:49,217 - watch          	metronome      
2017-12-18 23:39:49,217 - watch          	garfield       
2017-12-18 23:39:49,217 - water_lilly    	water_lilly    
2017-12-18 23:39:49,217 - water_lilly    	headphone      
2017-12-18 23:39:49,217 - water_lilly    	sunflower      
2017-12-18 23:39:49,217 - wheelchair     	hedgehog       
2017-12-18 23:39:49,217 - wheelchair     	stop_sign      
2017-12-18 23:39:49,218 - wheelchair     	garfield       
2017-12-18 23:39:49,218 - wild_cat       	hedgehog       
2017-12-18 23:39:49,218 - wild_cat       	hedgehog       
2017-12-18 23:39:49,218 - wild_cat       	gerenuk        
2017-12-18 23:39:49,218 - windsor_chair  	windsor_chair  
2017-12-18 23:39:49,218 - windsor_chair  	windsor_chair  
2017-12-18 23:39:49,218 - windsor_chair  	windsor_chair  
2017-12-18 23:39:49,218 - wrench         	scissors       
2017-12-18 23:39:49,219 - wrench         	headphone      
2017-12-18 23:39:49,219 - wrench         	windsor_chair  
2017-12-18 23:39:49,219 - yin_yang       	soccer_ball    
2017-12-18 23:39:49,219 - yin_yang       	grand_piano    
2017-12-18 23:39:49,219 - yin_yang       	dollar_bill    
