2017-12-18 22:53:05,788 - ***************************************************************************
2017-12-18 22:53:05,789 - C: 0.2
2017-12-18 22:53:05,789 - multi_class: ovr
2017-12-18 22:53:05,789 - kernel: linear
2017-12-18 22:53:05,789 - gamma: None
2017-12-18 22:53:05,789 - degree: None
2017-12-18 22:53:11,745 - fit_time: 5.956220626831055 seconds
2017-12-18 22:53:11,755 - model is saved in bin\svm-models\ovr_linear_0.2_None_None.pkl
2017-12-18 22:53:11,849 - score on train set: 0.9855150214592274
2017-12-18 22:53:11,854 - score on test set: 0.08490566037735849
2017-12-18 22:53:11,883 - confusion_matrix:
 [[0 0 2 0 0 0 0 0 0 0 0 0 0 0 0 0 0 0 0 0 0 0 0 0 0 0 0 0 0 0 0 0 0 0 0 0 0 0 0 0 0 0 0 0 0 0 0 0 0 0 0 0 0 0 0 0 0 0 0 0 0 0 0 0 0 0 0 0 0 0 0 0 0 0 0 0 0 0 0 0 0 0 0 0 0 0 0 0 0 0 0 0 0 1 0 0 0 0 0 0]
 [0 3 0 0 0 0 0 0 0 0 0 0 0 0 0 0 0 0 0 0 0 0 0 0 0 0 0 0 0 0 0 0 0 0 0 0 0 0 0 0 0 0 0 0 0 0 0 0 0 0 0 0 0 0 0 0 0 0 0 0 0 0 0 0 0 0 0 0 0 0 0 0 0 0 0 0 0 0 0 0 0 0 0 0 0 0 0 0 0 0 0 0 0 0 0 0 0 0 0 0]
 [0 0 3 0 0 0 0 0 0 0 0 0 0 0 0 0 0 0 0 0 0 0 0 0 0 0 0 0 0 0 0 0 0 0 0 0 0 0 0 0 0 0 0 0 0 0 0 0 0 0 0 0 0 0 0 0 0 0 0 0 0 0 0 0 0 0 0 0 0 0 0 0 0 0 0 0 0 0 0 0 0 0 0 0 0 0 0 0 0 0 0 0 0 0 0 0 0 0 0 0]
 [0 0 0 1 0 0 0 0 0 0 0 0 0 0 0 0 0 0 0 0 0 0 0 0 0 0 0 0 0 0 0 0 0 0 0 0 0 0 0 0 0 0 0 0 0 0 0 0 0 0 0 0 0 0 0 0 0 0 0 0 0 0 0 0 0 0 0 0 0 0 0 0 0 0 0 0 0 0 0 0 0 0 0 0 0 0 0 0 0 0 0 0 0 1 0 0 0 0 0 0]
 [0 0 3 0 0 0 0 0 0 0 0 0 0 0 0 0 0 0 0 0 0 0 0 0 0 0 0 0 0 0 0 0 0 0 0 0 0 0 0 0 0 0 0 0 0 0 0 0 0 0 0 0 0 0 0 0 0 0 0 0 0 0 0 0 0 0 0 0 0 0 0 0 0 0 0 0 0 0 0 0 0 0 0 0 0 0 0 0 0 0 0 0 0 0 0 0 0 0 0 0]
 [0 0 1 0 0 0 0 0 0 0 0 0 0 0 0 0 0 0 0 0 0 0 0 0 0 0 0 0 0 0 0 0 0 0 0 0 0 0 0 0 0 0 0 0 0 0 0 0 0 0 0 0 0 0 0 0 0 1 0 0 0 0 0 0 0 0 0 0 0 0 0 0 0 0 0 0 0 0 0 0 0 0 0 0 0 0 0 0 0 0 0 0 0 1 0 0 0 0 0 0]
 [0 0 0 0 0 0 0 0 0 0 0 0 0 0 0 0 0 0 0 0 0 0 0 0 0 0 0 0 0 0 0 0 0 0 0 0 0 0 0 0 0 0 0 0 0 0 0 0 0 0 0 0 0 0 0 0 0 0 0 0 0 0 1 0 0 0 0 0 0 1 0 0 0 0 0 0 0 0 0 0 0 0 1 0 0 0 0 0 0 0 0 0 0 0 0 0 0 0 0 0]
 [0 0 3 0 0 0 0 0 0 0 0 0 0 0 0 0 0 0 0 0 0 0 0 0 0 0 0 0 0 0 0 0 0 0 0 0 0 0 0 0 0 0 0 0 0 0 0 0 0 0 0 0 0 0 0 0 0 0 0 0 0 0 0 0 0 0 0 0 0 0 0 0 0 0 0 0 0 0 0 0 0 0 0 0 0 0 0 0 0 0 0 0 0 0 0 0 0 0 0 0]
 [0 0 3 0 0 0 0 0 0 0 0 0 0 0 0 0 0 0 0 0 0 0 0 0 0 0 0 0 0 0 0 0 0 0 0 0 0 0 0 0 0 0 0 0 0 0 0 0 0 0 0 0 0 0 0 0 0 0 0 0 0 0 0 0 0 0 0 0 0 0 0 0 0 0 0 0 0 0 0 0 0 0 0 0 0 0 0 0 0 0 0 0 0 0 0 0 0 0 0 0]
 [0 0 3 0 0 0 0 0 0 0 0 0 0 0 0 0 0 0 0 0 0 0 0 0 0 0 0 0 0 0 0 0 0 0 0 0 0 0 0 0 0 0 0 0 0 0 0 0 0 0 0 0 0 0 0 0 0 0 0 0 0 0 0 0 0 0 0 0 0 0 0 0 0 0 0 0 0 0 0 0 0 0 0 0 0 0 0 0 0 0 0 0 0 0 0 0 0 0 0 0]
 [0 0 2 0 0 0 0 0 0 0 0 0 0 1 0 0 0 0 0 0 0 0 0 0 1 0 0 0 0 0 0 0 0 0 0 0 0 0 0 0 0 0 0 0 0 0 0 0 0 0 0 0 0 0 0 0 0 0 0 0 0 0 0 0 0 0 0 0 0 0 0 0 0 0 0 0 0 0 0 0 0 0 0 0 0 0 0 0 0 0 0 0 0 0 0 0 0 0 0 0]
 [0 0 4 0 0 0 0 0 0 0 0 0 0 0 0 0 0 0 0 0 0 0 0 0 0 0 0 0 0 0 0 0 0 0 0 0 0 0 0 0 0 0 0 0 0 0 0 0 0 0 0 0 0 0 0 0 0 0 0 0 0 0 0 0 0 0 0 0 0 0 0 0 0 0 0 0 0 0 0 0 0 0 0 0 0 0 0 0 0 0 0 0 0 0 0 0 0 0 0 0]
 [0 0 1 0 0 0 0 0 0 0 0 0 0 0 0 0 0 0 0 0 0 0 0 0 0 0 0 0 0 0 0 0 0 0 1 0 0 0 0 0 0 1 0 0 0 0 0 0 0 0 0 0 0 0 0 0 0 0 0 0 0 0 0 0 0 0 0 0 0 0 0 0 0 0 0 0 0 0 0 0 0 0 0 0 0 1 0 0 0 0 0 0 0 0 0 0 0 0 0 0]
 [0 0 3 0 0 0 0 0 0 0 0 0 0 0 0 0 0 0 0 0 0 0 0 0 0 0 0 0 0 0 0 0 0 0 0 0 0 0 0 0 0 0 0 0 0 0 0 0 0 0 0 0 0 0 0 0 0 0 0 0 0 0 0 0 0 0 0 0 0 0 0 0 0 0 0 0 0 0 0 0 0 0 0 0 0 0 0 0 0 0 0 0 0 0 0 0 0 0 0 0]
 [0 0 4 0 0 0 0 0 0 0 0 0 0 0 0 0 0 0 0 0 0 0 0 0 0 0 0 0 0 0 0 0 0 0 0 0 0 0 0 0 0 0 0 0 0 0 0 0 0 0 0 0 0 0 0 0 0 0 0 0 0 0 0 0 0 0 0 0 0 0 0 0 0 0 0 0 0 0 0 0 0 0 0 0 0 0 0 0 0 0 0 0 0 0 0 0 0 0 0 0]
 [0 0 3 0 0 0 0 0 0 0 0 0 0 0 0 0 0 0 0 0 0 0 0 0 0 0 0 0 0 0 0 0 0 0 0 0 0 0 0 0 0 0 0 0 0 0 0 0 0 0 0 0 0 0 0 0 0 0 0 0 0 0 0 0 0 0 0 0 0 0 0 0 0 0 0 0 0 0 0 0 1 0 0 0 0 0 0 0 0 0 0 0 0 0 0 0 0 0 0 0]
 [0 0 3 0 0 0 0 0 0 0 0 0 0 0 0 0 0 0 0 0 0 0 0 0 0 0 0 0 0 0 0 0 0 0 0 0 0 0 0 0 0 0 0 0 0 0 0 0 0 0 0 0 0 0 0 0 0 0 0 0 0 0 0 0 0 0 0 0 0 0 0 0 0 0 0 0 0 0 0 0 0 0 0 0 0 0 0 0 0 0 0 0 0 0 0 0 0 0 0 0]
 [0 0 3 0 0 0 0 0 0 0 0 0 0 0 0 0 0 0 0 0 0 0 0 0 0 0 0 0 0 0 0 0 0 0 0 0 0 0 0 0 0 0 0 0 0 0 0 0 0 0 0 0 0 0 0 0 0 0 0 0 0 0 0 0 0 0 0 0 0 0 0 0 0 0 0 0 0 0 0 0 0 0 0 0 0 0 0 0 0 0 0 0 0 0 0 0 0 0 0 0]
 [0 0 4 0 0 0 0 0 0 0 0 0 0 0 0 0 0 0 0 0 0 0 0 0 0 0 0 0 0 0 0 0 0 0 0 0 0 0 0 0 0 0 0 0 0 0 0 0 0 0 0 0 0 0 0 0 0 0 0 0 0 0 0 0 0 0 0 0 0 0 0 0 0 0 0 0 0 0 0 0 0 0 0 0 0 0 0 0 0 0 0 0 0 0 0 0 0 0 0 0]
 [0 0 3 0 0 0 0 0 0 0 0 0 0 0 0 0 0 0 0 0 0 0 0 0 0 1 0 0 0 0 0 0 0 0 0 0 0 0 0 0 0 0 0 0 0 0 0 0 0 0 0 0 0 0 0 0 0 0 0 0 0 0 0 0 0 0 0 0 0 0 0 0 0 0 0 0 0 0 0 0 0 0 0 0 0 0 0 0 0 0 0 0 0 0 0 0 0 0 0 0]
 [0 0 1 0 0 0 0 0 0 0 0 0 0 0 0 0 0 0 0 0 0 0 0 0 0 0 0 0 0 0 0 0 0 0 0 0 0 0 0 0 0 0 0 0 0 0 0 0 0 0 0 0 0 0 0 0 0 0 0 0 0 0 0 1 0 0 0 0 1 0 0 0 0 0 0 0 0 0 0 0 0 0 0 0 0 0 0 0 0 0 0 0 0 1 0 0 0 0 0 0]
 [0 0 2 0 0 0 0 0 0 0 0 0 0 0 0 0 0 0 0 0 0 0 0 0 0 0 0 0 0 0 0 0 0 0 0 0 0 0 0 0 0 0 0 0 0 0 0 0 0 0 0 0 0 0 0 0 0 0 0 0 0 0 0 0 0 0 0 0 0 0 0 0 0 0 0 0 0 0 0 0 0 0 0 0 0 0 0 0 0 0 0 0 0 2 0 0 0 0 0 0]
 [0 0 4 0 0 0 0 0 0 0 0 0 0 0 0 0 0 0 0 0 0 0 0 0 0 0 0 0 0 0 0 0 0 0 0 0 0 0 0 0 0 0 0 0 0 0 0 0 0 1 0 0 0 0 0 0 0 0 0 0 0 0 0 0 0 0 0 0 0 0 0 0 0 0 0 0 0 0 0 0 0 0 0 0 0 0 0 0 0 0 0 0 0 0 0 0 0 0 0 0]
 [0 0 4 0 0 0 0 0 0 0 0 0 0 0 0 0 0 0 0 0 0 0 0 0 0 0 0 0 0 0 0 0 0 0 0 0 0 0 0 0 0 0 0 0 0 0 0 0 0 0 0 0 0 0 0 0 0 0 0 0 0 0 0 0 0 0 0 0 0 0 0 0 0 0 0 0 0 0 0 0 0 0 0 0 0 0 0 0 0 0 0 0 0 0 0 0 0 0 0 0]
 [0 0 3 0 0 0 0 0 0 0 0 0 0 0 0 0 0 0 0 0 0 0 0 0 0 0 0 0 0 0 0 0 0 0 0 0 0 0 0 0 0 0 0 0 0 0 0 0 0 0 0 0 0 0 0 0 0 0 0 0 0 0 0 0 0 0 0 0 0 0 0 0 1 0 0 0 0 0 0 0 0 0 0 0 0 0 0 0 0 0 0 0 0 0 0 0 0 0 0 0]
 [0 0 4 0 0 0 0 0 0 0 0 0 0 0 0 0 0 0 0 0 0 0 0 0 0 0 0 0 0 0 0 0 0 0 0 0 0 0 0 0 0 0 0 0 0 0 0 0 0 0 0 0 0 0 0 0 0 0 0 0 0 0 0 0 0 0 0 0 0 0 0 0 0 0 0 0 0 0 0 0 0 0 0 0 0 0 0 0 0 0 0 0 0 0 0 0 0 0 0 0]
 [0 0 4 0 0 0 0 0 0 0 0 0 0 0 0 0 0 0 0 0 0 0 0 0 0 0 0 0 0 0 0 0 0 0 0 0 0 0 0 0 0 0 0 0 0 0 0 0 0 0 0 0 0 0 0 0 0 0 0 0 0 0 0 0 0 0 0 0 0 0 0 0 0 0 0 0 0 0 0 0 0 0 0 0 0 0 0 0 0 0 0 0 0 0 0 0 0 0 0 0]
 [0 0 4 0 0 0 0 0 0 0 0 0 0 0 0 0 0 0 0 0 0 0 0 0 0 0 0 0 0 0 0 0 0 0 0 0 0 0 0 0 0 0 0 0 0 0 0 0 0 0 0 0 0 0 0 0 0 0 0 0 0 0 0 0 0 0 0 0 0 0 0 0 0 0 0 0 0 0 0 0 0 0 0 0 0 0 0 0 0 0 0 0 0 0 0 0 0 0 0 0]
 [0 0 3 0 0 0 0 0 0 0 0 0 0 0 0 0 0 0 0 0 0 0 0 0 0 0 0 0 0 0 0 0 0 0 0 0 0 0 0 0 0 0 0 0 0 0 0 0 0 0 0 0 0 0 0 0 0 0 0 0 0 0 0 0 0 0 0 0 0 0 0 0 0 0 0 0 0 0 0 0 0 0 0 0 0 0 0 0 1 0 0 0 0 0 0 0 0 0 0 0]
 [0 0 1 0 0 0 0 0 0 0 0 0 0 0 0 0 0 0 0 0 0 0 0 0 0 0 0 0 0 0 0 0 0 1 0 0 0 0 0 0 0 0 0 0 0 0 0 0 0 0 0 0 0 0 0 0 0 0 0 0 0 0 1 0 0 0 0 0 0 0 0 0 0 0 0 0 0 0 0 0 0 0 0 0 0 0 0 0 0 0 0 0 0 0 0 0 0 0 0 0]
 [0 0 2 0 0 0 0 0 0 0 0 0 0 0 0 0 0 0 0 0 0 0 0 0 0 0 0 0 0 0 1 0 0 0 0 1 0 0 0 0 0 0 0 0 0 0 0 0 0 0 0 0 0 0 0 0 0 0 0 0 0 0 0 0 0 0 0 0 0 0 0 0 0 0 0 0 0 0 0 0 0 0 0 0 0 0 0 0 0 0 0 0 0 0 0 0 0 0 0 0]
 [0 0 3 0 0 0 0 0 0 0 0 0 0 0 0 0 0 0 0 0 0 0 0 0 0 0 0 0 0 0 0 0 0 0 0 0 0 0 0 0 0 0 0 0 0 0 0 0 0 0 0 0 0 0 0 0 0 0 0 0 0 0 0 0 0 0 0 0 0 0 0 0 0 0 0 0 0 0 0 0 0 0 0 0 0 0 0 0 0 0 0 0 0 0 0 0 0 0 0 0]
 [0 0 0 0 0 0 0 0 0 0 0 0 0 0 0 0 0 0 0 0 0 0 0 0 0 0 0 0 0 0 0 0 0 0 0 0 0 0 0 0 0 1 0 0 0 0 1 0 0 0 0 0 0 0 0 0 0 0 0 1 0 0 0 0 0 0 0 0 0 0 0 0 0 0 0 0 1 0 0 0 0 0 0 0 0 0 0 0 0 0 0 0 0 0 0 0 0 0 0 0]
 [0 0 2 0 0 0 0 0 0 0 0 0 0 0 0 0 0 0 0 0 0 0 0 0 0 0 0 0 0 0 0 0 0 0 0 0 0 0 0 0 0 0 0 0 0 0 0 0 0 1 0 0 0 0 1 0 0 0 0 0 0 0 0 0 0 0 0 0 0 0 0 0 0 0 0 0 0 0 0 0 0 0 0 0 0 0 0 0 0 0 0 0 0 0 0 0 0 0 0 0]
 [0 0 3 0 0 0 0 0 0 0 0 0 0 0 0 0 0 0 0 0 0 0 0 0 0 0 0 0 0 0 0 0 0 1 0 0 0 0 0 0 0 0 0 0 0 0 0 0 0 0 0 0 0 0 0 0 0 0 0 0 0 0 0 0 0 0 0 0 0 0 0 0 0 0 0 0 0 0 0 0 0 0 0 0 0 0 0 0 0 0 0 0 0 0 0 0 0 0 0 0]
 [0 0 3 0 0 0 0 0 0 0 0 0 0 0 0 0 0 0 0 0 0 0 0 0 0 0 0 0 0 0 0 0 0 0 0 0 0 0 0 0 0 0 0 0 0 0 0 0 0 0 0 0 0 0 0 0 0 0 0 0 0 0 0 0 0 0 0 0 0 0 0 0 0 0 0 0 0 0 0 0 0 0 0 0 0 0 0 0 1 0 0 0 0 0 0 0 0 0 0 0]
 [0 0 2 0 0 0 0 0 0 0 0 0 0 0 0 0 0 0 0 0 0 0 0 0 0 0 0 0 0 0 0 0 0 0 0 0 0 0 0 0 0 0 0 0 0 0 0 0 0 0 0 0 0 0 0 0 0 0 0 0 0 0 0 0 0 0 0 0 0 0 0 0 0 0 0 0 0 0 0 0 0 0 1 0 0 0 0 0 0 0 0 0 0 0 0 0 0 0 0 0]
 [0 0 1 0 0 0 0 0 0 0 0 0 0 0 0 0 0 0 0 0 0 0 0 0 0 0 0 0 0 0 0 0 0 0 0 0 0 1 0 0 0 0 0 0 0 0 0 0 0 0 0 0 0 0 0 0 0 0 0 0 0 0 0 0 0 0 0 0 0 0 0 0 0 0 0 0 0 0 0 0 0 0 0 0 0 0 0 0 0 0 0 0 0 1 0 0 0 0 0 0]
 [0 1 0 0 0 0 0 0 0 0 0 0 0 0 0 0 0 0 0 0 0 0 0 1 0 0 0 0 0 0 0 0 0 0 0 0 0 0 0 0 0 0 0 0 0 0 0 0 0 0 0 0 0 0 0 0 0 0 0 0 0 0 0 0 0 0 0 0 0 0 0 0 0 0 0 0 0 0 0 0 1 0 0 0 0 0 0 0 0 0 0 0 0 0 0 0 0 0 0 0]
 [0 0 3 0 0 0 0 0 0 0 0 0 0 0 0 0 0 0 0 0 0 0 0 0 0 0 0 0 0 0 0 0 0 0 0 0 0 0 0 0 0 0 0 0 0 0 0 0 0 0 0 0 0 0 0 0 0 0 0 0 0 0 0 0 0 0 0 0 0 0 0 0 0 0 0 0 0 0 0 0 0 0 0 0 0 0 0 0 0 0 0 0 0 0 0 0 0 0 0 0]
 [0 0 2 0 0 0 0 0 0 0 0 0 0 0 0 0 0 0 0 0 0 0 0 0 0 0 0 0 0 0 0 0 0 0 0 0 0 0 0 0 0 0 0 0 0 0 0 0 0 0 0 0 0 0 0 1 0 0 0 0 0 0 0 0 0 0 0 0 0 0 0 0 0 0 0 0 0 0 0 0 0 0 0 0 0 0 0 0 0 0 0 0 0 0 0 0 0 0 0 0]
 [0 0 1 0 0 0 0 0 0 0 0 0 0 0 0 0 0 0 0 0 0 0 0 0 0 0 0 0 0 0 0 0 0 1 0 0 0 0 0 0 0 0 0 0 0 0 0 0 0 0 1 0 0 0 0 0 0 0 0 0 0 0 0 0 0 0 0 0 0 0 0 0 0 0 0 0 0 0 0 0 0 0 0 0 0 0 0 0 0 0 0 0 0 0 0 0 0 0 0 0]
 [0 0 0 0 0 0 0 0 0 0 0 1 0 0 0 0 0 0 0 0 0 0 0 0 0 0 0 0 0 0 0 0 0 0 0 0 0 0 0 0 0 0 1 0 0 0 0 0 0 0 0 0 1 0 0 0 0 0 0 0 0 0 0 0 0 0 0 0 0 0 0 0 0 0 0 0 0 0 0 0 0 0 0 0 0 0 0 0 0 0 0 0 0 0 0 0 0 0 0 0]
 [0 0 3 0 0 0 0 0 0 0 0 0 0 0 0 0 0 0 0 0 0 0 0 0 0 0 0 0 0 0 0 0 0 0 0 0 0 0 0 0 0 0 0 0 0 0 0 0 0 0 0 0 0 0 0 0 0 0 0 0 0 0 0 0 0 0 0 0 0 0 0 0 0 0 0 0 0 0 0 0 0 0 0 0 0 0 0 0 0 0 0 0 0 0 0 0 0 0 0 0]
 [0 0 2 0 0 0 0 0 0 0 0 0 1 0 0 0 0 0 0 0 0 0 0 0 0 0 0 0 0 0 0 0 0 0 0 0 0 0 0 0 0 0 0 0 0 0 0 0 0 0 0 0 0 0 0 0 0 0 0 0 0 0 0 0 0 0 0 0 0 0 0 0 0 0 0 0 0 0 0 0 0 0 0 0 0 0 0 0 0 0 0 0 0 0 0 0 0 0 0 0]
 [0 0 2 0 0 0 0 0 0 0 0 0 0 0 0 0 0 0 0 0 0 0 0 0 0 0 0 0 0 0 0 0 0 0 0 0 0 0 0 0 0 0 0 0 0 1 0 0 0 0 0 0 0 0 0 0 0 0 0 0 0 0 0 0 0 0 0 0 0 0 0 0 0 0 0 0 0 0 0 0 0 0 0 0 0 0 0 0 0 0 0 0 0 0 0 0 0 0 0 0]
 [0 0 2 0 0 0 0 0 0 0 0 0 0 0 0 0 0 0 0 0 0 0 0 0 0 0 0 0 0 0 0 0 0 0 0 0 0 0 0 0 0 0 0 0 0 0 1 0 0 0 0 0 0 0 0 0 0 0 0 0 0 0 0 0 0 0 0 0 0 0 0 0 0 0 0 0 0 0 0 0 0 0 0 0 0 0 0 0 0 0 0 0 0 0 0 0 0 0 0 0]
 [0 0 2 0 0 0 0 0 0 0 0 0 0 0 0 0 0 0 0 0 0 0 0 0 0 0 0 0 0 0 0 0 0 0 0 0 0 0 0 0 0 0 0 0 0 0 0 0 0 0 0 0 0 0 0 0 0 0 0 0 0 0 0 0 0 0 0 0 0 0 0 0 0 0 0 0 0 0 0 0 0 0 0 0 0 0 0 0 0 0 0 0 0 0 0 0 0 0 0 0]
 [0 0 2 0 0 0 0 0 0 0 0 0 0 0 0 0 0 0 1 0 0 0 0 0 0 0 0 0 0 0 0 0 0 0 0 0 0 0 0 0 0 0 0 0 0 0 0 0 0 0 0 0 0 0 0 0 0 0 0 0 0 0 0 0 0 0 0 0 0 0 0 0 0 0 0 0 0 0 0 0 0 0 0 0 0 0 0 0 0 0 0 0 0 0 0 0 0 0 0 0]
 [0 0 2 0 0 0 0 0 0 0 1 0 0 0 0 0 0 0 0 0 0 0 0 0 0 0 0 0 0 0 0 0 0 0 0 0 0 0 0 0 0 0 0 0 0 0 0 0 0 0 0 0 0 0 0 0 0 0 0 0 0 0 0 0 0 0 0 0 0 0 0 0 0 0 0 0 0 0 0 0 0 0 0 0 0 0 0 0 0 0 0 0 0 0 0 0 0 0 0 0]
 [0 0 3 0 0 0 0 0 0 0 0 0 0 0 0 0 0 0 0 0 0 0 0 0 0 0 0 0 0 0 0 0 0 0 0 0 0 0 0 0 0 0 0 0 0 0 0 0 0 0 0 0 0 0 0 0 0 0 0 0 0 0 0 0 0 0 0 0 0 0 0 0 0 0 0 0 0 0 0 0 0 0 0 0 0 0 0 0 0 0 0 0 0 0 0 0 0 0 0 0]
 [0 0 3 0 0 0 0 0 0 0 0 0 0 0 0 0 0 0 0 0 0 0 0 0 0 0 0 0 0 0 0 0 0 0 0 0 0 0 0 0 0 0 0 0 0 0 0 0 0 0 0 0 0 0 0 0 0 0 0 0 0 0 0 0 0 0 0 0 0 0 0 0 0 0 0 0 0 0 0 0 0 0 0 0 0 0 0 0 0 0 0 0 0 0 0 0 0 0 0 0]
 [0 0 3 0 0 0 0 0 0 0 0 0 0 0 0 0 0 0 0 0 0 0 0 0 0 0 0 0 0 0 0 0 0 0 0 0 0 0 0 0 0 0 0 0 0 0 0 0 0 0 0 0 0 0 0 0 0 0 0 0 0 0 0 0 0 0 0 0 0 0 0 0 0 0 0 0 0 0 0 0 0 0 0 0 0 0 0 0 0 0 0 0 0 0 0 0 0 0 0 0]
 [0 0 3 0 0 0 0 0 0 0 0 0 0 0 0 0 0 0 0 0 0 0 0 0 0 0 0 0 0 0 0 0 0 0 0 0 0 0 0 0 0 0 0 0 0 0 0 0 0 0 0 0 0 0 0 0 0 0 0 0 0 0 0 0 0 0 0 0 0 0 0 0 0 0 0 0 0 0 0 0 0 0 0 0 0 0 0 0 0 0 0 0 0 0 0 0 0 0 0 0]
 [0 0 3 0 0 0 0 0 0 0 0 0 0 0 0 0 0 0 0 0 0 0 0 0 0 0 0 0 0 0 0 0 0 0 0 0 0 0 0 0 0 0 0 0 0 0 0 0 0 0 0 0 0 0 0 0 0 0 0 0 0 0 0 0 0 0 0 0 0 0 0 0 0 0 0 0 0 0 0 0 0 0 0 0 0 0 0 0 0 0 0 0 0 0 0 0 0 0 0 0]
 [0 0 2 0 0 0 0 0 0 0 0 0 0 0 0 0 0 0 0 0 0 0 0 0 0 0 0 0 0 0 0 0 0 0 0 0 0 0 0 0 0 0 0 0 0 0 0 0 0 0 0 0 0 0 0 0 0 0 0 0 0 0 0 0 0 0 0 0 0 0 0 0 0 0 0 0 0 0 0 0 0 0 0 0 0 0 0 0 0 0 0 0 0 1 0 0 0 0 0 0]
 [0 0 0 0 0 0 0 0 0 0 0 0 0 0 0 0 0 0 0 0 0 0 0 0 0 0 0 0 0 0 0 0 0 0 0 0 0 0 0 0 0 0 0 0 0 0 0 0 0 0 0 0 0 0 0 0 0 0 0 0 0 0 0 0 0 0 0 0 0 0 0 0 0 0 0 0 0 0 0 0 0 0 0 0 0 0 0 1 0 0 0 0 0 2 0 0 0 0 0 0]
 [0 0 3 0 0 0 0 0 0 0 0 0 0 0 0 0 0 0 0 0 0 0 0 0 0 0 0 0 0 0 0 0 0 0 0 0 0 0 0 0 0 0 0 0 0 0 0 0 0 0 0 0 0 0 0 0 0 0 0 0 0 0 0 0 0 0 0 0 0 0 0 0 0 0 0 0 0 0 0 0 0 0 0 0 0 0 0 0 0 0 0 0 0 0 0 0 0 0 0 0]
 [0 0 3 0 0 0 0 0 0 0 0 0 0 0 0 0 0 0 0 0 0 0 0 0 0 0 0 0 0 0 0 0 0 0 0 0 0 0 0 0 0 0 0 0 0 0 0 0 0 0 0 0 0 0 0 0 0 0 0 0 0 0 0 0 0 0 0 0 0 0 0 0 0 0 0 0 0 0 0 0 0 0 0 0 0 0 0 0 0 0 0 0 0 0 0 0 0 0 0 0]
 [0 0 2 0 0 0 0 0 0 0 0 0 0 0 0 0 0 0 0 0 0 0 0 0 0 0 0 0 0 0 0 0 0 0 0 0 0 0 0 0 0 0 0 0 0 0 0 0 0 0 0 0 0 0 0 1 0 0 0 0 0 0 0 0 0 0 0 0 0 0 0 0 0 0 0 0 0 0 0 0 0 0 0 0 0 0 0 0 0 0 0 0 0 0 0 0 0 0 0 0]
 [0 0 1 0 0 0 0 0 0 0 0 0 0 0 0 0 0 0 0 0 0 0 0 0 0 0 0 0 0 0 0 0 0 0 1 0 0 0 0 0 0 0 0 0 0 0 0 0 0 0 0 0 0 0 0 0 0 0 0 0 0 0 0 0 0 0 0 0 0 0 0 0 0 0 0 0 0 0 0 0 0 0 0 0 0 0 0 0 0 0 0 0 0 0 0 0 0 0 0 0]
 [0 0 0 0 0 0 0 0 0 0 0 0 0 0 0 0 0 0 0 0 0 0 0 0 0 0 0 0 0 0 0 0 0 1 0 0 0 0 0 0 0 0 0 0 0 0 0 0 0 0 0 0 0 0 0 0 0 0 0 0 0 0 0 1 0 0 0 0 0 0 0 0 0 0 0 0 0 0 0 0 0 0 0 0 0 0 0 0 0 0 0 0 0 0 0 0 0 0 0 0]
 [0 0 1 0 0 0 0 0 0 0 0 0 0 0 0 0 0 0 0 0 0 0 0 0 0 0 0 0 0 0 0 0 0 0 0 0 0 0 0 0 0 0 0 0 0 0 0 0 0 0 0 0 0 0 0 0 0 0 0 0 0 0 1 0 0 0 0 0 0 0 0 0 0 0 0 0 0 0 0 0 0 0 0 0 0 0 0 0 0 0 0 0 0 1 0 0 0 0 0 0]
 [0 0 0 0 0 0 0 0 0 0 0 0 0 0 0 0 0 0 0 0 0 0 0 0 0 0 0 0 0 0 0 0 0 0 0 0 0 0 0 0 0 0 0 0 0 0 0 0 0 0 0 0 0 0 0 0 0 0 0 1 1 0 0 0 0 0 0 0 0 0 0 0 0 0 0 0 0 0 0 0 0 0 0 0 0 0 0 0 0 0 0 0 0 0 0 0 0 0 0 0]
 [0 0 2 0 0 0 0 0 0 0 0 0 0 0 0 0 0 0 0 0 0 0 0 0 0 0 0 0 0 0 0 0 0 0 0 0 0 0 0 0 0 0 0 0 0 0 0 0 0 0 0 0 0 0 0 0 0 0 0 0 0 0 0 1 0 0 0 0 0 0 0 0 0 0 0 0 0 0 0 0 0 0 0 0 0 0 0 0 0 0 0 0 0 0 0 0 0 0 0 0]
 [0 0 1 0 0 0 0 0 0 0 0 0 0 0 0 1 0 0 0 0 0 0 0 0 0 0 0 0 0 0 0 0 1 0 0 0 0 0 0 0 0 0 0 0 0 0 0 0 0 0 0 0 0 0 0 0 0 0 0 0 0 0 0 0 0 0 0 0 0 0 0 0 0 0 0 0 0 0 0 0 0 0 0 0 0 0 0 0 0 0 0 0 0 0 0 0 0 0 0 0]
 [0 0 1 0 0 0 0 0 0 0 0 0 0 0 0 0 0 0 1 0 0 0 0 0 0 0 0 0 0 0 0 0 0 0 0 0 0 0 0 0 0 0 0 0 0 0 0 0 0 0 0 0 0 0 0 0 0 0 0 0 0 0 0 0 0 0 0 0 0 0 0 0 0 0 0 0 0 0 0 0 0 0 0 0 0 0 0 0 0 0 0 0 0 0 0 0 0 0 0 0]
 [0 0 2 0 0 0 0 0 0 0 0 0 0 0 0 0 0 0 0 0 0 0 0 0 0 0 0 0 0 0 0 0 0 0 0 0 0 0 0 0 0 0 0 0 0 0 0 0 0 0 0 0 0 0 0 0 0 0 0 0 0 0 0 0 0 0 0 0 0 0 0 0 0 0 0 0 0 0 0 0 0 0 0 0 0 0 0 0 0 0 0 0 0 0 0 0 0 0 0 0]
 [0 0 3 0 0 0 0 0 0 0 0 0 0 0 0 0 0 0 0 0 0 0 0 0 0 0 0 0 0 0 0 0 0 0 0 0 0 0 0 0 0 0 0 0 0 0 0 0 0 0 0 0 0 0 0 0 0 0 0 0 0 0 0 0 0 0 0 0 0 0 0 0 0 0 0 0 0 0 0 0 0 0 0 0 0 0 0 0 0 0 0 0 0 0 0 0 0 0 0 0]
 [0 0 3 0 0 0 0 0 0 0 0 0 0 0 0 0 0 0 0 0 0 0 0 0 0 0 0 0 0 0 0 0 0 0 0 0 0 0 0 0 0 0 0 0 0 0 0 0 0 0 0 0 0 0 0 0 0 0 0 0 0 0 0 0 0 0 0 0 0 0 0 0 0 0 0 0 0 0 0 0 0 0 0 0 0 0 0 0 0 0 0 0 0 0 0 0 0 0 0 0]
 [0 0 2 0 0 0 0 0 0 0 0 0 0 0 0 0 0 0 0 0 0 0 0 0 0 0 0 0 0 0 0 0 0 0 0 0 0 0 0 0 0 0 0 0 0 0 0 0 0 0 0 0 0 0 0 0 0 0 0 0 0 0 0 0 0 0 0 0 0 0 0 0 0 0 0 0 0 0 0 0 0 0 0 0 0 0 0 0 0 0 0 0 0 1 0 0 0 0 0 0]
 [0 0 4 0 0 0 0 0 0 0 0 0 0 0 0 0 0 0 0 0 0 0 0 0 0 0 0 0 0 0 0 0 0 0 0 0 0 0 0 0 0 0 0 0 0 0 0 0 0 0 0 0 0 0 0 0 0 0 0 0 0 0 0 0 0 0 0 0 0 0 0 0 0 0 0 0 0 0 0 0 0 0 0 0 0 0 0 0 0 0 0 0 0 0 0 0 0 0 0 0]
 [0 0 3 0 0 0 0 0 0 0 0 0 0 0 0 0 0 0 0 0 0 0 0 0 0 0 0 0 0 0 0 0 0 0 0 0 0 0 0 0 0 0 0 0 0 0 0 0 0 0 0 0 0 0 0 0 0 0 0 0 0 0 0 0 0 0 0 0 0 0 0 0 0 0 0 0 0 0 0 0 0 0 0 0 0 0 0 0 0 0 0 0 0 0 0 0 0 0 0 0]
 [0 0 1 0 0 0 0 0 0 0 0 0 0 0 0 0 0 0 0 0 0 0 0 0 0 0 0 0 0 0 0 0 0 0 0 0 0 0 0 0 0 0 0 0 0 1 0 0 0 0 0 0 0 0 0 0 0 0 0 0 0 0 0 0 0 0 0 0 0 0 0 0 0 0 0 0 0 0 0 0 0 0 0 0 0 2 0 0 0 0 0 0 0 0 0 0 0 0 0 0]
 [0 0 3 0 0 0 0 0 0 0 0 0 0 0 0 0 0 0 0 0 0 0 0 0 0 0 0 0 0 0 0 0 0 0 0 0 0 0 0 0 0 0 0 0 0 0 0 0 0 0 0 0 0 0 0 0 0 0 0 0 0 0 0 0 0 0 0 0 0 0 0 0 0 0 0 0 0 0 0 0 0 0 0 0 0 0 0 0 0 0 0 0 0 0 0 0 0 0 0 0]
 [0 0 3 0 0 0 0 0 0 0 0 0 0 0 0 0 0 0 0 0 0 0 0 0 0 0 0 0 0 0 0 0 0 0 0 0 0 0 0 0 0 0 0 0 0 0 0 0 0 0 0 0 0 0 0 0 0 0 0 0 0 0 0 0 0 0 0 0 0 0 0 0 0 0 0 0 0 0 0 0 0 0 0 0 0 0 0 0 0 0 0 0 0 0 0 0 0 0 0 0]
 [0 0 2 0 0 0 0 0 0 0 0 0 0 0 0 0 0 0 0 0 0 0 0 0 0 0 0 0 0 0 0 0 0 0 0 0 0 0 0 0 0 0 0 0 0 0 0 0 0 0 1 0 0 0 0 0 0 0 0 0 0 0 0 0 0 0 0 0 0 0 0 0 0 0 0 0 0 0 0 0 0 0 0 0 0 0 0 0 0 0 0 0 0 0 0 0 0 0 0 0]
 [0 0 3 0 0 0 0 0 0 0 0 0 0 0 0 0 0 0 0 0 0 0 0 0 0 0 0 0 0 0 0 0 0 0 0 0 0 0 0 0 0 0 0 0 0 0 0 0 0 0 0 0 0 0 0 0 0 0 0 0 0 0 0 0 0 0 0 0 0 0 0 0 0 0 0 0 0 0 0 0 0 0 0 0 0 0 0 0 0 0 0 0 0 0 0 0 0 0 0 0]
 [0 0 2 0 0 0 0 0 0 0 0 0 0 0 0 0 0 0 0 0 0 0 0 0 0 0 0 0 0 0 0 0 0 0 0 0 0 0 0 0 0 0 0 0 0 0 0 0 0 0 0 0 0 0 0 0 0 0 0 0 0 0 0 0 0 0 0 0 0 0 0 0 0 0 0 0 0 0 2 0 0 0 0 0 0 0 0 0 0 0 0 0 0 0 0 0 0 0 0 0]
 [0 0 0 0 0 0 0 0 0 0 0 0 0 0 0 0 0 0 0 0 0 0 1 0 0 0 0 0 0 0 0 0 0 0 0 0 0 0 0 0 0 0 0 0 0 0 0 0 0 0 0 0 0 0 0 0 0 0 1 0 0 1 0 0 0 0 0 0 0 0 0 0 0 0 0 0 0 0 0 0 0 0 0 0 0 0 0 0 0 0 0 0 0 0 0 0 0 0 0 0]
 [0 0 3 0 0 0 0 0 0 0 0 0 0 0 0 0 0 0 0 0 0 0 0 0 0 0 0 0 0 0 0 0 0 0 0 0 0 0 0 0 0 0 0 0 0 0 0 0 0 0 0 0 0 0 0 0 0 0 0 0 0 0 0 0 0 0 0 0 0 0 0 0 0 0 0 0 0 0 0 0 0 0 0 0 0 0 0 0 0 0 0 0 0 0 0 0 0 0 0 0]
 [0 0 2 0 0 0 0 0 0 0 0 0 0 0 0 0 0 0 0 0 0 0 0 0 0 0 0 0 0 0 0 0 0 0 0 0 0 0 0 0 0 0 0 0 0 0 0 0 0 0 0 0 0 1 0 0 0 0 0 0 0 0 0 0 0 0 0 0 0 0 0 0 0 0 0 0 0 0 0 0 0 0 0 0 0 0 0 0 0 0 0 0 0 0 0 0 0 0 0 0]
 [0 0 0 0 0 0 0 0 0 0 0 0 0 0 0 0 0 0 0 0 0 0 0 0 0 0 0 0 0 0 0 0 0 0 0 0 0 0 0 0 0 0 1 0 0 0 0 0 0 0 0 0 0 0 0 0 0 0 0 0 0 0 1 0 0 0 0 0 0 0 0 0 0 0 0 0 0 0 0 0 0 0 0 0 0 0 0 0 0 0 0 0 0 1 0 0 0 0 0 0]
 [0 0 1 0 0 0 0 0 0 0 0 0 0 0 0 1 0 0 0 0 0 0 0 0 0 0 0 0 0 0 0 0 0 0 0 0 0 0 0 0 0 0 0 0 0 0 0 0 0 0 0 0 0 0 0 0 0 0 0 0 0 0 0 0 0 0 0 0 0 0 0 0 0 0 0 0 0 0 0 0 0 0 0 1 0 0 0 0 0 0 0 0 0 0 0 0 0 0 0 0]
 [0 0 2 0 0 0 0 0 0 0 1 0 0 0 0 0 0 0 0 0 0 0 0 0 0 0 0 0 0 0 0 0 0 0 0 0 0 0 0 0 0 0 0 0 0 0 0 0 0 0 0 0 0 0 0 0 0 0 0 0 0 0 0 0 0 0 0 0 0 0 0 0 0 0 0 0 0 0 0 0 0 0 0 0 0 0 0 0 0 0 0 0 0 0 0 0 0 0 0 0]
 [0 1 1 0 0 0 0 0 0 0 0 0 0 0 0 0 0 0 0 0 0 0 0 0 0 0 0 0 0 0 0 0 0 0 0 0 0 0 0 0 0 0 0 0 0 0 0 0 0 0 1 0 0 0 0 0 0 0 0 0 0 0 0 0 0 0 0 0 0 0 0 0 0 0 0 0 0 0 0 0 0 0 0 0 0 0 0 0 0 0 0 0 0 0 0 0 0 0 0 0]
 [0 0 2 0 0 0 0 0 0 0 0 0 0 0 0 0 0 0 0 0 0 0 0 0 0 0 0 0 0 0 0 0 0 0 0 0 0 0 0 0 0 0 0 0 0 0 0 0 0 0 0 0 1 0 0 0 0 0 0 0 0 0 0 0 0 0 0 0 0 0 0 0 0 0 0 0 0 0 0 0 0 0 0 0 0 0 0 0 0 0 0 0 0 0 0 0 0 0 0 0]
 [0 0 1 0 0 0 0 0 0 0 0 0 0 0 0 0 0 0 0 0 0 0 0 0 0 0 0 0 0 0 0 0 0 0 0 0 0 0 0 0 0 0 0 0 0 0 0 0 0 0 0 0 0 0 0 0 0 0 0 0 0 0 0 0 0 0 0 0 0 0 0 0 0 0 0 0 0 0 0 0 0 0 0 0 0 0 0 2 0 0 0 0 0 0 0 0 0 0 0 0]
 [0 0 2 0 0 0 0 0 0 0 0 0 0 0 0 0 0 0 0 0 0 0 0 0 0 0 0 0 0 0 0 0 0 0 0 0 0 0 0 0 0 0 0 0 0 0 0 0 0 0 0 0 0 0 0 0 0 0 0 0 0 0 0 0 0 0 0 0 0 0 0 0 0 0 0 0 0 0 0 0 0 0 0 0 0 0 1 0 0 0 0 0 0 0 0 0 0 0 0 0]
 [0 0 2 0 0 0 0 0 0 0 0 0 0 0 0 0 0 0 0 0 0 0 0 0 0 0 0 0 0 0 0 0 0 0 0 0 0 0 0 0 0 0 0 0 0 0 0 0 0 0 0 0 0 0 0 0 0 0 0 0 0 0 0 0 0 0 0 0 0 0 0 0 0 0 0 0 0 0 0 0 0 0 0 0 0 0 0 0 0 1 0 0 0 0 0 0 0 0 0 0]
 [0 0 3 0 0 0 0 0 0 0 0 0 0 0 0 0 0 0 0 0 0 0 0 0 0 0 0 0 0 0 0 0 0 0 0 0 0 0 0 0 0 0 0 0 0 0 0 0 0 0 0 0 0 0 0 0 0 0 0 0 0 0 0 0 0 0 0 0 0 0 0 0 0 0 0 0 0 0 0 0 0 0 0 0 0 0 0 0 0 0 0 0 0 0 0 0 0 0 0 0]
 [0 1 1 0 0 0 0 0 0 0 0 0 0 0 0 0 0 0 0 0 0 0 0 0 0 0 0 0 0 0 0 0 1 0 0 0 0 0 0 0 0 0 0 0 0 0 0 0 0 0 0 0 0 0 0 0 0 0 0 0 0 0 0 0 0 0 0 0 0 0 0 0 0 0 0 0 0 0 0 0 0 0 0 0 0 0 0 0 0 0 0 0 0 0 0 0 0 0 0 0]
 [0 0 1 0 0 0 0 0 0 0 0 0 0 0 0 0 0 0 0 0 0 0 0 0 0 0 0 0 0 0 0 0 0 0 0 0 0 0 0 0 0 0 0 0 0 0 0 0 0 0 0 0 0 0 0 0 0 0 0 0 0 0 0 0 0 0 0 0 0 0 0 0 0 1 0 0 0 0 0 0 0 0 0 0 0 0 0 0 0 0 0 0 1 0 0 0 0 0 0 0]
 [0 0 1 0 0 0 0 0 0 0 0 0 0 0 0 0 0 0 0 0 0 0 0 0 0 0 0 0 0 0 0 0 0 0 0 0 0 0 0 0 0 0 0 0 0 0 0 0 0 0 0 0 0 0 0 0 0 0 0 0 0 0 0 0 0 0 0 0 0 0 0 0 0 0 0 0 0 0 0 0 0 0 0 0 0 0 0 0 0 0 0 0 0 2 0 0 0 0 0 0]
 [0 0 2 0 0 0 0 0 0 0 0 0 0 0 0 0 0 0 0 0 0 0 0 0 0 0 0 0 0 0 0 0 0 0 0 0 0 0 0 0 0 0 0 0 0 0 0 0 0 0 0 0 0 0 0 0 0 0 0 0 0 0 0 0 0 0 0 0 0 0 0 0 0 0 0 0 0 0 0 0 0 0 0 0 0 0 0 0 0 0 0 0 0 0 1 0 0 0 0 0]
 [0 0 2 0 0 0 0 0 0 0 0 0 0 0 0 0 0 0 0 0 0 0 0 0 0 0 0 0 0 0 0 0 0 0 0 0 0 0 0 0 0 0 0 0 0 0 0 0 0 0 0 0 0 0 0 0 0 0 0 0 0 0 0 0 0 0 0 0 0 0 0 0 0 0 0 0 0 0 0 0 0 0 0 0 0 0 0 0 0 0 0 0 0 1 0 0 0 0 0 0]
 [0 0 3 0 0 0 0 0 0 0 0 0 0 0 0 0 0 0 0 0 0 0 0 0 0 0 0 0 0 0 0 0 0 0 0 0 0 0 0 0 0 0 0 0 0 0 0 0 0 0 0 0 0 0 0 0 0 0 0 0 0 0 0 0 0 0 0 0 0 0 0 0 0 0 0 0 0 0 0 0 0 0 0 0 0 0 0 0 0 0 0 0 0 0 0 0 0 0 0 0]
 [0 0 0 0 0 0 0 0 0 0 0 0 0 0 0 0 0 0 0 0 0 0 0 0 0 0 0 0 0 0 0 0 0 0 0 0 0 0 0 0 0 0 0 0 0 0 0 0 0 0 0 0 0 0 0 0 0 0 0 0 0 0 0 0 0 0 0 0 0 0 0 0 0 0 0 0 0 0 0 0 0 0 0 0 0 0 0 0 0 0 0 0 0 0 0 0 0 3 0 0]
 [0 0 0 0 0 0 0 0 0 0 0 0 0 0 0 0 0 0 0 0 0 0 0 0 0 0 0 0 0 0 0 0 0 0 0 0 0 0 0 0 0 0 0 0 0 0 0 0 0 0 0 0 0 0 0 0 0 0 0 0 0 0 0 0 0 0 0 0 0 0 0 0 0 0 0 0 0 0 0 1 0 0 0 0 1 0 0 0 0 0 0 0 0 1 0 0 0 0 0 0]
 [0 0 0 0 0 0 0 0 0 0 0 0 0 0 0 0 1 0 0 0 0 0 0 0 0 0 0 0 0 0 0 0 0 0 0 0 0 0 0 0 0 0 0 0 1 0 0 0 0 0 0 0 0 0 0 0 0 0 0 0 0 0 0 0 0 0 0 0 0 0 0 0 0 0 0 0 0 0 0 0 0 0 0 0 0 0 0 0 0 0 0 0 0 0 0 0 0 0 0 1]]
2017-12-18 22:53:11,885 - y_test         	y_pred_test    
2017-12-18 22:53:11,886 - accordion      	watch          
2017-12-18 22:53:11,891 - accordion      	accordion      
2017-12-18 22:53:11,891 - airplanes      	Motorbikes     
2017-12-18 22:53:11,891 - airplanes      	Motorbikes     
2017-12-18 22:53:11,892 - airplanes      	Motorbikes     
2017-12-18 22:53:11,892 - anchor         	watch          
2017-12-18 22:53:11,892 - anchor         	llama          
2017-12-18 22:53:11,892 - anchor         	Motorbikes     
2017-12-18 22:53:11,892 - ant            	menorah        
2017-12-18 22:53:11,892 - ant            	panda          
2017-12-18 22:53:11,893 - ant            	snoopy         
2017-12-18 22:53:11,893 - barrel         	Motorbikes     
2017-12-18 22:53:11,893 - barrel         	Motorbikes     
2017-12-18 22:53:11,893 - barrel         	Motorbikes     
2017-12-18 22:53:11,894 - bass           	Motorbikes     
2017-12-18 22:53:11,894 - bass           	Motorbikes     
2017-12-18 22:53:11,894 - bass           	Motorbikes     
2017-12-18 22:53:11,894 - beaver         	Motorbikes     
2017-12-18 22:53:11,894 - beaver         	Motorbikes     
2017-12-18 22:53:11,894 - beaver         	Motorbikes     
2017-12-18 22:53:11,894 - binocular      	cougar_face    
2017-12-18 22:53:11,895 - binocular      	Motorbikes     
2017-12-18 22:53:11,895 - binocular      	Motorbikes     
2017-12-18 22:53:11,895 - binocular      	brontosaurus   
2017-12-18 22:53:11,895 - bonsai         	Motorbikes     
2017-12-18 22:53:11,895 - bonsai         	Motorbikes     
2017-12-18 22:53:11,895 - bonsai         	Motorbikes     
2017-12-18 22:53:11,896 - bonsai         	Motorbikes     
2017-12-18 22:53:11,896 - brain          	starfish       
2017-12-18 22:53:11,896 - brain          	flamingo_head  
2017-12-18 22:53:11,896 - brain          	Motorbikes     
2017-12-18 22:53:11,897 - brain          	electric_guitar
2017-12-18 22:53:11,897 - brontosaurus   	Motorbikes     
2017-12-18 22:53:11,897 - brontosaurus   	Motorbikes     
2017-12-18 22:53:11,897 - brontosaurus   	Motorbikes     
2017-12-18 22:53:11,897 - buddha         	Motorbikes     
2017-12-18 22:53:11,897 - buddha         	Motorbikes     
2017-12-18 22:53:11,897 - buddha         	Motorbikes     
2017-12-18 22:53:11,898 - buddha         	Motorbikes     
2017-12-18 22:53:11,898 - butterfly      	scorpion       
2017-12-18 22:53:11,898 - butterfly      	Motorbikes     
2017-12-18 22:53:11,898 - butterfly      	Motorbikes     
2017-12-18 22:53:11,898 - butterfly      	Motorbikes     
2017-12-18 22:53:11,898 - camera         	Motorbikes     
2017-12-18 22:53:11,898 - camera         	Motorbikes     
2017-12-18 22:53:11,898 - camera         	Motorbikes     
2017-12-18 22:53:11,899 - cannon         	Motorbikes     
2017-12-18 22:53:11,899 - cannon         	Motorbikes     
2017-12-18 22:53:11,899 - cannon         	Motorbikes     
2017-12-18 22:53:11,899 - car_side       	Motorbikes     
2017-12-18 22:53:11,899 - car_side       	Motorbikes     
2017-12-18 22:53:11,899 - car_side       	Motorbikes     
2017-12-18 22:53:11,899 - car_side       	Motorbikes     
2017-12-18 22:53:11,899 - ceiling_fan    	Motorbikes     
2017-12-18 22:53:11,900 - ceiling_fan    	Motorbikes     
2017-12-18 22:53:11,900 - ceiling_fan    	crab           
2017-12-18 22:53:11,900 - ceiling_fan    	Motorbikes     
2017-12-18 22:53:11,900 - cellphone      	metronome      
2017-12-18 22:53:11,900 - cellphone      	watch          
2017-12-18 22:53:11,900 - cellphone      	Motorbikes     
2017-12-18 22:53:11,900 - cellphone      	pagoda         
2017-12-18 22:53:11,900 - chair          	watch          
2017-12-18 22:53:11,901 - chair          	watch          
2017-12-18 22:53:11,901 - chair          	Motorbikes     
2017-12-18 22:53:11,901 - chair          	Motorbikes     
2017-12-18 22:53:11,901 - chandelier     	Motorbikes     
2017-12-18 22:53:11,901 - chandelier     	Motorbikes     
2017-12-18 22:53:11,901 - chandelier     	Motorbikes     
2017-12-18 22:53:11,901 - chandelier     	Motorbikes     
2017-12-18 22:53:11,902 - chandelier     	helicopter     
2017-12-18 22:53:11,902 - cougar_body    	Motorbikes     
2017-12-18 22:53:11,902 - cougar_body    	Motorbikes     
2017-12-18 22:53:11,902 - cougar_body    	Motorbikes     
2017-12-18 22:53:11,903 - cougar_body    	Motorbikes     
2017-12-18 22:53:11,903 - cougar_face    	platypus       
2017-12-18 22:53:11,903 - cougar_face    	Motorbikes     
2017-12-18 22:53:11,903 - cougar_face    	Motorbikes     
2017-12-18 22:53:11,903 - cougar_face    	Motorbikes     
2017-12-18 22:53:11,903 - crab           	Motorbikes     
2017-12-18 22:53:11,903 - crab           	Motorbikes     
2017-12-18 22:53:11,903 - crab           	Motorbikes     
2017-12-18 22:53:11,903 - crab           	Motorbikes     
2017-12-18 22:53:11,904 - crayfish       	Motorbikes     
2017-12-18 22:53:11,904 - crayfish       	Motorbikes     
2017-12-18 22:53:11,904 - crayfish       	Motorbikes     
2017-12-18 22:53:11,904 - crayfish       	Motorbikes     
2017-12-18 22:53:11,904 - crocodile      	Motorbikes     
2017-12-18 22:53:11,904 - crocodile      	Motorbikes     
2017-12-18 22:53:11,904 - crocodile      	Motorbikes     
2017-12-18 22:53:11,904 - crocodile      	Motorbikes     
2017-12-18 22:53:11,905 - crocodile_head 	Motorbikes     
2017-12-18 22:53:11,905 - crocodile_head 	Motorbikes     
2017-12-18 22:53:11,905 - crocodile_head 	strawberry     
2017-12-18 22:53:11,905 - crocodile_head 	Motorbikes     
2017-12-18 22:53:11,905 - cup            	dragonfly      
2017-12-18 22:53:11,905 - cup            	Motorbikes     
2017-12-18 22:53:11,905 - cup            	menorah        
2017-12-18 22:53:11,905 - dalmatian      	Motorbikes     
2017-12-18 22:53:11,905 - dalmatian      	dalmatian      
2017-12-18 22:53:11,906 - dalmatian      	elephant       
2017-12-18 22:53:11,906 - dalmatian      	Motorbikes     
2017-12-18 22:53:11,906 - dollar_bill    	Motorbikes     
2017-12-18 22:53:11,906 - dollar_bill    	Motorbikes     
2017-12-18 22:53:11,906 - dollar_bill    	Motorbikes     
2017-12-18 22:53:11,906 - dolphin        	rooster        
2017-12-18 22:53:11,906 - dolphin        	flamingo_head  
2017-12-18 22:53:11,906 - dolphin        	lotus          
2017-12-18 22:53:11,907 - dolphin        	hawksbill      
2017-12-18 22:53:11,907 - dragonfly      	ketch          
2017-12-18 22:53:11,907 - dragonfly      	Motorbikes     
2017-12-18 22:53:11,908 - dragonfly      	Motorbikes     
2017-12-18 22:53:11,908 - dragonfly      	helicopter     
2017-12-18 22:53:11,908 - electric_guitar	Motorbikes     
2017-12-18 22:53:11,908 - electric_guitar	Motorbikes     
2017-12-18 22:53:11,908 - electric_guitar	Motorbikes     
2017-12-18 22:53:11,909 - electric_guitar	dragonfly      
2017-12-18 22:53:11,909 - elephant       	strawberry     
2017-12-18 22:53:11,909 - elephant       	Motorbikes     
2017-12-18 22:53:11,909 - elephant       	Motorbikes     
2017-12-18 22:53:11,909 - elephant       	Motorbikes     
2017-12-18 22:53:11,910 - emu            	Motorbikes     
2017-12-18 22:53:11,910 - emu            	Motorbikes     
2017-12-18 22:53:11,910 - emu            	snoopy         
2017-12-18 22:53:11,910 - euphonium      	euphonium      
2017-12-18 22:53:11,910 - euphonium      	Motorbikes     
2017-12-18 22:53:11,910 - euphonium      	watch          
2017-12-18 22:53:11,910 - ewer           	scorpion       
2017-12-18 22:53:11,910 - ewer           	cougar_body    
2017-12-18 22:53:11,911 - ewer           	Leopards       
2017-12-18 22:53:11,911 - Faces_easy     	Motorbikes     
2017-12-18 22:53:11,911 - Faces_easy     	watch          
2017-12-18 22:53:11,912 - Faces_easy     	Motorbikes     
2017-12-18 22:53:11,912 - ferry          	Motorbikes     
2017-12-18 22:53:11,912 - ferry          	Motorbikes     
2017-12-18 22:53:11,912 - ferry          	Motorbikes     
2017-12-18 22:53:11,912 - flamingo       	Motorbikes     
2017-12-18 22:53:11,912 - flamingo       	Motorbikes     
2017-12-18 22:53:11,913 - flamingo       	lamp           
2017-12-18 22:53:11,913 - flamingo_head  	ibis           
2017-12-18 22:53:11,913 - flamingo_head  	Motorbikes     
2017-12-18 22:53:11,913 - flamingo_head  	dragonfly      
2017-12-18 22:53:11,913 - garfield       	joshua_tree    
2017-12-18 22:53:11,914 - garfield       	bonsai         
2017-12-18 22:53:11,914 - garfield       	garfield       
2017-12-18 22:53:11,914 - gerenuk        	Motorbikes     
2017-12-18 22:53:11,914 - gerenuk        	Motorbikes     
2017-12-18 22:53:11,914 - gerenuk        	Motorbikes     
2017-12-18 22:53:11,914 - gramophone     	Motorbikes     
2017-12-18 22:53:11,914 - gramophone     	Motorbikes     
2017-12-18 22:53:11,914 - gramophone     	brain          
2017-12-18 22:53:11,915 - grand_piano    	grand_piano    
2017-12-18 22:53:11,915 - grand_piano    	Motorbikes     
2017-12-18 22:53:11,915 - grand_piano    	Motorbikes     
2017-12-18 22:53:11,915 - hawksbill      	Motorbikes     
2017-12-18 22:53:11,915 - hawksbill      	hawksbill      
2017-12-18 22:53:11,915 - hawksbill      	Motorbikes     
2017-12-18 22:53:11,915 - headphone      	Motorbikes     
2017-12-18 22:53:11,915 - headphone      	Motorbikes     
2017-12-18 22:53:11,915 - hedgehog       	Motorbikes     
2017-12-18 22:53:11,916 - hedgehog       	Motorbikes     
2017-12-18 22:53:11,917 - hedgehog       	car_side       
2017-12-18 22:53:11,917 - helicopter     	binocular      
2017-12-18 22:53:11,918 - helicopter     	Motorbikes     
2017-12-18 22:53:11,927 - helicopter     	Motorbikes     
2017-12-18 22:53:11,927 - ibis           	Motorbikes     
2017-12-18 22:53:11,928 - ibis           	Motorbikes     
2017-12-18 22:53:11,928 - ibis           	Motorbikes     
2017-12-18 22:53:11,928 - inline_skate   	Motorbikes     
2017-12-18 22:53:11,928 - inline_skate   	Motorbikes     
2017-12-18 22:53:11,928 - inline_skate   	Motorbikes     
2017-12-18 22:53:11,928 - joshua_tree    	Motorbikes     
2017-12-18 22:53:11,928 - joshua_tree    	Motorbikes     
2017-12-18 22:53:11,928 - joshua_tree    	Motorbikes     
2017-12-18 22:53:11,928 - kangaroo       	Motorbikes     
2017-12-18 22:53:11,929 - kangaroo       	Motorbikes     
2017-12-18 22:53:11,929 - kangaroo       	Motorbikes     
2017-12-18 22:53:11,929 - ketch          	Motorbikes     
2017-12-18 22:53:11,929 - ketch          	Motorbikes     
2017-12-18 22:53:11,929 - ketch          	Motorbikes     
2017-12-18 22:53:11,929 - lamp           	Motorbikes     
2017-12-18 22:53:11,930 - lamp           	Motorbikes     
2017-12-18 22:53:11,930 - lamp           	watch          
2017-12-18 22:53:11,930 - laptop         	watch          
2017-12-18 22:53:11,930 - laptop         	watch          
2017-12-18 22:53:11,931 - laptop         	stop_sign      
2017-12-18 22:53:11,931 - Leopards       	Leopards       
2017-12-18 22:53:11,931 - Leopards       	Leopards       
2017-12-18 22:53:11,931 - Leopards       	Leopards       
2017-12-18 22:53:11,932 - llama          	Motorbikes     
2017-12-18 22:53:11,932 - llama          	Motorbikes     
2017-12-18 22:53:11,932 - llama          	Motorbikes     
2017-12-18 22:53:11,932 - lobster        	Motorbikes     
2017-12-18 22:53:11,932 - lobster        	Motorbikes     
2017-12-18 22:53:11,932 - lobster        	Motorbikes     
2017-12-18 22:53:11,932 - lotus          	Motorbikes     
2017-12-18 22:53:11,932 - lotus          	lamp           
2017-12-18 22:53:11,933 - lotus          	Motorbikes     
2017-12-18 22:53:11,933 - mandolin       	Motorbikes     
2017-12-18 22:53:11,933 - mandolin       	electric_guitar
2017-12-18 22:53:11,933 - mayfly         	dragonfly      
2017-12-18 22:53:11,933 - mayfly         	metronome      
2017-12-18 22:53:11,933 - menorah        	watch          
2017-12-18 22:53:11,934 - menorah        	Motorbikes     
2017-12-18 22:53:11,934 - menorah        	menorah        
2017-12-18 22:53:11,934 - metronome      	mandolin       
2017-12-18 22:53:11,934 - metronome      	lotus          
2017-12-18 22:53:11,934 - minaret        	Motorbikes     
2017-12-18 22:53:11,934 - minaret        	Motorbikes     
2017-12-18 22:53:11,934 - minaret        	metronome      
2017-12-18 22:53:11,934 - Motorbikes     	Motorbikes     
2017-12-18 22:53:11,935 - Motorbikes     	Motorbikes     
2017-12-18 22:53:11,935 - Motorbikes     	Motorbikes     
2017-12-18 22:53:11,935 - nautilus       	butterfly      
2017-12-18 22:53:11,935 - nautilus       	Motorbikes     
2017-12-18 22:53:11,935 - nautilus       	dolphin        
2017-12-18 22:53:11,936 - octopus        	car_side       
2017-12-18 22:53:11,936 - octopus        	Motorbikes     
2017-12-18 22:53:11,936 - okapi          	Motorbikes     
2017-12-18 22:53:11,936 - okapi          	Motorbikes     
2017-12-18 22:53:11,936 - pagoda         	Motorbikes     
2017-12-18 22:53:11,936 - pagoda         	Motorbikes     
2017-12-18 22:53:11,936 - pagoda         	Motorbikes     
2017-12-18 22:53:11,937 - panda          	Motorbikes     
2017-12-18 22:53:11,937 - panda          	Motorbikes     
2017-12-18 22:53:11,937 - panda          	Motorbikes     
2017-12-18 22:53:11,937 - pigeon         	Motorbikes     
2017-12-18 22:53:11,937 - pigeon         	watch          
2017-12-18 22:53:11,937 - pigeon         	Motorbikes     
2017-12-18 22:53:11,937 - pizza          	Motorbikes     
2017-12-18 22:53:11,937 - pizza          	Motorbikes     
2017-12-18 22:53:11,937 - pizza          	Motorbikes     
2017-12-18 22:53:11,938 - pizza          	Motorbikes     
2017-12-18 22:53:11,938 - platypus       	Motorbikes     
2017-12-18 22:53:11,938 - platypus       	Motorbikes     
2017-12-18 22:53:11,938 - platypus       	Motorbikes     
2017-12-18 22:53:11,938 - pyramid        	starfish       
2017-12-18 22:53:11,938 - pyramid        	starfish       
2017-12-18 22:53:11,938 - pyramid        	Motorbikes     
2017-12-18 22:53:11,938 - pyramid        	grand_piano    
2017-12-18 22:53:11,938 - revolver       	Motorbikes     
2017-12-18 22:53:11,939 - revolver       	Motorbikes     
2017-12-18 22:53:11,939 - revolver       	Motorbikes     
2017-12-18 22:53:11,939 - rhino          	Motorbikes     
2017-12-18 22:53:11,939 - rhino          	Motorbikes     
2017-12-18 22:53:11,939 - rhino          	Motorbikes     
2017-12-18 22:53:11,939 - rooster        	Motorbikes     
2017-12-18 22:53:11,939 - rooster        	Motorbikes     
2017-12-18 22:53:11,939 - rooster        	ibis           
2017-12-18 22:53:11,939 - saxophone      	Motorbikes     
2017-12-18 22:53:11,940 - saxophone      	Motorbikes     
2017-12-18 22:53:11,940 - saxophone      	Motorbikes     
2017-12-18 22:53:11,940 - schooner       	Motorbikes     
2017-12-18 22:53:11,940 - schooner       	Motorbikes     
2017-12-18 22:53:11,940 - schooner       	schooner       
2017-12-18 22:53:11,940 - schooner       	schooner       
2017-12-18 22:53:11,940 - scissors       	chandelier     
2017-12-18 22:53:11,940 - scissors       	mayfly         
2017-12-18 22:53:11,940 - scissors       	lobster        
2017-12-18 22:53:11,941 - scorpion       	Motorbikes     
2017-12-18 22:53:11,941 - scorpion       	Motorbikes     
2017-12-18 22:53:11,941 - scorpion       	Motorbikes     
2017-12-18 22:53:11,941 - sea_horse      	kangaroo       
2017-12-18 22:53:11,941 - sea_horse      	Motorbikes     
2017-12-18 22:53:11,941 - sea_horse      	Motorbikes     
2017-12-18 22:53:11,941 - snoopy         	garfield       
2017-12-18 22:53:11,941 - snoopy         	watch          
2017-12-18 22:53:11,941 - snoopy         	menorah        
2017-12-18 22:53:11,941 - soccer_ball    	soccer_ball    
2017-12-18 22:53:11,942 - soccer_ball    	butterfly      
2017-12-18 22:53:11,942 - soccer_ball    	Motorbikes     
2017-12-18 22:53:11,942 - stapler        	binocular      
2017-12-18 22:53:11,942 - stapler        	Motorbikes     
2017-12-18 22:53:11,942 - stapler        	Motorbikes     
2017-12-18 22:53:11,942 - starfish       	Motorbikes     
2017-12-18 22:53:11,942 - starfish       	ibis           
2017-12-18 22:53:11,942 - starfish       	Leopards       
2017-12-18 22:53:11,942 - stegosaurus    	joshua_tree    
2017-12-18 22:53:11,943 - stegosaurus    	Motorbikes     
2017-12-18 22:53:11,943 - stegosaurus    	Motorbikes     
2017-12-18 22:53:11,943 - stop_sign      	Motorbikes     
2017-12-18 22:53:11,943 - stop_sign      	stop_sign      
2017-12-18 22:53:11,943 - stop_sign      	stop_sign      
2017-12-18 22:53:11,943 - strawberry     	stegosaurus    
2017-12-18 22:53:11,943 - strawberry     	Motorbikes     
2017-12-18 22:53:11,943 - strawberry     	Motorbikes     
2017-12-18 22:53:11,943 - sunflower      	sunflower      
2017-12-18 22:53:11,943 - sunflower      	Motorbikes     
2017-12-18 22:53:11,944 - sunflower      	Motorbikes     
2017-12-18 22:53:11,944 - tick           	Motorbikes     
2017-12-18 22:53:11,944 - tick           	Motorbikes     
2017-12-18 22:53:11,944 - tick           	Motorbikes     
2017-12-18 22:53:11,945 - trilobite      	Leopards       
2017-12-18 22:53:11,945 - trilobite      	Motorbikes     
2017-12-18 22:53:11,945 - trilobite      	dolphin        
2017-12-18 22:53:11,945 - umbrella       	umbrella       
2017-12-18 22:53:11,945 - umbrella       	pyramid        
2017-12-18 22:53:11,945 - umbrella       	Motorbikes     
2017-12-18 22:53:11,945 - watch          	watch          
2017-12-18 22:53:11,945 - watch          	watch          
2017-12-18 22:53:11,945 - watch          	Motorbikes     
2017-12-18 22:53:11,946 - water_lilly    	Motorbikes     
2017-12-18 22:53:11,946 - water_lilly    	water_lilly    
2017-12-18 22:53:11,946 - water_lilly    	Motorbikes     
2017-12-18 22:53:11,946 - wheelchair     	Motorbikes     
2017-12-18 22:53:11,946 - wheelchair     	watch          
2017-12-18 22:53:11,947 - wheelchair     	Motorbikes     
2017-12-18 22:53:11,947 - wild_cat       	Motorbikes     
2017-12-18 22:53:11,947 - wild_cat       	Motorbikes     
2017-12-18 22:53:11,947 - wild_cat       	Motorbikes     
2017-12-18 22:53:11,947 - windsor_chair  	windsor_chair  
2017-12-18 22:53:11,948 - windsor_chair  	windsor_chair  
2017-12-18 22:53:11,948 - windsor_chair  	windsor_chair  
2017-12-18 22:53:11,948 - wrench         	watch          
2017-12-18 22:53:11,948 - wrench         	stapler        
2017-12-18 22:53:11,948 - wrench         	scissors       
2017-12-18 22:53:11,948 - yin_yang       	yin_yang       
2017-12-18 22:53:11,948 - yin_yang       	camera         
2017-12-18 22:53:11,948 - yin_yang       	gramophone     
