<?xml version="1.0" encoding="utf-8"?>
<!-- Generator: Adobe Illustrator 21.0.0, SVG Export Plug-In . SVG Version: 6.00 Build 0)  -->
<svg version="1.1" id="Layer_1" xmlns="http://www.w3.org/2000/svg" xmlns:xlink="http://www.w3.org/1999/xlink" x="0px" y="0px"
	 viewBox="0 0 128.5 126.3" style="enable-background:new 0 0 128.5 126.3;" xml:space="preserve">
<style type="text/css">
	.st0{fill:#FFFFFF;}
	.st1{opacity:0;}
</style>
<path class="st0" d="M65.4,3.1c33.1,0,60,26.9,60,60.1c0,33-26.9,60-59.9,59.9c-33.5,0-60.2-26.9-60.1-60.4
	C5.5,30,32.5,3.1,65.4,3.1z M42,94.6c4.4,0,8.8,0,13.2,0c4.4,0,4.5,0,4.7-4.5c0.1-1.5,0.6-1.9,2-1.6c2.6,0.5,5.2,0.9,7.9,1.4
	c1.6,0.3,3.2,0.4,4.6-0.6c3.8-2.6,7.5-5.2,11.2-7.9c2.6-1.9,3.1-4.4,1.2-7c-0.8-1.1-0.9-2-0.7-3.2c1.7-9.2,3.4-18.3,5.1-27.5
	c0.1-0.8,0.7-1.9-0.3-2.2c-1-0.2-1,1.1-1.3,1.8c-0.1,0.2-0.1,0.5-0.1,0.7c-2.3,8.8-4.5,17.6-6.8,26.3c-0.2,0.8-0.1,1.7-1.1,2.1
	c-3.3,1.5-6,3.9-8.9,5.9c-1.5,1-2.9,1.3-4.7,0.9c-4.5-1.1-9.1-2-13.6-3.1c-1-0.2-1.8-0.2-2.8,0.5c-3.8,3.1-7,3-11,0
	c-0.7-0.5-1.2-0.7-2-0.4c-7.5,2.1-12.8,8.3-13.9,16.1c-0.2,1.6,0.1,2.3,1.9,2.2C31.6,94.5,36.8,94.6,42,94.6z M73.2,38.7
	c9.7,0,19.5,0,29.2,0c2.7,0,3.9-1.3,4-4.2c0-2.9-1.2-4.3-3.8-4.3c-19.6,0-39.3,0-58.9,0c-2.8,0-3.8,1.1-3.8,4.3c0,3.1,1,4.2,3.9,4.2
	C53.6,38.7,63.4,38.7,73.2,38.7z M45.8,76.7c0.6,0,1,0,1.4-0.1c3.7-1.5,7.1-3.8,10.9-5.1c0.8-0.3,1.2-1.1,0.1-1.9
	c-1.1-0.7-1.2-1.9-1.3-3.1c-0.1-2.2-0.3-4.3-0.4-6.5c-0.3-5.9-4.4-9.8-10.3-9.9c-6.1-0.1-10.4,3.8-10.7,9.8c-0.1,1.6,0,3.2-0.1,4.7
	c-0.2,1.8,0,3.7-1.6,5.1c-1,0.9-0.3,1.8,0.6,2.1c3.5,1,6.6,2.9,9.8,4.6C44.7,76.7,45.4,76.6,45.8,76.7z M86.9,83
	c4.5,0,8.9-0.1,13.2,0c1.8,0,2.2-0.7,2.2-2.4c0-12.8-0.1-25.6,0-38.5c0-1.6-0.5-2.1-2.1-2.1c-1.9,0-1.7,1.1-1.7,2.3
	c0,11.2-0.1,22.5,0.1,33.7c0,2.4-0.4,3.7-3.1,3.2c-0.6-0.1-1.3,0.1-2,0C90.4,78.8,88.2,79.8,86.9,83z M71.7,49c3.2,0,6.5-0.1,9.7,0
	c1.4,0,1.9-0.4,1.9-1.8c0-1.4-0.7-1.6-1.9-1.6c-6.5,0-13,0-19.5,0c-1.1,0-2,0-1.9,1.5c0,1.4,0.5,2,1.9,1.9C65.2,49,68.5,49,71.7,49z
	 M71.7,52.7c-3.2,0-6.3,0-9.5,0c-1.1,0-2.2-0.1-2.1,1.6c0,1.5,0.7,1.8,2,1.8c6.5,0,13,0,19.5,0c1.2,0,1.8-0.3,1.8-1.6
	c0-1.5-0.6-1.8-2-1.8C78.2,52.7,74.9,52.7,71.7,52.7z M44,44.2c0,0.7,0,1.3,0,2c0,1.2-0.4,2.4,1.7,2.5c2.1,0,2.1-1.1,2-2.5
	c0-1.4-0.1-2.8,0-4.2c0.1-1.5-0.6-1.8-1.9-1.8c-1.4,0-2,0.4-1.9,1.8C44.1,42.7,44,43.4,44,44.2z"/>
</svg>
