<svg width="64" height="64" viewBox="0 0 64 64" fill="none" xmlns="http://www.w3.org/2000/svg">
<circle cx="32" cy="32" r="31.5" fill="white" stroke="#EAECEF"/>
<circle cx="32.1562" cy="32.1569" r="29.3333" fill="#F3EEF5"/>
<g clip-path="url(#clip0_11_1374)">
<rect x="29.176" y="20.7059" width="15.0588" height="26.3529" rx="3" fill="#BA92D9"/>
<path d="M26.9127 17.8824V21.8918C25.5988 22.1621 24.6556 23.3177 24.6539 24.6588V46.1177C24.6558 47.6764 25.9187 48.9393 27.4774 48.9412H36.5127C38.0715 48.9393 39.3343 47.6764 39.3363 46.1177V24.6588C39.3346 23.3177 38.3913 22.1621 37.0774 21.8918V17.8824C37.0755 16.3236 35.8126 15.0608 34.2539 15.0588H29.7363C28.1775 15.0608 26.9147 16.3236 26.9127 17.8824ZM38.2068 24.6588V46.1177C38.2068 47.0532 37.4483 47.8118 36.5127 47.8118H27.4774C26.5419 47.8118 25.7833 47.0532 25.7833 46.1177V24.6588C25.7833 23.7233 26.5419 22.9647 27.4774 22.9647H36.5127C37.4483 22.9647 38.2068 23.7233 38.2068 24.6588ZM35.948 17.8824V21.8353H28.0421V17.8824C28.0421 16.9468 28.8007 16.1882 29.7363 16.1882H34.2539C35.1895 16.1882 35.948 16.9468 35.948 17.8824Z" fill="#222222"/>
<path d="M27.4774 24.0941C27.1656 24.0941 26.9127 24.347 26.9127 24.6588V30.3059C26.9127 30.6177 27.1656 30.8706 27.4774 30.8706H36.5127C36.8246 30.8706 37.0774 30.6177 37.0774 30.3059V24.6588C37.0774 24.347 36.8246 24.0941 36.5127 24.0941H27.4774ZM35.948 29.7412H28.0421V25.2235H35.948V29.7412Z" fill="#222222"/>
</g>
<defs>
<clipPath id="clip0_11_1374">
<rect width="33.8824" height="33.8824" fill="white" transform="translate(15.0588 15.0588)"/>
</clipPath>
</defs>
</svg>
