<svg width="24" height="24" viewBox="0 0 24 24" fill="none" xmlns="http://www.w3.org/2000/svg">
<path d="M16.5 3H7.50026C5.02554 3 3.00037 5.02517 3.00037 7.49989V16.5001C3.00037 18.9742 5.02554 21 7.50026 21H16.5C18.9748 21 20.9999 18.9742 20.9999 16.5001V7.49989C20.9999 5.02517 18.9748 3 16.5 3ZM19.4999 16.5001C19.4999 18.1538 18.1547 19.5 16.5 19.5H7.50026C5.84633 19.5 4.5004 18.1538 4.5004 16.5001V7.49989C4.5004 5.84574 5.84633 4.50004 7.50026 4.50004H16.5C18.1547 4.50004 19.4999 5.84574 19.4999 7.49989V16.5001Z" fill="#404040"/>
<path d="M16.8757 8.24995C17.497 8.24995 18.0007 7.74628 18.0007 7.12497C18.0007 6.50367 17.497 6 16.8757 6C16.2544 6 15.7507 6.50367 15.7507 7.12497C15.7507 7.74628 16.2544 8.24995 16.8757 8.24995Z" fill="#404040"/>
<path d="M12.0004 7.5C9.51463 7.5 7.50049 9.51436 7.50049 11.9999C7.50049 14.4845 9.51463 16.5002 12.0004 16.5002C14.4854 16.5002 16.5003 14.4845 16.5003 11.9999C16.5003 9.51436 14.4854 7.5 12.0004 7.5ZM12.0004 15.0002C10.3437 15.0002 9.00052 13.657 9.00052 11.9999C9.00052 10.3428 10.3437 9.00004 12.0004 9.00004C13.657 9.00004 15.0002 10.3428 15.0002 11.9999C15.0002 13.657 13.657 15.0002 12.0004 15.0002Z" fill="#404040"/>
</svg>

