<svg width="64" height="64" viewBox="0 0 64 64" fill="none" xmlns="http://www.w3.org/2000/svg">
<circle cx="32" cy="32" r="31.5" fill="white" stroke="#EAECEF"/>
<circle cx="32.1562" cy="32.1569" r="29.3333" fill="#F3EEF5"/>
<g clip-path="url(#clip0_11_1382)">
<path d="M38.3857 15.0588L40.9624 18.9343L26.1615 28.7751C25.0913 29.4867 23.6469 29.1959 22.9354 28.1257C22.2238 27.0555 22.5146 25.6112 23.5847 24.8996L38.3857 15.0588Z" fill="#BA92D9"/>
<path d="M38.6589 30.5868H38.5064V27.938C38.5064 27.7698 38.4396 27.6085 38.3206 27.4896C38.2017 27.3706 38.0404 27.3038 37.8722 27.3038H32.9263C32.7582 27.3038 32.5969 27.3706 32.4779 27.4896C32.359 27.6085 32.2922 27.7698 32.2922 27.938V30.5868H32.1396C31.2901 30.5878 30.4756 30.9257 29.8749 31.5264C29.2741 32.1272 28.9362 32.9417 28.9353 33.7912V47.0175C28.9358 47.5276 29.1388 48.0166 29.4995 48.3773C29.8602 48.7379 30.3493 48.9408 30.8594 48.9412H39.9402C40.4503 48.9407 40.9393 48.7378 41.2999 48.3771C41.6606 48.0165 41.8634 47.5275 41.864 47.0175V33.7912C41.8631 32.9415 41.525 32.1269 40.9242 31.5262C40.3233 30.9254 39.5086 30.5876 38.6589 30.5868ZM33.5605 28.5721H37.2388V30.5868H33.5605V28.5721ZM40.5957 47.0164C40.5956 47.1902 40.5264 47.3568 40.4035 47.4797C40.2807 47.6026 40.114 47.6717 39.9402 47.6719H30.8594C30.6856 47.6718 30.5188 47.6027 30.3959 47.4798C30.2729 47.3569 30.2037 47.1902 30.2035 47.0164V44.4248H40.5957V47.0164ZM40.5957 43.1561H30.2039V36.372H40.5957V43.1561ZM40.5957 35.1033H30.2035V33.7923C30.2038 33.2788 30.4079 32.7864 30.7709 32.4232C31.1339 32.06 31.6261 31.8557 32.1396 31.8551H38.6589C39.1722 31.8557 39.6643 32.0599 40.0273 32.4228C40.3903 32.7858 40.5944 33.2779 40.595 33.7912L40.5957 35.1033Z" fill="#222222"/>
<path d="M41.138 15.0972C40.8495 15.0429 40.5531 15.0463 40.2659 15.1072C39.9787 15.1682 39.7065 15.2855 39.465 15.4523L37.2281 16.9895L36.5132 15.9495C36.4179 15.8109 36.2715 15.7157 36.1061 15.685C35.9407 15.6543 35.7699 15.6905 35.6312 15.7857L33.3704 17.3395C33.3017 17.3867 33.2431 17.4469 33.1977 17.5167C33.1523 17.5865 33.1212 17.6646 33.106 17.7465C33.0908 17.8284 33.0919 17.9124 33.1092 17.9939C33.1266 18.0753 33.1598 18.1526 33.207 18.2212L33.9215 19.2611L24.3229 25.8561C23.8957 26.1502 23.5604 26.5591 23.3558 27.0356L23.0173 27.8245C22.9127 28.0677 22.8701 28.3331 22.8934 28.5968C22.9166 28.8606 23.0049 29.1144 23.1504 29.3356C23.2959 29.5568 23.494 29.7384 23.727 29.8642C23.96 29.99 24.2205 30.056 24.4852 30.0563H24.549L25.4082 30.023C25.9259 30.0027 26.4273 29.8362 26.8544 29.5428L36.4526 22.9478L37.1672 23.9878C37.2143 24.0565 37.2745 24.1152 37.3443 24.1606C37.4142 24.206 37.4923 24.2372 37.5742 24.2523C37.6123 24.2592 37.651 24.2628 37.6898 24.2628C37.8179 24.2628 37.9431 24.224 38.0489 24.1516L40.31 22.5978C40.4486 22.5025 40.5436 22.3561 40.5743 22.1908C40.6049 22.0255 40.5686 21.8547 40.4734 21.7161L39.7588 20.6762L41.9961 19.1361C42.3604 18.8858 42.6424 18.5331 42.8062 18.1226C42.9701 17.7121 43.0086 17.2622 42.9167 16.8298C42.8248 16.3974 42.6068 16.002 42.2902 15.6935C41.9736 15.3851 41.5726 15.1774 41.138 15.0969V15.0972ZM26.1362 28.4945C25.9067 28.6523 25.6372 28.7419 25.3589 28.7529L24.5001 28.7862C24.444 28.7882 24.3884 28.7759 24.3383 28.7506C24.2883 28.7252 24.2454 28.6876 24.2138 28.6413C24.1817 28.5953 24.162 28.5417 24.1566 28.4859C24.1512 28.43 24.1603 28.3737 24.183 28.3224L24.5215 27.5335C24.6315 27.2774 24.8119 27.0577 25.0418 26.9001L34.6397 20.3066L35.6468 21.7723L35.7344 21.8999L26.1362 28.4945ZM37.8532 22.7442L36.7259 21.103L35.3264 19.0658L34.6126 18.0266L35.8279 17.1931L39.07 21.9118L37.8532 22.7442ZM41.2775 18.0911L39.0406 19.6279L38.9174 19.4488L37.9463 18.0356L40.1832 16.4985C40.3946 16.3534 40.655 16.2982 40.9071 16.3451C41.1593 16.392 41.3824 16.5371 41.5275 16.7485C41.6727 16.9599 41.7278 17.2204 41.681 17.4725C41.6341 17.7246 41.4889 17.9478 41.2775 18.0929V18.0911Z" fill="#222222"/>
<path d="M23.5203 32C23.4291 32.0001 23.3391 32.0197 23.2562 32.0576C23.1733 32.0955 23.0995 32.1507 23.0398 32.2196C22.7021 32.6117 21.0149 34.6279 21.0149 35.836C21.0109 36.1675 21.0728 36.4965 21.1969 36.804C21.321 37.1114 21.5049 37.3911 21.7379 37.627C21.9709 37.8628 22.2484 38.0501 22.5544 38.1779C22.8603 38.3057 23.1885 38.3715 23.5201 38.3715C23.8516 38.3715 24.1799 38.3057 24.4858 38.1779C24.7917 38.0501 25.0693 37.8628 25.3023 37.627C25.5353 37.3911 25.7192 37.1114 25.8433 36.804C25.9674 36.4965 26.0293 36.1675 26.0253 35.836C26.0253 34.6279 24.3381 32.6109 24.0004 32.22C23.9408 32.151 23.8671 32.0957 23.7843 32.0577C23.7014 32.0198 23.6114 32.0001 23.5203 32ZM23.5203 37.0731C23.1923 37.0727 22.8778 36.9422 22.6459 36.7103C22.414 36.4784 22.2835 36.164 22.2832 35.836C22.2832 35.4399 22.8629 34.4927 23.5203 33.639C24.1772 34.4927 24.757 35.4395 24.757 35.836C24.7566 36.1639 24.6262 36.4783 24.3944 36.7102C24.1625 36.9421 23.8482 37.0726 23.5203 37.0731Z" fill="#222222"/>
</g>
<defs>
<clipPath id="clip0_11_1382">
<rect width="33.8824" height="33.8824" fill="white" transform="translate(15.0588 15.0588)"/>
</clipPath>
</defs>
</svg>
