<svg xmlns="http://www.w3.org/2000/svg" width="64" height="64" viewBox="0 0 64 64" fill="none">
  <g clip-path="url(#clip0_2454_45)">
    <path fill-rule="evenodd" clip-rule="evenodd" d="M32 0C49.6711 0 64 14.3289 64 32C64 49.6711 49.6711 64 32 64C14.3289 64 0 49.6711 0 32C0 14.3289 14.3289 0 32 0Z" fill="#DA251D"/>
    <path fill-rule="evenodd" clip-rule="evenodd" d="M17.7778 28L26.5671 34.3858L23.2107 44.7182L32 38.3342L40.7893 44.72L37.4293 34.3876L46.2222 28H35.3209L32 17.7778L28.6791 28H17.7778Z" fill="#FFFF00"/>
  </g>
  <defs>
    <clipPath id="clip0_2454_45">
      <rect width="64" height="64" fill="white"/>
    </clipPath>
  </defs>
</svg>