
{
    "update": "Bạn có muốn cập nhật danh sách bài hát không?",
    "reset": "Bạn có muốn reset môi trường AR không?",
    "somethingwrong": "Lỗi ở đâu đó...",
    "cannotplay": "Bạn không thể chơi bài hát này.",
    "tryagain": "Vui lòng thử lại!",
    "tryanother": "Vui lòng thử bài khác!",
    "play": "Bắt đầu",
    "stop": "Dừng",
    "settings": "Thiết lập",
    "ok": "Đồng ý",
    "permission": "%@ không có quyền sử dụng camera.\nVui lòng thiếp lập lại để sử dụng đàn Piano trong AR",
    "arfail": "Thiết lập thất bại",
    "noconnection": "Không có kết nối mạng",
    "detecting": "Di chuyển thiết bị để nhận diện các bề mặt phẳng",
    "slow": "Di chuyển thiết bị chậm lại",
    "tapscreen": "Nhấn vào màn hình để đặt đàn piano lên mặt phẳng",
    "trackingunavailable": "Không thể xác định",
    "placed": "Chạm vào đàn hoặc lựa chọn bài hát để thường thức giai điệu",
    "insufficient": "Tìm những bề mặt có nhiều chi tiết hơn, hoặc tìm nơi có đủ điều kiện ánh sáng",
    "initialize": "Thiết lập môi trường...",
    "gotit": "Hiểu rồi",
    "cancel": "Huỷ"

}
