{
    "File_Id": "OD_039_U133_2.CEL",
    "File_URL": "https://www.ebi.ac.uk/arrayexpress/files/E-TABM-1202/E-TABM-1202.raw.1.zip/OD_039_U133_2.CEL",
    "File_CreationDate": "2011-09-21",
    "File_Source": "ArrayExpress",
    "File_Type": "Raw",
    "Dataset": {
        "Dataset_Accession": "E-TABM-1202",
        "Dataset_Description": "",
        "Dataset_SampleNumber": 101,
        "Dataset_PatientNumber": 101,
        "Dataset_CreationDate": "2011-06-09",
        "Dataset_TumorPathologyEvents": [
            {
                "Dataset_TumorPathologyEvent": {
                    "DatasetTumorPathologyEvent_Type": {
                        "ValueMeaning": "UMLS:C0439673",
                        "LabelValueMeaning": "Unknown"
                    },
                    "DatasetTumorPathologyEvent_StartDate": null,
                    "DatasetTumorPathologyEvent_DiagnosisDate": null,
                    "DatasetTumorPathologyEvent_TopographyCode": {
                        "ValueMeaning": "ICDO3:C49.9",
                        "LabelValueMeaning": "Connective, subcutaneous and other soft tissues, NOS"
                    },
                    "DatasetTumorPathologyEvent_MorphologyCode": {
                        "ValueMeaning": "ICDO3:8900/3",
                        "LabelValueMeaning": "Rhabdomyosarcoma, NOS"
                    },
                    "DatasetTumorPathologyEvent_SampleNumber": 101
                }
            }
        ],
        "Dataset_Analyses": [
            {
                "Dataset_Analysis": {
                    "DatasetAnalysis_Type": {
                        "ValueMeaning": "OSIRIS:C37-3",
                        "LabelValueMeaning": "Omic"
                    },
                    "DatasetAnalysis_SubType": "Transcriptomics",
                    "DatasetAnalysis_Date": null
                }
            }
        ],
        "Dataset_Publications": [
            {
                "Dataset_Publication": {
                    "DatasetPublication_Title": "PAX3/FOXO1 fusion gene status is the key prognostic molecular marker in rhabdomyosarcoma and significantly improves current risk stratification.",
                    "DatasetPublication_Doi": "10.1200/JCO.2011.38.5591",
                    "DatasetPublication_Pmid": "22454413",
                    "DatasetPublication_JournalName": "Journal of clinical oncology : official journal of the American Society of Clinical Oncology",
                    "DatasetPublication_Date": "2012-05-10",
                    "DatasetPublication_Volume": "30",
                    "DatasetPublication_Issue": "14",
                    "DatasetPublication_Pages": "1670-7",
                    "DatasetPublication_Order": "main",
                    "DatasetPublication_Authors": [
                        {
                            "DatasetPublication_Author": {
                                "DatasetPublicationAuthor_LastName": "Missiaglia",
                                "DatasetPublicationAuthor_FirstName": "E"
                            }
                        },
                        {
                            "DatasetPublication_Author": {
                                "DatasetPublicationAuthor_LastName": "Williamson",
                                "DatasetPublicationAuthor_FirstName": "D"
                            }
                        },
                        {
                            "DatasetPublication_Author": {
                                "DatasetPublicationAuthor_LastName": "Chisholm",
                                "DatasetPublicationAuthor_FirstName": "J"
                            }
                        },
                        {
                            "DatasetPublication_Author": {
                                "DatasetPublicationAuthor_LastName": "Wirapati",
                                "DatasetPublicationAuthor_FirstName": "P"
                            }
                        },
                        {
                            "DatasetPublication_Author": {
                                "DatasetPublicationAuthor_LastName": "Pierron",
                                "DatasetPublicationAuthor_FirstName": "G"
                            }
                        },
                        {
                            "DatasetPublication_Author": {
                                "DatasetPublicationAuthor_LastName": "Petel",
                                "DatasetPublicationAuthor_FirstName": "F"
                            }
                        },
                        {
                            "DatasetPublication_Author": {
                                "DatasetPublicationAuthor_LastName": "Concordet",
                                "DatasetPublicationAuthor_FirstName": "JP"
                            }
                        },
                        {
                            "DatasetPublication_Author": {
                                "DatasetPublicationAuthor_LastName": "Thway",
                                "DatasetPublicationAuthor_FirstName": "K"
                            }
                        },
                        {
                            "DatasetPublication_Author": {
                                "DatasetPublicationAuthor_LastName": "Oberlin",
                                "DatasetPublicationAuthor_FirstName": "O"
                            }
                        },
                        {
                            "DatasetPublication_Author": {
                                "DatasetPublicationAuthor_LastName": "Pritchard-Jones",
                                "DatasetPublicationAuthor_FirstName": "K"
                            }
                        },
                        {
                            "DatasetPublication_Author": {
                                "DatasetPublicationAuthor_LastName": "Delattre",
                                "DatasetPublicationAuthor_FirstName": "O"
                            }
                        },
                        {
                            "DatasetPublication_Author": {
                                "DatasetPublicationAuthor_LastName": "Delorenzi",
                                "DatasetPublicationAuthor_FirstName": "M"
                            }
                        },
                        {
                            "DatasetPublication_Author": {
                                "DatasetPublicationAuthor_LastName": "Shipley",
                                "DatasetPublicationAuthor_FirstName": "J"
                            }
                        }
                    ]
                }
            },
            {
                "Dataset_Publication": {
                    "DatasetPublication_Title": "Integrated transcriptional and competitive endogenous RNA networks are cross-regulated in permissive molecular environments.",
                    "DatasetPublication_Doi": "10.1073/pnas.1222509110",
                    "DatasetPublication_Pmid": "23536298",
                    "DatasetPublication_JournalName": "Proceedings of the National Academy of Sciences of the United States of America",
                    "DatasetPublication_Date": "2013-04-30",
                    "DatasetPublication_Volume": "110",
                    "DatasetPublication_Issue": "18",
                    "DatasetPublication_Pages": "7154-9",
                    "DatasetPublication_Order": "other",
                    "DatasetPublication_Authors": [
                        {
                            "DatasetPublication_Author": {
                                "DatasetPublicationAuthor_LastName": "Ala",
                                "DatasetPublicationAuthor_FirstName": "U"
                            }
                        },
                        {
                            "DatasetPublication_Author": {
                                "DatasetPublicationAuthor_LastName": "Karreth",
                                "DatasetPublicationAuthor_FirstName": "FA"
                            }
                        },
                        {
                            "DatasetPublication_Author": {
                                "DatasetPublicationAuthor_LastName": "Bosia",
                                "DatasetPublicationAuthor_FirstName": "C"
                            }
                        },
                        {
                            "DatasetPublication_Author": {
                                "DatasetPublicationAuthor_LastName": "Pagnani",
                                "DatasetPublicationAuthor_FirstName": "A"
                            }
                        },
                        {
                            "DatasetPublication_Author": {
                                "DatasetPublicationAuthor_LastName": "Taulli",
                                "DatasetPublicationAuthor_FirstName": "R"
                            }
                        },
                        {
                            "DatasetPublication_Author": {
                                "DatasetPublicationAuthor_LastName": "Léopold",
                                "DatasetPublicationAuthor_FirstName": "V"
                            }
                        },
                        {
                            "DatasetPublication_Author": {
                                "DatasetPublicationAuthor_LastName": "Tay",
                                "DatasetPublicationAuthor_FirstName": "Y"
                            }
                        },
                        {
                            "DatasetPublication_Author": {
                                "DatasetPublicationAuthor_LastName": "Provero",
                                "DatasetPublicationAuthor_FirstName": "P"
                            }
                        },
                        {
                            "DatasetPublication_Author": {
                                "DatasetPublicationAuthor_LastName": "Zecchina",
                                "DatasetPublicationAuthor_FirstName": "R"
                            }
                        },
                        {
                            "DatasetPublication_Author": {
                                "DatasetPublicationAuthor_LastName": "Pandolfi",
                                "DatasetPublicationAuthor_FirstName": "PP"
                            }
                        }
                    ]
                }
            }
        ]
    },
    "Analysis": {
        "Analysis_Type": {
            "ValueMeaning": "OSIRIS:C37-3",
            "LabelValueMeaning": "Omic"
        },
        "Analysis_Date": null,
        "Technology": {
            "Technology_TechnicalProtocol": {
                "ValueMeaning": "OSIRIS:O6-10",
                "LabelValueMeaning": "RNA microarray"
            },
            "Technology_PlatformName": {
                "ValueMeaning": "OSIRIS:O7-10",
                "LabelValueMeaning": "Affymetrix Human U133 Plus 2.0"
            },
            "Technology_PlatformAccession": "GPL29499"
        },
        "BiologicalSamples": [
            {
                "BiologicalSample": {
                    "TumorPathologyEvent": {
                        "TumorPathologyEvent_Type": {
                            "ValueMeaning": "UMLS:C0439673",
                            "LabelValueMeaning": "Unknown"
                        },
                        "TumorPathologyEvent_StartDate": null,
                        "TumorPathologyEvent_DiagnosisDate": null,
                        "TumorPathologyEvent_TopographyCode": {
                            "ValueMeaning": "ICDO3:C49.0",
                            "LabelValueMeaning": "Connective, subcutaneous and other soft tissues of head, face, and neck"
                        },
                        "TumorPathologyEvent_MorphologyCode": {
                            "level_0": {
                                "ValueMeaning": "ICDO3:8900/3",
                                "LabelValueMeaning": "Rhabdomyosarcoma, NOS"
                            },
                            "level_1": {
                                "ValueMeaning": "ICDO3:8920/3",
                                "LabelValueMeaning": "Alveolar rhabdomyosarcoma"
                            }
                        },
                        "TumorPathologyEvent_StadeType": {
                            "ValueMeaning": "{custom_code}",
                            "LabelValueMeaning": "IRS_TNM"
                        },
                        "TumorPathologyEvent_StadeValue": {
                            "ValueMeaning": "{custom_code}",
                            "LabelValueMeaning": "4"
                        },
                        "TumorPathologyEvent_OverallSurvivalTime": {
                            "TimeUnit": "years",
                            "ValueMeaning": 1.33
                        }
                    },
                    "BiologicalSample_ExternalAccession": "E-TABM-1202_RMS039_1",
                    "BiologicalSample_CollectDate": null,
                    "BiologicalSample_TopographyCode": {
                        "ValueMeaning": "ICDO3:C49.0",
                        "LabelValueMeaning": "Connective, subcutaneous and other soft tissues of head, face, and neck"
                    },
                    "BiologicalSample_Nature": {
                        "ValueMeaning": "UMLS:C1548793",
                        "LabelValueMeaning": "Frozen Specimen"
                    },
                    "BiologicalSample_Origin": {
                        "ValueMeaning": "OSIRIS:O59-2",
                        "LabelValueMeaning": "Tumoral"
                    },
                    "Patient": {
                        "Patient_Id": "RMS039",
                        "Patient_Age": 2.5,
                        "Patient_Gender": {
                            "ValueMeaning": "HL7:M",
                            "LabelValueMeaning": "Male"
                        },
                        "Patient_BirthDate": null,
                        "Patient_ProviderCenterId": null,
                        "Patient_OriginCenterId": null,
                        "Patient_LastNewsDate": null,
                        "Patient_LastNewsStatus": {
                            "ValueMeaning": "UMLS:C1546956",
                            "LabelValueMeaning": "Patient Outcome - Died"
                        }
                    }
                }
            }
        ],
        "Biomarkers": [
            {
                "Biomarker": {
                    "Biomarker_Code": {
                        "ValueMeaning": "{custom_code}",
                        "LabelValueMeaning": "Pax3 chromosomal translocation"
                    },
                    "Biomarker_Value": "Negative"
                }
            },
            {
                "Biomarker": {
                    "Biomarker_Code": {
                        "ValueMeaning": "{custom_code}",
                        "LabelValueMeaning": "Pax7 chromosomal translocation"
                    },
                    "Biomarker_Value": "Negative"
                }
            },
            {
                "Biomarker": {
                    "Biomarker_Code": {
                        "ValueMeaning": "{custom_code}",
                        "LabelValueMeaning": "Ncoa1 chromosomal translocation"
                    },
                    "Biomarker_Value": "Negative"
                }
            }
        ]
    }
}