{
    "File_Id": "GSM608959_Barr_Amp_SNP00105B_PAIXXY_Mapping50K_Xba240.CEL.gz",
    "File_URL": "https://ftp.ncbi.nlm.nih.gov/geo/samples/GSM608nnn/GSM608959/suppl/GSM608959_Barr_Amp_SNP00105B_PAIXXY_Mapping50K_Xba240.CEL.gz",
    "File_CreationDate": "2010-10-15",
    "File_Source": "GEO",
    "File_Type": "Raw",
    "Dataset": {
        "Dataset_Accession": "GSE24715",
        "Dataset_Description": "Genomic and clinical analyses of major amplification events in alveolar rhabdomyosarcoma Affymetrix SNP 50K XbaI chips were used to anaylyze 57 alveolar rhabdomyosarcoma samples and selected cases were further analyzed using Affymetrix SNP 250K StyI chips",
        "Dataset_SampleNumber": 64,
        "Dataset_PatientNumber": 57,
        "Dataset_CreationDate": "2010-10-15",
        "Dataset_TumorPathologyEvents": [
            {
                "Dataset_TumorPathologyEvent": {
                    "DatasetTumorPathologyEvent_Type": {
                        "ValueMeaning": "UMLS:C0439673",
                        "LabelValueMeaning": "Unknown"
                    },
                    "DatasetTumorPathologyEvent_StartDate": null,
                    "DatasetTumorPathologyEvent_DiagnosisDate": null,
                    "DatasetTumorPathologyEvent_TopographyCode": {
                        "ValueMeaning": "ICDO3:C49.9",
                        "LabelValueMeaning": "Connective, subcutaneous and other soft tissues, NOS"
                    },
                    "DatasetTumorPathologyEvent_MorphologyCode": {
                        "ValueMeaning": "ICDO3:8900/3",
                        "LabelValueMeaning": "Rhabdomyosarcoma, NOS"
                    },
                    "DatasetTumorPathologyEvent_SampleNumber": 64
                }
            }
        ],
        "Dataset_Analyses": [
            {
                "Dataset_Analysis": {
                    "DatasetAnalysis_Type": {
                        "ValueMeaning": "OSIRIS:C37-3",
                        "LabelValueMeaning": "Omic"
                    },
                    "DatasetAnalysis_SubType": "Genomics",
                    "DatasetAnalysis_Date": null
                }
            }
        ],
        "Dataset_Publications": []
    },
    "Analysis": {
        "Analysis_Type": {
            "ValueMeaning": "OSIRIS:C37-3",
            "LabelValueMeaning": "Omic"
        },
        "Analysis_Date": null,
        "Technology": {
            "Technology_TechnicalProtocol": {
                "ValueMeaning": "OSIRIS:O6-3",
                "LabelValueMeaning": "DNA microarray"
            },
            "Technology_PlatformName": {
                "ValueMeaning": "OSIRIS:O7-OTH",
                "LabelValueMeaning": "Affymetrix Human Mapping 50K Xba240 SNP Array"
            },
            "Technology_PlatformAccession": "GPL2005"
        },
        "BiologicalSamples": [
            {
                "BiologicalSample": {
                    "TumorPathologyEvent": {
                        "TumorPathologyEvent_Type": {
                            "ValueMeaning": "UMLS:C0439673",
                            "LabelValueMeaning": "Unknown"
                        },
                        "TumorPathologyEvent_StartDate": null,
                        "TumorPathologyEvent_DiagnosisDate": null,
                        "TumorPathologyEvent_TopographyCode": {
                            "ValueMeaning": "ICDO3:C49.9",
                            "LabelValueMeaning": "Connective, subcutaneous and other soft tissues, NOS"
                        },
                        "TumorPathologyEvent_MorphologyCode": {
                            "level_0": {
                                "ValueMeaning": "ICDO3:8900/3",
                                "LabelValueMeaning": "Rhabdomyosarcoma, NOS"
                            },
                            "level_1": {
                                "ValueMeaning": "ICDO3:8920/3",
                                "LabelValueMeaning": "Alveolar rhabdomyosarcoma"
                            }
                        }
                    },
                    "BiologicalSample_ExternalAccession": "GSM608959",
                    "BiologicalSample_CollectDate": null,
                    "BiologicalSample_TopographyCode": {
                        "ValueMeaning": "ICDO3:C49.9",
                        "LabelValueMeaning": "Connective, subcutaneous and other soft tissues, NOS"
                    },
                    "BiologicalSample_Nature": {
                        "ValueMeaning": "UMLS:C0439673",
                        "LabelValueMeaning": "Unknown"
                    },
                    "BiologicalSample_Origin": {
                        "ValueMeaning": "OSIRIS:O59-2",
                        "LabelValueMeaning": "Tumoral"
                    },
                    "Patient": {
                        "Patient_Id": "GSE24715_GSM608959",
                        "Patient_Age": null,
                        "Patient_Gender": {
                            "ValueMeaning": null,
                            "LabelValueMeaning": null
                        },
                        "Patient_BirthDate": null,
                        "Patient_ProviderCenterId": null,
                        "Patient_OriginCenterId": null,
                        "Patient_LastNewsDate": null,
                        "Patient_LastNewsStatus": {
                            "ValueMeaning": null,
                            "LabelValueMeaning": null
                        }
                    }
                }
            }
        ],
        "Biomarkers": [
            {
                "Biomarker": {
                    "Biomarker_Code": {
                        "ValueMeaning": null,
                        "LabelValueMeaning": null
                    },
                    "Biomarker_Value": null
                }
            }
        ]
    }
}