{
    "mappings": {
        "dynamic": "false",
        "date_detection": true,
        "properties": {
            "File_Id": {
                "type": "keyword",
                "copy_to": [
                    "file_autocomplete"
                ]
            },
            "File_URL": {
                "type": "keyword"
            },
            "File_CreationDate": {
                "type": "date"
            },
            "File_Source": {
                "type": "keyword"
            },
            "File_Type": {
                "type": "keyword"
            },
            "Dataset": {
                "properties": {
                    "Dataset_Accession": {
                        "type": "keyword"
                    },
                    "Dataset_Description": {
                        "type": "text"
                    },
                    "Dataset_SampleNumber": {
                        "type": "integer"
                    },
                    "Dataset_PatientNumber": {
                        "type": "integer"
                    },
                    "Dataset_CreationDate": {
                        "type": "date",
                        "format": "yyyy-MM-dd||yyyy-MM-dd HH:mm:ss.SSSSSS||yyyy-MM-dd HH:mm:ss||yyyy-MM-dd'T'HH:mm:ss.SSSSSS+HH:mm"
                    },
                    "Dataset_TumorPathologyEvents": {
                        "type": "nested",
                        "properties": {
                            "Dataset_TumorPathologyEvent": {
                                "properties": {
                                    "DatasetTumorPathologyEvent_Type": {
                                        "properties": {
                                            "ValueMeaning": {
                                                "type": "keyword"
                                            },
                                            "LabelValueMeaning": {
                                                "type": "keyword"
                                            }
                                        }
                                    },
                                    "DatasetTumorPathologyEvent_StartDate": {
                                        "type": "date"
                                    },
                                    "DatasetTumorPathologyEvent_DiagnosisDate": {
                                        "type": "date"
                                    },
                                    "DatasetTumorPathologyEvent_TopographyCode": {
                                        "properties": {
                                            "ValueMeaning": {
                                                "type": "keyword"
                                            },
                                            "LabelValueMeaning": {
                                                "type": "keyword"
                                            }
                                        }
                                    },
                                    "DatasetTumorPathologyEvent_MorphologyCode": {
                                        "properties": {
                                            "ValueMeaning": {
                                                "type": "keyword"
                                            },
                                            "LabelValueMeaning": {
                                                "type": "keyword"
                                            }
                                        }
                                    },
                                    "DatasetTumorPathologyEvent_SampleNumber": {
                                        "type": "integer"
                                    }
                                }
                            }
                        }
                    },
                    "Dataset_Analyses": {
                        "type": "nested",
                        "properties": {
                            "Dataset_Analysis": {
                                "properties": {
                                    "DatasetAnalysis_Type": {
                                        "properties": {
                                            "ValueMeaning": {
                                                "type": "keyword"
                                            },
                                            "LabelValueMeaning": {
                                                "type": "keyword"
                                            }
                                        }
                                    },
                                    "DatasetAnalysis_SubType": {
                                        "type": "keyword"
                                    },
                                    "DatasetAnalysis_Date": {
                                        "type": "date"
                                    }
                                }
                            }
                        }
                    },
                    "Dataset_Publications": {
                        "type": "nested",
                        "properties": {
                            "Dataset_Publication": {
                                "properties": {
                                    "DatasetPublication_Title": {
                                        "type": "keyword"
                                    },
                                    "DatasetPublication_Doi": {
                                        "type": "keyword"
                                    },
                                    "DatasetPublication_Pmid": {
                                        "type": "keyword"
                                    },
                                    "DatasetPublication_JournalName": {
                                        "type": "keyword"
                                    },
                                    "DatasetPublication_Date": {
                                        "type": "date"
                                    },
                                    "DatasetPublication_Volume": {
                                        "type": "keyword"
                                    },
                                    "DatasetPublication_Issue": {
                                        "type": "keyword"
                                    },
                                    "DatasetPublication_Pages": {
                                        "type": "keyword"
                                    },
                                    "DatasetPublication_Order": {
                                        "type": "keyword"
                                    },
                                    "DatasetPublication_Authors": {
                                        "type": "nested",
                                        "properties": {
                                            "DatasetPublication_Author": {
                                                "properties": {
                                                    "DatasetPublicationAuthor_LastName": {
                                                        "type": "keyword"
                                                    },
                                                    "DatasetPublicationAuthor_FirstName": {
                                                        "type": "keyword"
                                                    }
                                                }
                                            }
                                        }
                                    }
                                }
                            }
                        }
                    }
                }
            },
            "Analysis": {
                "properties": {
                    "Analysis_Type": {
                        "properties": {
                            "ValueMeaning": {
                                "type": "keyword"
                            },
                            "LabelValueMeaning": {
                                "type": "keyword"
                            }
                        }
                    },
                    "Analysis_Date": {
                        "type": "date",
                        "format": "yyyy-MM-dd||yyyy-MM-dd HH:mm:ss.SSSSSS||yyyy-MM-dd HH:mm:ss||yyyy-MM-dd'T'HH:mm:ss.SSSSSS+HH:mm"
                    },
                    "Technology": {
                        "properties": {
                            "Technology_TechnicalProtocol": {
                                "properties": {
                                    "ValueMeaning": {
                                        "type": "keyword"
                                    },
                                    "LabelValueMeaning": {
                                        "type": "keyword"
                                    }
                                }
                            },
                            "Technology_PlatformName": {
                                "properties": {
                                    "ValueMeaning": {
                                        "type": "keyword"
                                    },
                                    "LabelValueMeaning": {
                                        "type": "keyword"
                                    }
                                }
                            },
                            "Technology_PlatformAccession": {
                                "type": "keyword"
                            }
                        }
                    },
                    "BiologicalSamples": {
                        "type": "nested",
                        "properties": {
                            "BiologicalSample": {
                                "properties": {
                                    "TumorPathologyEvent": {
                                        "properties": {
                                            "TumorPathologyEvent_Type": {
                                                "properties": {
                                                    "ValueMeaning": {
                                                        "type": "keyword"
                                                    },
                                                    "LabelValueMeaning": {
                                                        "type": "keyword"
                                                    }
                                                }
                                            },
                                            "TumorPathologyEvent_StartDate": {
                                                "type": "date"
                                            },
                                            "TumorPathologyEvent_DiagnosisDate": {
                                                "type": "date"
                                            },
                                            "TumorPathologyEvent_TopographyCode": {
                                                "properties": {
                                                    "ValueMeaning": {
                                                        "type": "keyword"
                                                    },
                                                    "LabelValueMeaning": {
                                                        "type": "keyword"
                                                    }
                                                }
                                            },
                                            "TumorPathologyEvent_MorphologyCode": {
                                                "properties": {
                                                    "level_0": {
                                                        "properties": {
                                                            "ValueMeaning": {
                                                                "type": "keyword"
                                                            },
                                                            "LabelValueMeaning": {
                                                                "type": "keyword"
                                                            }
                                                        }
                                                    },
                                                    "level_1": {
                                                        "properties": {
                                                            "ValueMeaning": {
                                                                "type": "keyword"
                                                            },
                                                            "LabelValueMeaning": {
                                                                "type": "keyword"
                                                            }
                                                        }
                                                    }
                                                }
                                            },
                                            "TumorPathologyEvent_StadeType": {
                                                "properties": {
                                                    "ValueMeaning": {
                                                        "type": "keyword"
                                                    },
                                                    "LabelValueMeaning": {
                                                        "type": "keyword"
                                                    }
                                                }
                                            },
                                            "TumorPathologyEvent_StadeValue": {
                                                "properties": {
                                                    "ValueMeaning": {
                                                        "type": "keyword"
                                                    },
                                                    "LabelValueMeaning": {
                                                        "type": "keyword"
                                                    }
                                                }
                                            },
                                            "TumorPathologyEvent_OverallSurvivalTime": {
                                                "properties": {
                                                    "TimeUnit": {
                                                        "type": "keyword"
                                                    },
                                                    "ValueMeaning": {
                                                        "type": "keyword"
                                                    }
                                                }
                                            }
                                        }
                                    },
                                    "BiologicalSample_ExternalAccession": {
                                        "type": "keyword"
                                    },
                                    "BiologicalSample_CollectDate": {
                                        "type": "date"
                                    },
                                    "BiologicalSample_TopographyCode": {
                                        "properties": {
                                            "ValueMeaning": {
                                                "type": "keyword"
                                            },
                                            "LabelValueMeaning": {
                                                "type": "keyword"
                                            }
                                        }
                                    },
                                    "BiologicalSample_Nature": {
                                        "properties": {
                                            "ValueMeaning": {
                                                "type": "keyword"
                                            },
                                            "LabelValueMeaning": {
                                                "type": "keyword"
                                            }
                                        }
                                    },
                                    "BiologicalSample_Origin": {
                                        "properties": {
                                            "ValueMeaning": {
                                                "type": "keyword"
                                            },
                                            "LabelValueMeaning": {
                                                "type": "keyword"
                                            }
                                        }
                                    },
                                    "Patient": {
                                        "properties": {
                                            "Patient_Id": {
                                                "type": "keyword"
                                            },
                                            "Patient_Age": {
                                                "type": "double"
                                            },
                                            "Patient_Gender": {
                                                "properties": {
                                                    "ValueMeaning": {
                                                        "type": "keyword"
                                                    },
                                                    "LabelValueMeaning": {
                                                        "type": "keyword"
                                                    }
                                                }
                                            },
                                            "Patient_BirthDate": {
                                                "type": "date"
                                            },
                                            "Patient_ProviderCenterId": {
                                                "type": "keyword",
                                                "null_value": "No data"
                                            },
                                            "Patient_OriginCenterId": {
                                                "type": "keyword",
                                                "null_value": "No data"
                                            },
                                            "Patient_LastNewsDate": {
                                                "type": "date"
                                            },
                                            "Patient_LastNewsStatus": {
                                                "properties": {
                                                    "ValueMeaning": {
                                                        "type": "keyword"
                                                    },
                                                    "LabelValueMeaning": {
                                                        "type": "keyword"
                                                    }
                                                }
                                            }
                                        }
                                    }
                                }
                            }
                        }
                    },
                    "Biomarkers": {
                        "type": "nested",
                        "properties": {
                            "Biomarker": {
                                "properties": {
                                    "Biomarker_Code": {
                                        "properties": {
                                            "ValueMeaning": {
                                                "type": "keyword"
                                            },
                                            "LabelValueMeaning": {
                                                "type": "keyword"
                                            }
                                        }
                                    },
                                    "Biomarker_Value": {
                                        "type": "keyword"
                                    }
                                }
                            }
                        }
                    }
                }
            }
        }
    }
}