<?xml version="1.0" encoding="UTF-8" standalone="no"?>
<!-- Created with Inkscape (http://www.inkscape.org/) -->

<svg
   xmlns:dc="http://purl.org/dc/elements/1.1/"
   xmlns:cc="http://creativecommons.org/ns#"
   xmlns:rdf="http://www.w3.org/1999/02/22-rdf-syntax-ns#"
   xmlns:svg="http://www.w3.org/2000/svg"
   xmlns="http://www.w3.org/2000/svg"
   xmlns:sodipodi="http://sodipodi.sourceforge.net/DTD/sodipodi-0.dtd"
   xmlns:inkscape="http://www.inkscape.org/namespaces/inkscape"
   width="255"
   height="255"
   viewBox="0 0 255 255"
   version="1.1"
   id="svg8"
   inkscape:version="0.92.3 (2405546, 2018-03-11)"
   sodipodi:docname="favicon.svg"
   inkscape:export-filename="/home/maso/git/angular-material-home/apps/webpich-home/app/favicon.svg.png"
   inkscape:export-xdpi="96.376472"
   inkscape:export-ydpi="96.376472">
  <defs
     id="defs2">
    <inkscape:perspective
       id="perspective846"
       inkscape:persp3d-origin="396.8504 : 374.17322 : 1"
       inkscape:vp_z="793.70081 : 561.25983 : 1"
       inkscape:vp_y="0 : 3779.5275 : 0"
       inkscape:vp_x="0 : 561.25983 : 1"
       sodipodi:type="inkscape:persp3d" />
  </defs>
  <sodipodi:namedview
     id="base"
     pagecolor="#ffffff"
     bordercolor="#666666"
     borderopacity="1.0"
     inkscape:pageopacity="0.0"
     inkscape:pageshadow="2"
     inkscape:zoom="0.7"
     inkscape:cx="-202.76928"
     inkscape:cy="-42.178542"
     inkscape:document-units="mm"
     inkscape:current-layer="layer1"
     showgrid="false"
     inkscape:window-width="1366"
     inkscape:window-height="744"
     inkscape:window-x="0"
     inkscape:window-y="24"
     inkscape:window-maximized="1"
     showguides="true"
     inkscape:guide-bbox="true" />
  <metadata
     id="metadata5">
    <rdf:RDF>
      <cc:Work
         rdf:about="">
        <dc:format>image/svg+xml</dc:format>
        <dc:type
           rdf:resource="http://purl.org/dc/dcmitype/StillImage" />
        <dc:title />
      </cc:Work>
    </rdf:RDF>
  </metadata>
  <g
     inkscape:label="Layer 1"
     inkscape:groupmode="layer"
     id="layer1">
    <g
       id="g950"
       transform="matrix(2.0121576,0,0,2.4377072,-35.491859,-283.56822)"
       style="stroke-width:0.45152128">
      <path
         style="fill:#333333;fill-opacity:1;stroke-width:2.02915287;stroke-miterlimit:4;stroke-dasharray:none"
         d="M 81.66705,116.3258 H 60.646711 l 16.972524,78.87711 h 23.278555 z"
         id="rect866-2-7-5"
         inkscape:connector-curvature="0"
         sodipodi:nodetypes="ccccc" />
      <text
         xml:space="preserve"
         style="font-style:normal;font-weight:normal;font-size:82.09265137px;line-height:1.25;font-family:sans-serif;letter-spacing:0px;word-spacing:0px;fill:#000000;fill-opacity:1;stroke:none;stroke-width:0.92666453"
         x="-624.47052"
         y="259.37415"
         id="text864"
         transform="scale(0.67382429,1.4840664)"><tspan
           sodipodi:role="line"
           id="tspan862"
           x="-624.47052"
           y="334.86002"
           style="stroke-width:0.92666453" /></text>
      <path
         sodipodi:nodetypes="ccccc"
         inkscape:connector-curvature="0"
         id="rect894"
         d="M 81.66705,116.3258 H 60.646711 l 17.077723,13.0962 h 23.635896 z"
         style="fill:#1a1a1a;fill-opacity:1;stroke:#000000;stroke-width:0;stroke-miterlimit:4;stroke-dasharray:none;stroke-opacity:1" />
      <path
         style="fill:#808080;fill-opacity:1;stroke-width:1.36074078;stroke-miterlimit:4;stroke-dasharray:none"
         d="M 77.152209,220.93229 H 53.873652 L 34.611231,195.20291 H 57.74982 Z"
         id="rect866-5-8-0-3-8"
         inkscape:connector-curvature="0"
         sodipodi:nodetypes="ccccc" />
      <path
         style="fill:#666666;fill-opacity:1;stroke-width:1.36074078;stroke-miterlimit:4;stroke-dasharray:none"
         d="M 120.16021,220.93229 H 96.881656 L 77.619235,195.20291 h 23.138585 z"
         id="rect866-5-8-0-3-8-3"
         inkscape:connector-curvature="0"
         sodipodi:nodetypes="ccccc" />
      <path
         style="fill:#000000;fill-opacity:1;stroke-width:2.02915287;stroke-miterlimit:4;stroke-dasharray:none"
         d="M 77.724434,129.422 H 101.36033 L 77.152209,220.93229 H 53.873652 Z"
         id="rect866-2"
         inkscape:connector-curvature="0"
         sodipodi:nodetypes="ccccc" />
      <path
         style="fill:#000000;fill-opacity:1;stroke-width:2.02915287;stroke-miterlimit:4;stroke-dasharray:none"
         d="m 120.73244,129.422 h 23.6359 l -24.20813,91.51029 H 96.881653 Z"
         id="rect866-2-7"
         inkscape:connector-curvature="0"
         sodipodi:nodetypes="ccccc" />
      <path
         style="fill:#333333;fill-opacity:1;stroke-width:2.02915287;stroke-miterlimit:4;stroke-dasharray:none"
         d="M 38.659045,116.3258 H 17.638707 l 16.972524,78.87711 h 23.278554 z"
         id="rect866-2-7-5-3"
         inkscape:connector-curvature="0"
         sodipodi:nodetypes="ccccc" />
    </g>
  </g>
</svg>
