<?xml version="1.0" encoding="UTF-8" standalone="no"?>
<!-- Generator: Adobe Illustrator 19.0.0, SVG Export Plug-In . SVG Version: 6.00 Build 0)  -->

<svg
   xmlns:dc="http://purl.org/dc/elements/1.1/"
   xmlns:cc="http://creativecommons.org/ns#"
   xmlns:rdf="http://www.w3.org/1999/02/22-rdf-syntax-ns#"
   xmlns:svg="http://www.w3.org/2000/svg"
   xmlns="http://www.w3.org/2000/svg"
   xmlns:sodipodi="http://sodipodi.sourceforge.net/DTD/sodipodi-0.dtd"
   xmlns:inkscape="http://www.inkscape.org/namespaces/inkscape"
   version="1.1"
   id="Capa_1"
   x="0px"
   y="0px"
   viewBox="0 0 58 58"
   style="enable-background:new 0 0 58 58;"
   xml:space="preserve"
   sodipodi:docname="content.svg"
   inkscape:version="0.92.0 r"><metadata
     id="metadata43"><rdf:RDF><cc:Work
         rdf:about=""><dc:format>image/svg+xml</dc:format><dc:type
           rdf:resource="http://purl.org/dc/dcmitype/StillImage" /></cc:Work></rdf:RDF></metadata><defs
     id="defs41" /><sodipodi:namedview
     pagecolor="#ffffff"
     bordercolor="#666666"
     borderopacity="1"
     objecttolerance="10"
     gridtolerance="10"
     guidetolerance="10"
     inkscape:pageopacity="0"
     inkscape:pageshadow="2"
     inkscape:window-width="1366"
     inkscape:window-height="703"
     id="namedview39"
     showgrid="false"
     inkscape:measure-start="0,0"
     inkscape:measure-end="0,0"
     inkscape:zoom="4.0689655"
     inkscape:cx="0.61440678"
     inkscape:cy="29"
     inkscape:window-x="0"
     inkscape:window-y="0"
     inkscape:window-maximized="1"
     inkscape:current-layer="Capa_1" /><g
     id="g8" /><g
     id="g10" /><g
     id="g12" /><g
     id="g14" /><g
     id="g16" /><g
     id="g18" /><g
     id="g20" /><g
     id="g22" /><g
     id="g24" /><g
     id="g26" /><g
     id="g28" /><g
     id="g30" /><g
     id="g32" /><g
     id="g34" /><g
     id="g36" /><rect
     x="0.35593259"
     y="13.894068"
     style="fill:#556080;fill-opacity:1;stroke-width:0.73982197"
     width="26.305086"
     height="29.29661"
     id="rect2-3" /><rect
     x="32.805088"
     y="14.139831"
     style="fill:#3b4256;fill-opacity:1;stroke-width:0.71975142"
     width="25.322035"
     height="28.805084"
     id="rect2-6" /><rect
     x="6.1355934"
     y="11.31356"
     style="fill:#7383bf;stroke-width:1.06345248"
     width="46.211864"
     height="34.457626"
     id="rect2" /><path
     sodipodi:type="star"
     style="opacity:1;fill:#ffffff;fill-opacity:1;stroke:#6e6e6e;stroke-opacity:1"
     id="path4569"
     sodipodi:sides="3"
     sodipodi:cx="-47.677971"
     sodipodi:cy="21.627119"
     sodipodi:r1="14.747811"
     sodipodi:r2="7.3739052"
     sodipodi:arg1="-0.016665124"
     sodipodi:arg2="1.0305324"
     inkscape:flatsided="true"
     inkscape:rounded="0"
     inkscape:randomized="0"
     d="M -32.932207,21.381356 -54.838016,34.520206 -55.263689,8.9797947 Z"
     inkscape:transform-center-x="-0.66512053"
     inkscape:transform-center-y="0.048045867"
     transform="matrix(0.18578648,0,0,0.39098607,61.245896,20.035168)" /><path
     sodipodi:type="star"
     style="opacity:1;fill:#ffffff;fill-opacity:1;stroke:#6e6e6e;stroke-opacity:1"
     id="path4569-3"
     sodipodi:sides="3"
     sodipodi:cx="-47.677971"
     sodipodi:cy="21.627119"
     sodipodi:r1="14.747811"
     sodipodi:r2="7.3739052"
     sodipodi:arg1="-0.016665124"
     sodipodi:arg2="1.0305324"
     inkscape:flatsided="true"
     inkscape:rounded="0"
     inkscape:randomized="0"
     d="M -32.932207,21.381356 -54.838016,34.520206 -55.263689,8.9797947 Z"
     inkscape:transform-center-x="0.66512053"
     inkscape:transform-center-y="0.048045867"
     transform="matrix(-0.18578648,0,0,0.39098607,-2.6646543,20.035168)" /></svg>