<?xml version="1.0" encoding="UTF-8" standalone="no"?>
<!-- Created with Inkscape (http://www.inkscape.org/) -->
<svg xmlns:dc="http://purl.org/dc/elements/1.1/" xmlns:cc="http://creativecommons.org/ns#" xmlns:rdf="http://www.w3.org/1999/02/22-rdf-syntax-ns#" xmlns:svg="http://www.w3.org/2000/svg" xmlns="http://www.w3.org/2000/svg" xmlns:xlink="http://www.w3.org/1999/xlink" xmlns:sodipodi="http://sodipodi.sourceforge.net/DTD/sodipodi-0.dtd" xmlns:inkscape="http://www.inkscape.org/namespaces/inkscape" height="830.75256" id="svg1" inkscape:version="0.46" sodipodi:docbase="/home/andy/Desktop/etiquette-icons-0.4/scalable/mimetypes" sodipodi:docname="mime-application-pdf.svg" sodipodi:version="0.32" width="759.80603" inkscape:output_extension="org.inkscape.output.svg.inkscape" version="1.0">
  <metadata id="metadata3">
    <rdf:RDF>
      <cc:Work rdf:about="">
        <dc:title>Etiquette Icons</dc:title>
        <dc:description/>
        <dc:subject>
          <rdf:Bag>
            <rdf:li>hash</rdf:li>
            <rdf:li/>
            <rdf:li>mime-types</rdf:li>
            <rdf:li>computer</rdf:li>
            <rdf:li>icons</rdf:li>
          </rdf:Bag>
        </dc:subject>
        <dc:publisher>
          <cc:Agent rdf:about="http://www.openclipart.org">
            <dc:title>Andy Fitzsimon</dc:title>
          </cc:Agent>
        </dc:publisher>
        <dc:creator>
          <cc:Agent>
            <dc:title>Andy Fitzsimon</dc:title>
          </cc:Agent>
        </dc:creator>
        <dc:rights>
          <cc:Agent>
            <dc:title>Andy Fitzsimon</dc:title>
          </cc:Agent>
        </dc:rights>
        <dc:date/>
        <dc:format>image/svg+xml</dc:format>
        <dc:type rdf:resource="http://purl.org/dc/dcmitype/StillImage"/>
        <cc:license rdf:resource="http://web.resource.org/cc/PublicDomain"/>
        <dc:language>en</dc:language>
      </cc:Work>
      <cc:License rdf:about="http://web.resource.org/cc/PublicDomain">
        <cc:permits rdf:resource="http://web.resource.org/cc/Reproduction"/>
        <cc:permits rdf:resource="http://web.resource.org/cc/Distribution"/>
        <cc:permits rdf:resource="http://web.resource.org/cc/DerivativeWorks"/>
      </cc:License>
    </rdf:RDF>
  </metadata>
  <defs id="defs3">
    <inkscape:perspective sodipodi:type="inkscape:persp3d" inkscape:vp_x="0 : 80 : 1" inkscape:vp_y="0 : 1000 : 0" inkscape:vp_z="160 : 80 : 1" inkscape:persp3d-origin="80 : 53.333333 : 1" id="perspective60"/>
    <radialGradient cx="0.5" cy="0.5" fx="0.5" fy="0.14942528" id="radialGradient864" r="0.5" xlink:href="#linearGradient853"/>
    <linearGradient id="linearGradient841">
      <stop id="stop842" offset="0.00000000" style="stop-color:#ffffff;stop-opacity:1.0000000;"/>
      <stop id="stop843" offset="1.0000000" style="stop-color:#ffffff;stop-opacity:0.00000000;"/>
    </linearGradient>
    <linearGradient id="linearGradient1290">
      <stop id="stop1291" offset="0.0000000" style="stop-color:#df421e;stop-opacity:1.0000000;"/>
      <stop id="stop1292" offset="1.0000000" style="stop-color:#990000;stop-opacity:1.0000000;"/>
    </linearGradient>
    <linearGradient id="linearGradient846">
      <stop id="stop847" offset="0.00000000" style="stop-color:#e7e7e7;stop-opacity:1.0000000;"/>
      <stop id="stop848" offset="1.0000000" style="stop-color:#a5a5a5;stop-opacity:1.0000000;"/>
    </linearGradient>
    <linearGradient id="linearGradient853">
      <stop id="stop854" offset="0.00000000" style="stop-color:#000000;stop-opacity:0.29752067;"/>
      <stop id="stop855" offset="1.0000000" style="stop-color:#000000;stop-opacity:0.00000000;"/>
    </linearGradient>
    <radialGradient cx="0.5" cy="0.5" fx="0.50704223" fy="0.29885057" id="radialGradient861" r="0.5" xlink:href="#linearGradient853"/>
    <linearGradient id="linearGradient1507">
      <stop id="stop1508" offset="0.0000000" style="stop-color:#000000;stop-opacity:0.095505618;"/>
      <stop id="stop1510" offset="1.0000000" style="stop-color:#000000;stop-opacity:0.0000000;"/>
    </linearGradient>
    <linearGradient id="linearGradient1501">
      <stop id="stop1502" offset="0.0000000" style="stop-color:#ffffff;stop-opacity:1.0000000;"/>
      <stop id="stop1504" offset="1.0000000" style="stop-color:#ffffff;stop-opacity:0.0000000;"/>
    </linearGradient>
    <linearGradient id="linearGradient1492">
      <stop id="stop1493" offset="0.0000000" style="stop-color:#dadada;stop-opacity:1.0000000;"/>
      <stop id="stop1496" offset="0.34923077" style="stop-color:#f1f1f1;stop-opacity:1.0000000;"/>
      <stop id="stop1494" offset="1.0000000" style="stop-color:#f0f0f0;stop-opacity:1.0000000;"/>
    </linearGradient>
    <linearGradient id="linearGradient1495" x1="728.96643" x2="351.7063" xlink:href="#linearGradient1492" y1="230.07422" y2="689.86005" gradientTransform="matrix(1.5665693,0,0,1.7161545,-471.13869,-223.03072)" gradientUnits="userSpaceOnUse"/>
    <linearGradient id="linearGradient1497" x1="741.63898" x2="622.33325" xlink:href="#linearGradient1492" y1="169.4436" y2="287.73825" gradientTransform="matrix(1.5663522,0,0,1.7163924,-471.13869,-223.03072)" gradientUnits="userSpaceOnUse"/>
    <linearGradient id="linearGradient1499" x1="687.96375" x2="330.88034" xlink:href="#linearGradient1501" y1="236.12772" y2="418.53635" gradientTransform="matrix(1.6216357,0,0,1.6578785,-471.13869,-223.03072)" gradientUnits="userSpaceOnUse"/>
    <linearGradient id="linearGradient1506" x1="201.38963" x2="547.80804" xlink:href="#linearGradient1507" y1="843.20789" y2="383.76529" gradientTransform="scale(0.9446888,1.0585496)" gradientUnits="userSpaceOnUse"/>
    <linearGradient id="linearGradient1556" x1="42.438137" x2="129.23233" xlink:href="#linearGradient1290" y1="30.568512" y2="109.71216" gradientTransform="matrix(5.0852019,0,0,6.0061319,-77.6727,-34.807199)" gradientUnits="userSpaceOnUse"/>
    <radialGradient cx="0.5" cy="0.89285713" fx="0.5411765" fy="3.52" id="radialGradient856" r="0.5460667" xlink:href="#linearGradient841"/>
    <linearGradient id="linearGradient1944" x1="22.405666" x2="78.384125" xlink:href="#linearGradient853" y1="22.397957" y2="-106.66177" gradientTransform="scale(0.9208103,1.086)" gradientUnits="userSpaceOnUse"/>
    <linearGradient id="linearGradient852" xlink:href="#linearGradient841"/>
    <linearGradient id="linearGradient844" x1="6.8169212e-18" x2="1" xlink:href="#linearGradient841" y1="0.5" y2="0.5"/>
    <linearGradient id="linearGradient845" x1="1.3633842e-17" x2="1" xlink:href="#linearGradient841" y1="0.5" y2="0.5"/>
    <linearGradient id="linearGradient840" xlink:href="#linearGradient853"/>
    <linearGradient id="linearGradient849" xlink:href="#linearGradient846"/>
    <linearGradient id="linearGradient860" xlink:href="#linearGradient1290"/>
    <linearGradient id="linearGradient851" xlink:href="#linearGradient846"/>
    <linearGradient id="linearGradient858" xlink:href="#linearGradient846"/>
    <linearGradient id="linearGradient850" xlink:href="#linearGradient846"/>
    <linearGradient id="linearGradient859" xlink:href="#linearGradient853"/>
    <linearGradient inkscape:collect="always" xlink:href="#linearGradient1507" id="linearGradient2433" x1="207.86864" y1="836.03088" x2="544.78693" y2="389.18799" gradientTransform="scale(0.9431813,1.0602415)" gradientUnits="userSpaceOnUse"/>
    <linearGradient inkscape:collect="always" xlink:href="#linearGradient1507" id="linearGradient2435" x1="204.63277" y1="839.61707" x2="546.29553" y2="386.48169" gradientTransform="scale(0.9439418,1.0593874)" gradientUnits="userSpaceOnUse"/>
    <linearGradient inkscape:collect="always" xlink:href="#linearGradient1507" id="linearGradient2437" x1="201.38963" y1="843.20789" x2="547.80804" y2="383.76529" gradientTransform="scale(0.9446888,1.0585496)" gradientUnits="userSpaceOnUse"/>
    <linearGradient inkscape:collect="always" xlink:href="#linearGradient853" id="linearGradient2439" x1="23.377766" y1="19.876423" x2="78.100548" y2="-106.28832" gradientTransform="scale(0.9201459,1.0867842)" gradientUnits="userSpaceOnUse"/>
    <linearGradient inkscape:collect="always" xlink:href="#linearGradient853" id="linearGradient2441" x1="22.405666" y1="22.397957" x2="78.384125" y2="-106.66177" gradientTransform="scale(0.9208103,1.086)" gradientUnits="userSpaceOnUse"/>
  </defs>
  <sodipodi:namedview bordercolor="#666666" borderopacity="1.0" id="base" inkscape:cx="420.28735" inkscape:cy="484.55001" inkscape:pageopacity="0.0" inkscape:pageshadow="2" inkscape:window-height="701" inkscape:window-width="590" inkscape:window-x="218" inkscape:window-y="242" inkscape:zoom="0.43942712" pagecolor="#ffffff" showgrid="false" inkscape:current-layer="svg1"/>
  <path d="M 17.158936,0.17173019 L 17.158936,203.21176 L 17.158936,406.25182 L 17.158936,609.29183 L 17.158936,812.33189 L 202.45003,812.33189 L 387.74112,812.33189 L 573.03219,812.33189 L 758.32328,812.33189 L 758.32328,609.29183 L 758.32328,406.25182 L 758.32328,203.21176 L 573.03219,0.17173019 L 387.74112,0.17173019 L 202.45003,0.17173019 L 17.158936,0.17173019 z" id="path930" sodipodi:nodetypes="cccccccccccccccc" style="fill:#ffffff;fill-rule:evenodd;stroke-width:0.42649043;stroke-opacity:0.3647799"/>
  <g id="g1552" style="fill:url(#linearGradient1506)" transform="matrix(1.6810064,0,0,1.6445369,-280.51794,-656.47411)">
    <path d="M 173.35959,408.8126 L 173.35959,531.0736 L 173.35959,653.3346 L 173.35959,775.5956 L 173.35959,897.8566 L 282.12187,897.8566 L 390.88417,897.8566 L 499.64646,897.8566 L 608.40874,897.8566 L 608.40874,775.5956 L 608.40874,653.3346 L 608.40874,531.0736 L 499.64646,408.8126 L 390.88417,408.8126 L 282.12187,408.8126 L 173.35959,408.8126 z" id="path1505" sodipodi:nodetypes="cccccccccccccccc" style="fill:url(#linearGradient2433);fill-opacity:0.75;fill-rule:evenodd;stroke-width:0.95407495pt"/>
    <path d="M 170.125,407.1875 C 170.125,571.82292 170.125,736.45833 170.125,901.09375 C 317.30208,901.09375 464.47917,901.09375 611.65625,901.09375 C 611.65625,777.33333 611.65625,653.57292 611.65625,529.8125 C 574.80918,488.38978 537.97604,446.95335 501.09375,405.5625 C 390.77083,405.5625 280.44792,405.5625 170.125,405.5625 C 170.125,405.89583 170.125,406.97917 170.125,407.1875 z" id="path1538" style="fill:url(#linearGradient2435);fill-opacity:0.75;fill-rule:evenodd;stroke-width:0.95407495pt"/>
    <path d="M 166.875,403.9375 C 166.875,570.73958 166.875,737.54167 166.875,904.34375 C 316.21875,904.34375 465.5625,904.34375 614.90625,904.34375 C 614.90625,779.08333 614.90625,653.82292 614.90625,528.5625 C 577.45517,486.47298 540.01754,444.37017 502.53125,402.3125 C 390.64583,402.3125 278.76042,402.3125 166.875,402.3125 C 166.875,402.64583 166.875,403.72917 166.875,403.9375 z" id="path1543" style="fill:url(#linearGradient2437);fill-opacity:0.75;fill-rule:evenodd;stroke-width:0.95407495pt"/>
  </g>
  <path d="M 17.463237,1.1785034 L 17.463237,204.21853 L 17.463237,407.25858 L 17.463237,610.29861 L 17.463237,813.33865 L 202.75431,813.33865 L 388.0454,813.33865 L 573.33648,813.33865 L 758.62755,813.33865 L 758.62755,610.29861 L 758.62755,407.25858 L 758.62755,204.21853 L 573.33648,1.1785034 L 388.0454,1.1785034 L 202.75431,1.1785034 L 17.463237,1.1785034 z" id="rect900" sodipodi:nodetypes="cccccccccccccccc" style="fill:url(#linearGradient1495);fill-opacity:1;fill-rule:evenodd;stroke:#000000;stroke-width:2.35700679;stroke-opacity:0.3647799"/>
  <path d="M 758.62755,204.21853 C 702.76485,187.68043 630.37937,190.0255 575.69688,199.45175 C 585.13845,138.86827 586.31866,62.9422 573.33648,1.1785034 L 758.62755,204.21853 z" id="path906" sodipodi:nodetypes="cccc" style="fill:url(#linearGradient1497);fill-opacity:1;fill-rule:evenodd;stroke-width:0.95407495pt"/>
  <path d="M 22.900684,63.759503 L 19.562572,808.15666 L 747.26922,808.15666 L 747.68648,624.14368 C 731.41321,630.40263 567.0116,397.56988 360.04916,407.58418 C 152.89882,417.60759 206.49639,93.802434 22.900684,63.759503 z" id="path1500" sodipodi:nodetypes="cccczc" style="fill:url(#linearGradient1499);fill-opacity:1;fill-rule:evenodd;stroke-width:1pt"/>
  <g id="g1660" style="fill:url(#linearGradient1944)" transform="matrix(6.215829,0,0,4.540935,11.342973,962.86129)">
    <path d="M 57.695066,-158.822 C 54.773203,-158.3934 53.17304,-157.23492 51.822734,-152.33 C 50.472427,-147.42508 51.778926,-138.59532 53.632566,-131.822 C 54.392881,-129.56857 55.381424,-127.38851 56.257566,-125.16575 C 55.757497,-121.81307 55.149235,-118.46129 54.288816,-115.16575 C 51.006168,-101.70847 47.275368,-88.179416 41.663816,-75.478246 C 33.847912,-71.635706 26.249441,-67.379556 19.038816,-62.509496 C 14.68999,-59.783056 6.7301236,-52.129096 14.038816,-48.103246 C 18.143067,-45.776646 22.414566,-46.246916 26.288816,-48.103246 C 28.225941,-49.031416 30.054252,-50.330666 31.726316,-51.759496 C 33.39838,-53.188336 34.926437,-54.755866 36.195066,-56.321996 C 40.103835,-61.248906 43.459495,-66.512506 46.413816,-72.009496 C 58.123867,-77.272886 70.214088,-81.701786 82.663818,-84.790746 C 87.869548,-80.248406 95.500758,-75.674306 101.97632,-80.196996 C 108.4682,-83.154316 107.37998,-91.92858 99.976318,-92.04075 C 95.068388,-93.01737 90.195778,-92.41398 85.382568,-91.322 C 83.284498,-93.73493 81.336748,-96.32943 79.538818,-98.7595 C 73.741578,-107.9822 68.392578,-117.48458 63.382566,-127.16575 C 64.739812,-136.04475 66.131909,-145.91827 65.043008,-152.33534 C 63.954107,-158.7524 60.814462,-159.27958 57.695066,-158.822 z M 56.726316,-152.16575 C 57.513608,-153.91163 59.542843,-152.06201 59.507948,-149.72559 C 59.473053,-147.38917 59.101878,-142.15867 57.445066,-140.697 C 56.207705,-144.4809 55.939024,-150.41987 56.726316,-152.16575 z M 61.038816,-114.47825 C 65.596333,-105.38307 71.128838,-96.78127 78.038818,-89.35325 C 76.002388,-88.765926 73.923998,-88.208786 71.913818,-87.696996 C 64.493387,-85.328026 57.22126,-82.482956 50.070066,-79.353246 C 55.150027,-90.52865 58.503506,-102.46518 61.038816,-114.47825 z M 92.445068,-86.540746 C 95.059698,-86.565726 97.147868,-85.899756 96.632568,-83.415746 C 94.428418,-83.978676 92.508048,-85.051996 90.695068,-86.353246 C 91.287798,-86.413596 91.881958,-86.535366 92.445068,-86.540746 z M 38.007566,-68.040746 C 37.450899,-66.977626 37.005201,-65.868776 36.413816,-64.821996 C 32.662406,-59.070686 27.234967,-51.845466 19.757566,-51.978246 C 17.524249,-58.247946 26.678669,-61.743836 30.945066,-64.571996 C 33.270262,-65.781026 35.649726,-66.887216 38.007566,-68.040746 z" id="path1655" sodipodi:nodetypes="czcccccccccccccccczcczczcccccccccccccc" style="fill:url(#linearGradient2439);fill-opacity:0.22641506"/>
    <path d="M 57.625,-160.125 C 50.011974,-158.83777 49.485654,-149.37511 50.329079,-143.2564 C 51.167995,-137.03028 52.164055,-130.75992 54.875,-125.03125 C 51.559704,-108.44462 47.080583,-92.069726 40.59375,-76.40625 C 30.599114,-70.673447 19.365816,-66.101753 11.59375,-57.34375 C 8.9163666,-53.953118 9.3606575,-48.252745 13.955616,-46.830524 C 22.046324,-42.409142 31.139887,-48.500024 36.30172,-54.714586 C 41.104559,-59.47103 43.702161,-66.129861 47.895633,-71.118768 C 59.171405,-75.870893 70.617028,-79.952777 82.375,-83.34375 C 87.925204,-78.633943 96.576847,-74.399372 103.25,-79.4375 C 109.54836,-81.906218 108.42544,-92.828192 101.34748,-93.136657 C 96.257721,-94.389295 91.053325,-93.51196 85.96875,-92.75 C 77.324043,-103.30069 71.318026,-115.59853 64.75,-127.46875 C 65.594801,-137.32423 68.863438,-148.09552 64.493342,-157.48489 C 63.072325,-159.74978 60.151073,-160.54566 57.625,-160.125 z M 58.125,-149.59375 C 58.758658,-142.7488 56.599971,-150.6142 58.125,-149.59375 z M 67.53125,-100.59375 C 70.114697,-96.986675 72.768229,-93.358919 75.71875,-90 C 67.832146,-87.702793 60.07814,-85.065103 52.53125,-81.8125 C 56.682998,-91.160883 58.911076,-101.17437 61.5,-111.03125 C 63.510417,-107.55208 65.520833,-104.07292 67.53125,-100.59375 z M 32.375,-61.46875 C 29.407679,-57.930437 25.829595,-54.070545 21,-53.5 C 21.834816,-59.517161 28.950475,-61.352322 33.388947,-64.343311 C 37.663685,-67.23221 32.557766,-62.391346 32.375,-61.46875 z" id="path1659" style="fill:url(#linearGradient2441);fill-opacity:0.22641506"/>
  </g>
  <path d="M 357.50439,63.999822 C 339.3426,66.663924 329.39626,73.864838 321.00299,104.35296 C 312.60972,134.8411 320.73069,189.72535 332.25259,231.82713 C 336.97858,245.83407 343.12319,259.38494 348.56914,273.20123 C 345.46079,294.04093 341.67994,314.87501 336.33173,335.35952 C 315.92736,419.00764 292.73735,503.10189 257.85692,582.05019 C 209.27462,605.93475 162.04384,632.39025 117.22384,662.66169 C 90.192287,679.60876 40.715148,727.18445 86.144707,752.20846 C 111.65602,766.6702 138.20692,763.74706 162.28859,752.20846 C 174.32942,746.43911 185.69388,738.36315 196.08714,729.48182 C 206.4804,720.60037 215.97854,710.8569 223.86412,701.12211 C 248.16035,670.4973 269.01855,637.77965 287.3821,603.61135 C 360.16974,570.89503 435.32046,543.36573 512.70583,524.16528 C 545.06375,552.39971 592.49802,580.83148 632.74897,552.71925 C 673.10139,534.33706 666.33721,479.79774 620.31735,479.10051 C 589.81047,473.03 559.52317,476.78057 529.60509,483.56813 C 516.56389,468.56978 504.457,452.44281 493.28139,437.33792 C 457.24673,380.01122 423.99827,320.94607 392.85691,260.76958 C 401.29331,205.57925 409.94634,144.20717 403.17792,104.31977 C 396.4095,64.432443 376.89401,61.155583 357.50439,63.999822 z M 351.48281,105.37391 C 356.37648,94.521824 368.98985,106.01874 368.77295,120.54152 C 368.55605,135.06431 366.24889,167.57618 355.95043,176.66167 C 348.25921,153.14161 346.58914,116.226 351.48281,105.37391 z M 378.28856,339.63289 C 406.61729,396.16696 441.00639,449.63425 483.9576,495.80554 C 471.29953,499.45624 458.38062,502.91933 445.88569,506.10053 C 399.76158,520.82561 354.55929,538.51013 310.10871,557.96386 C 341.68487,488.49945 362.52951,414.30405 378.28856,339.63289 z M 573.50437,513.28758 C 589.75648,513.1323 602.73617,517.27186 599.53316,532.71204 C 585.83254,529.21298 573.89587,522.54137 562.62669,514.45304 C 566.311,514.07792 570.00421,513.32102 573.50437,513.28758 z M 235.13031,628.2804 C 231.67016,634.88856 228.89978,641.78096 225.22383,648.2876 C 201.90572,684.03671 168.1697,728.94746 121.69147,728.12213 C 107.80956,689.15073 164.71184,667.42091 191.23103,649.84155 C 205.68404,642.32643 220.47438,635.45055 235.13031,628.2804 z" id="path900" sodipodi:nodetypes="czcccccccccccccccczcczczcccccccccccccc" style="fill:url(#linearGradient1556);fill-opacity:1"/>
</svg>