{
	"type": "Page",
	"label": "Theme Preview Page",
	"description": "Page to show preview while change theme",
	"style": {
		"layout": "column",
		"flexDirection": "wb-flex-column"
	},
	"contents": [
		{
			"style": {
				"flexAlignItem": "wb-flex-item-auto"
			},
			"type": "CommonFeatureToolbar",
			"name": "Widget",
			"features": [
				{
					"icon": "assignment_turned_in",
					"title": "Contact us",
					"text": "Sample for Contact us"
				},
				{
					"icon": "assignment_turned_in",
					"title": "About us",
					"text": "Sample for About us"
				}
			],
			"label": "SiteOnClouds",
			"description": "This is a demo of common widgets.",
			"cover": "/images/logo.svg"
		},
		{
			"type": "CommonActionCall",
			"style": {
				"padding": {
					
				},
				"margin": {
					
				},
				"borderRadius": {
					
				},
				"borderStyleColorWidth": {
					
				},
				"borderStyle": {
					
				},
				"borderWidth": {
					
				},
				"borderColor": {
					"bottom": "none"
				},
				"flexAlignItem": "wb-flex-item-auto",
				"background": "url(\"images/wallpaper.jpg\")",
				"backgroundSize": "cover"
			},
			"features": [
				{
					"icon": "assignment_turned_in",
					"title": "Go to Home",
					"text": "Feature description.",
					"action": {
						"type": "link",
						"link": "https://gitlab.com/weburger/am-wb-common",
						"label": "Home"
					}
				},
				{
					"icon": "assignment_turned_in",
					"title": "Action call",
					"text": "Action Call",
					"image": "",
					"action": {
						"type": "link",
						"link": "https://gitlab.com/weburger/am-wb-common/wikis/action-call"
					}
				}
			],
			"name": "Widget",
			"action": {
				"label": "My action",
				"type": "link",
				"link": "http://google.com"
			},
			"label": "Site on Clouds",
			"description": "Launch and Design your site as easy as possible"
		},
		{
			"type": "CommonFeatureList",
			"style": {
				
			},
			"features": [
				{
					"icon": "assignment_turned_in",
					"title": "Customize",
					"text": "This is fully customization widgets.",
					"image": "images/demo/settings-3.svg"
				},
				{
					"icon": "assignment_turned_in",
					"title": "Share it",
					"text": "Easy to share your configuration and design.",
					"image": "images/demo/share.svg",
					"action": {
						"type": "link",
						"link": "http://google.com",
						"label": "Go"
					}
				},
				{
					"icon": "assignment_turned_in",
					"title": "Mobile frindly",
					"text": "The system is fully mobile adaptable.",
					"image": "images/demo/smartphone-4.svg"
				},
				{
					"icon": "assignment_turned_in",
					"title": "Multimedia",
					"text": "Supports multimedia to attract users.",
					"image": "images/demo/speaker-2.svg"
				}
			],
			"name": "Widget"
		},
		{
			"style": {
				
			},
			"type": "CommonVideoPlayer",
			"name": "Widget",
			"content": {
				"url": "https://www.w3schools.com/html/mov_bbb.ogg",
				"mimeType": "video/ogg"
			},
			"setting": {
				"autoplay": "false",
				"controls": "true",
				"loop": "true",
				"width": "60%",
				"height": "auto",
				"poster": "images/wallpaper.jpg"
			}
		},
		{
			"style": {
				
			},
			"type": "CommonAudioPlayer",
			"name": "Widget",
			"content": {
				"url": "https://www.w3schools.com/html/mov_bbb.ogg",
				"mimeType": "audio/mpeg"
			},
			"setting": {
				"autoplay": "false",
				"controls": "true",
				"preload": "auto"
			}
		},
		{
			"style": {
				"borderColor": {
					"bottom": "none"
				},
				"flexDirection": "wb-flex-row",
				"alignItems": "wb-flex-align-items-stretch",
				"justifyContent": "wb-flex-justify-content-space-around",
				"flexAlignItem": "wb-flex-item-auto"
			},
			"type": "Group",
			"name": "Panel",
			"contents": [
				{
					"style": {
						"padding": {
							
						},
						"borderRadius": {
							
						},
						"borderStyleColorWidth": {
							
						},
						"borderStyle": {
							
						},
						"borderWidth": {
							
						},
						"borderColor": {
							"bottom": "none"
						},
						"margin": {
							
						},
						"flexAlignItem": "wb-flex-item-auto"
					},
					"type": "CommonFeatureLinks",
					"name": "Widget",
					"features": [
						{
							"icon": "assignment_turned_in",
							"title": "Weburger",
							"text": "See weburger home",
							"action": {
								"type": "link",
								"link": "https://gitlab.com/groups/weburger",
								"label": "Weburger"
							}
						},
						{
							"icon": "assignment_turned_in",
							"title": "Common widgets",
							"text": "See common widgets",
							"action": {
								"type": "link",
								"link": "https://gitlab.com/weburger/am-wb-common",
								"label": "common"
							}
						},
						{
							"icon": "assignment_turned_in",
							"title": "Feature links help",
							"text": "See online help about feature list.",
							"action": {
								"link": "https://gitlab.com/weburger/am-wb-common/wikis/feature-links",
								"type": "link",
								"label": "Features link"
							}
						},
						{
							"icon": "assignment_turned_in",
							"title": "Action title#1",
							"text": "Feature description."
						},
						{
							"icon": "assignment_turned_in",
							"title": "Action title#2",
							"text": "Feature description."
						},
						{
							"icon": "assignment_turned_in",
							"title": "Action title#3",
							"text": "Feature description."
						}
					]
				},
				{
					"style": {
						"padding": {
							
						},
						"borderRadius": {
							
						},
						"borderStyleColorWidth": {
							
						},
						"borderStyle": {
							
						},
						"borderWidth": {
							
						},
						"borderColor": {
							
						},
						"margin": {
							
						}
					},
					"type": "CommonFeatureMozaic",
					"name": "Widget",
					"features": [
						{
							"icon": "assignment_turned_in",
							"title": "Feature title",
							"text": "Feature description."
						},
						{
							"icon": "assignment_turned_in",
							"title": "Feature title",
							"text": "Feature description."
						},
						{
							"icon": "assignment_turned_in",
							"title": "Feature title",
							"text": "Feature description."
						},
						{
							"icon": "assignment_turned_in",
							"title": "Feature title",
							"text": "Feature description."
						}
					]
				}
			]
		}
	]
}