{
    "languages": [
        {
            "key": "fa",
            "title": "فارسی",
            "map": {
                "app.update.message": "نسخه جدید پنل در دسترس است.پنل به‌روزرسانی خواهد شد.",
                "Search": "جستجو",
                "Log out": "خروج",

                "Dashboard": "داشبور",
                "Account": "حساب کاربری",
                "Profile": "پروفایل‌",

                "User management": "مدیریت کاربران",
                "Users": "کاربران",
                "Groups": "گروه ها",
                "Roles": "نقش ها",
                "New user": "ایجاد کاربر جدید",
                "New group": "ایجاد گروه جدید",
                "New role": "ایجاد نقش جدید",

                "ID": "شناسه",
                "Description": "توضیحات",
                "Name": "نام",
                "Login": "لاگین",
                "First name": "نام",
                "Last name": "نام خانوادگی",
                "Joind": "عضویت",
                "Last login": "آخرین ورود",
                "Last Login": "آخرین ورود",
                "Joined date": "زمان ثبت",
                "Joined Date": "زمان ثبت",
                "Active": "فعال",
                "EMail": "پست الکترونیکی",
                "Email": "پست الکترونیکی",
                "Edit": "ویرایش",
                "Save": "ذخیره",
                "Delete": "حذف",
                "Cancel": "انصراف",
                "Restore": "بازیابی",
                "Password": "گذرواژه",
                "Confirm": "تایید",

                "Summary": "خلاصه",
                "Phone": "شماره تماس",
                "Mobile": "شماره همراه",
                "LinkedId": "لینکدین",
                "Telegram": "تلگرام",
                "Whatsapp": "واتساپ",
                "Contacts": "تماس ها",
                "User avatar": "آواتار کاربری",
                "Socials": "شبکه های اجتماعی",

                "Content management": "مدیریت محتوا",
                "Contents": "محتوا",
                "New Content": "ایجاد محتوای جدید",

                "Spa management": "مدیریت اپلیکیشن ها",
                "Applications": "اپلیکیشن ها",
                "spas": "اپلیکیشن ها",
                "Upload spa": "بارگاری اپلیکیشن جدید",
                "Repository": "مخزن اپلیکیشن ها",

                "Bank management": "مدیریت درگاه های بانکی",
                "Bank gates": "درگاه های بانکی",

                "Discount management": "مدیریت تخفیف ها",
                "Discounts": "تخفیف ها",
                "New Discount": "ایجاد تخفیف جدید",
                "New discount": "ایجاد تخفیف جدید",

                "Tenant": "تارنما",
                "Tenant Info": "اطلاعات تارنما",
                "Tickets": "درخواست ها",
                "Invoices": "صورتحساب ها",
                "Tenant Settings": "تنظیمات تارنما",
                "Captcha": "کپچا",

                "SEO": "سئو",
                "Prerender backends": "موتورهای prerender",
                "New prerender backend": "موتور prerender جدید",
                "Sitemap links": "لینک های‌ sitemap",
                "New sitemap link": "اضافه کردن لینک جدید به sitemap",
                "Select an engine from the following list:": "یکی از موتورهای زیر را انتخاب کنید:",

                "Asset management": "مدیریت محصولات",
                "Assets": "محصولات",
                "New asset": "ایجاد محصول جدید",
                "Category": "دسته",
                "New category": "ایجاد دسته جدید",
                "Categories": "دسته ها",
                "Subcategories": "زیر دسته ها",
                "Tag": "برچسب",
                "New tag": "ایجاد برچسب جدید",
                "Tags": "برچسب ها",
                "Relateds": "مرتبط",

                "Actions": "اکشن ها",
                "Item not found": "موردی برای نمایش وجود ندارد.",
                "Nothing found.": "موردی یافت نشد.",

                "Events": "رویدادها",

                "change file": "تغییر فایل"
            }
            },
            {
                "key": "en",
                "title": "English",
                "map": {}
            }
        ]
    }