{
    "bi": {
        "name": "bootstrap-icons",
        "url": "https://github.com/twbs/icons",
        "version": "1.0.0"
    },
    "fa": {
        "name": "fontawesome",
        "url": "https://github.com/FortAwesome/Font-Awesome",
        "version": "5.14.0"
    },
    "mdi": {
        "name": "materialdesignicons",
        "url": "https://github.com/Templarian/MaterialDesign-SVG",
        "version": "5.5.55"
    },
    "ti": {
        "name": "themify-icons",
        "url": "https://themify.me/themify-icons",
        "version": "1.0.1"
    }
}
