[-137, 237]
[0, 0]
[0, 0]
[0, 0]
[0, 0]
[0, 1]
[0, 0]
[0, 1]
[0, 1]
[0, 0]
[0, 1]
[0, 1]
[0, 1]
[0, 2]
[0, 1]
[0, 1]
[0, 2]
[0, 1]
[0, 2]
[0, 2]
[0, 2]
[0, 2]
[0, 2]
[0, 2]
[0, 2]
[0, 3]
[0, 2]
[0, 3]
[0, 3]
[0, 2]
[0, 3]
[0, 3]
[0, 3]
[0, 4]
[0, 3]
[0, 3]
[0, 4]
[0, 3]
[0, 4]
[0, 4]
[0, 4]
[0, 4]
[0, 4]
[0, 4]
[0, 4]
[0, 5]
[0, 4]
[0, 5]
[0, 5]
[0, 4]
[0, 5]
[0, 5]
[0, 5]
[0, 3]
[0, 0]
[0, 0]
[0, 0]
[0, -7]
[0, -6]
[0, -6]
[0, -6]
[0, -6]
[0, -6]
[0, -5]
[0, -6]
[0, -6]
[0, -5]
[0, -5]
[0, -5]
[0, -6]
[0, -5]
[0, -4]
[0, -5]
[0, -5]
[0, -4]
[-4, -5]
[-4, -4]
[-4, -5]
[-4, -4]
[-4, -4]
[-4, -4]
[-5, -4]
[-4, -4]
[-2, -3]
[0, -4]
[0, -3]
[0, -4]
[0, -24]
[-4, 0]
[-4, -6]
[-4, -6]
[-5, -6]
[-4, -6]
[-4, -6]
[-4, -6]
[-4, -6]
[-4, -5]
[-4, -6]
[-4, -5]
[-4, -6]
[-4, -5]
[-5, -5]
[0, -5]
[0, -5]
[0, -5]
[0, -4]
[0, -5]
[0, -4]
[0, -5]
[0, -4]
[5, -4]
[4, -4]
[4, -4]
[4, -4]
[1, -4]
[0, -4]
[0, -25]
[4, 0]
[4, -6]
[4, -6]
[5, -6]
[4, -6]
[4, -6]
[4, -6]
[4, -6]
[4, -5]
[4, -6]
[4, -5]
[4, -5]
[4, -6]
[0, -5]
[0, -5]
[0, -5]
[0, -4]
[0, -5]
[0, -5]
[0, -4]
[0, -5]
[0, -4]
[0, -4]
[0, -4]
[0, -4]
[-4, -4]
[-4, -4]
[-4, -4]
[-1, -3]
[0, -12]
[-4, 0]
[-4, -6]
[-4, -7]
[-4, -6]
[-5, -6]
[-4, -6]
[-4, -5]
[-4, -6]
[-4, -6]
[-4, -5]
[-4, -6]
[-4, -5]
[-4, -5]
[-4, -5]
[-5, -5]
[-4, -5]
[-4, -5]
[-4, -5]
[-4, -4]
[-4, -5]
[-4, -4]
[-4, -4]
[-4, -5]
[-4, -4]
[-5, -4]
[-4, -4]
[-4, -3]
[-4, -4]
[-4, -4]
[-4, -3]
[-4, -4]
[-4, -3]
[-4, -3]
[-4, -3]
[-5, -3]
[-4, -3]
[-4, -3]
[-4, -2]
[-4, -3]
[-4, -3]
[-4, -2]
[-4, -2]
[-4, -2]
[-4, -3]
[-5, -2]
[-4, -1]
[-4, -2]
[-4, -2]
[-4, -2]
[-4, -1]
[-4, -1]
[-4, -2]
[-4, -1]
[-4, -1]
[-5, -1]
[-4, -1]
[-4, -1]
[-4, 0]
[-4, -1]
[-4, 0]
[-4, -1]
[-4, 0]
[-4, 0]
[-4, 0]
[-5, 0]
[-4, 0]
[-4, 0]
[-4, 0]
[-4, 1]
[-4, 0]
[-4, 1]
[-4, 0]
[-4, 1]
[-4, 1]
[-5, 1]
[-4, 1]
[-4, 1]
[-4, 2]
[-4, 1]
[-4, 2]
[-4, 1]
[-4, 2]
[-4, 2]
[-4, 2]
[-5, 2]
[-4, 2]
[-4, 2]
[-4, 2]
[-4, 3]
[-4, 2]
[-4, 3]
[-4, 2]
[-4, 3]
[-4, 3]
[-5, 3]
[-4, 3]
[-4, 4]
[-4, 3]
[-4, 3]
[-4, 4]
[-4, 3]
[-4, 4]
[-4, 4]
[-4, 4]
[-5, 4]
[-4, 4]
[0, 4]
[0, 4]
[0, 2]
[0, 0]
[0, 0]
[0, 0]
[0, 0]
[0, 0]
[0, 0]
[0, 0]
[0, 0]
[0, 0]
[0, 0]
[0, 0]
[0, 0]
[0, 0]
[0, 0]
[0, 0]
[0, 0]
[0, 0]
[0, 0]
[0, 0]
[0, 0]
[0, 0]
[0, 0]
[0, 0]
[0, 0]
[0, 0]
[0, 0]
[0, 0]
[0, 0]
[0, 0]
[0, 0]
[0, 0]
[0, 0]
[0, 0]
[0, 0]
[0, 0]
[0, 0]
[0, 0]
[0, 0]
[0, 0]
[0, 0]
[0, 0]
[0, 0]
[0, 0]
[0, 0]
[0, 0]
[0, 0]
[0, 0]
[0, 0]
[0, 0]
[0, 0]
[0, 0]
[0, 0]
[0, 0]
[0, 0]
[0, 0]
[0, 0]
[0, 0]
[0, 0]
[0, 0]
[0, 0]
[0, 0]
[0, 0]
[0, 0]
[0, 0]
[0, 0]
[0, 0]
[0, 0]
[0, 0]
[0, 0]
[0, 0]
[0, 0]
[0, 0]
[0, 0]
[0, 0]
[0, 0]
[0, 0]
[0, 0]
[0, 0]
[0, 0]
[0, 0]
[0, 0]
[0, 0]
[0, 0]
[0, 0]
[0, 0]
[0, 0]
[0, 0]
[0, 0]
[0, 0]
[0, 0]
[0, 0]
[0, 0]
[0, 0]
[0, 0]
[0, 0]
[0, 0]
[0, 0]
[0, 0]
[0, 0]
[0, 0]
[0, 0]
[0, 0]
[0, 0]
[0, 0]
[0, 0]
[0, 0]
[0, 0]
[0, 0]
[0, 0]
[0, 0]
[0, 0]
[0, 0]
[0, 0]
[0, 0]
[0, 0]
[0, 0]
[0, 0]
[0, 0]
[0, 0]
[0, 0]
[0, 0]
[0, 0]
[0, 0]
[0, 0]
[0, 0]
[0, 0]
[0, 0]
[0, 0]
[0, 0]
[0, 0]
[0, 0]
[0, 0]
[0, 0]
[0, 0]
[0, 0]
[0, 0]
[0, 0]
[0, 0]
[0, 0]
[0, 0]
[0, 0]
[0, 0]
[0, 0]
[0, 0]
[0, 0]
[0, 0]
[0, 0]
[0, 0]
[0, 0]
[0, 0]
[0, 0]
[0, 0]
[0, 0]
[0, 0]
[0, 0]
[0, 0]
[0, 0]
[0, 0]
[0, 0]
[0, 0]
[0, 0]
[0, 0]
[0, 0]
[0, 0]
[0, 0]
[0, 0]
[0, 0]
[0, 0]
[0, 0]
[0, 0]
[0, 0]
[0, 0]
[0, 0]
[0, 0]
[0, 0]
[0, 0]
[0, 0]
[0, 0]
[0, 0]
[0, -7]
[0, -6]
[0, -6]
[0, -6]
[0, -6]
[0, -5]
[0, -6]
[0, -6]
[0, -5]
[0, -6]
[0, -5]
[0, -5]
[0, -5]
[0, -5]
[0, -5]
[0, -5]
[0, -5]
[0, -4]
[0, -5]
[0, -4]
[0, -4]
[0, -5]
[0, -4]
[0, -4]
[0, -4]
[0, -3]
[0, -4]
[0, -4]
[0, -3]
[0, -4]
[0, -3]
[0, -3]
[0, -3]
[0, -3]
[0, -3]
[0, -3]
[0, -3]
[0, -2]
[0, -3]
[0, -2]
[0, -2]
[0, -3]
[0, -2]
[0, -2]
[0, -1]
[0, -2]
[0, -2]
[0, -2]
[0, -1]
[0, -1]
[0, -2]
[0, -1]
[0, -1]
[0, -1]
[0, -1]
[0, -1]
[0, 0]
[0, -1]
[0, -1]
[0, 0]
[0, 0]
[0, 0]
[0, -1]
[0, 0]
[0, 1]
[0, 0]
[0, 0]
[0, 1]
[0, 0]
[0, 1]
[0, 0]
[0, 1]
[0, 1]
[0, 1]
[0, 1]
[0, 1]
[0, 2]
[0, 1]
[0, 2]
[0, 1]
[0, 2]
[0, 2]
[0, 2]
[0, 2]
[0, 2]
[0, 2]
[0, 2]
[0, 3]
[0, 2]
[0, 3]
[0, 2]
[0, 3]
[0, 3]
[0, 3]
[0, 3]
[0, 2]
[0, 0]
[0, 0]
[0, 0]
[4, 0]
[5, 0]
[4, 0]
[4, -6]
[4, -6]
[4, -6]
[4, -6]
[4, -6]
[4, -6]
[4, -6]
[4, -5]
[5, -6]
[4, -5]
[4, -5]
[4, -5]
[4, -6]
[4, -5]
[4, -4]
[4, -5]
[4, -5]
[4, -5]
[5, -4]
[4, -4]
[4, -5]
[4, -4]
[4, -4]
[4, -4]
[4, -4]
[4, -4]
[4, -3]
[4, -4]
[5, -3]
[4, -4]
[4, -3]
[4, -3]
[4, -3]
[4, -3]
[4, -3]
[4, -3]
[4, -3]
[4, -2]
[5, -3]
[4, -2]
[4, -3]
[4, -2]
[4, -2]
[4, -2]
[4, -2]
[4, -2]
[4, -1]
[4, -2]
[5, -1]
[4, -2]
[4, -1]
[4, -1]
[4, -1]
[4, -1]
[4, -1]
[4, -1]
[4, -1]
[4, 0]
[5, -1]
[4, 0]
[4, -1]
[4, 0]
[4, 0]
[4, 0]
[4, 0]
[4, 0]
[4, 1]
[4, 0]
[0, 1]
[0, 0]
[0, 1]
[0, 1]
[0, 1]
[0, 1]
[0, 1]
[0, 1]
[0, 1]
[0, 2]
[0, 1]
[0, 2]
[0, 2]
[0, 1]
[0, 1]
[0, 0]
[0, 0]
[0, 0]
[0, 0]
[0, 0]
[0, 0]
[0, 0]
[0, 0]
[0, 0]
[0, 0]
[0, 0]
[0, 0]
[0, 0]
[0, 0]
[0, 0]
[0, 0]
[0, 0]
[0, 0]
[0, 0]
[5, 0]
[4, 0]
[4, 0]
[4, 0]
[4, 0]
[4, 0]
[4, 0]
[4, 0]
[4, 0]
[4, 0]
[5, 0]
[4, 0]
[4, 0]
[4, 0]
[4, 0]
[4, 0]
[4, 0]
[4, -6]
[4, -6]
[4, -6]
[5, -6]
[4, -6]
[4, -6]
[4, -6]
[4, -5]
[4, -6]
[4, -5]
[4, -5]
[4, -6]
[4, -5]
[5, -5]
[4, -5]
[4, -4]
[4, -5]
[4, -5]
[4, -4]
[4, -5]
[4, -4]
[4, -4]
[4, -4]
[5, -4]
[4, -4]
[4, -4]
[4, -4]
[4, -3]
[4, -4]
[4, -3]
[4, -3]
[4, -4]
[4, -3]
[5, -3]
[4, -3]
[4, -2]
[4, -3]
[4, -3]
[4, -2]
[4, -3]
[4, -2]
[4, -2]
[4, -2]
[5, -2]
[4, -2]
[4, -2]
[4, -1]
[4, -2]
[4, -2]
[4, -1]
[4, -1]
[4, -1]
[4, -2]
[5, -1]
[4, 0]
[4, -1]
[4, -1]
[0, -1]
[0, 0]
[0, 0]
[0, -1]
[0, 0]
[0, 0]
[0, 0]
[0, 0]
[0, 0]
[4, 1]
[4, 0]
[4, 1]
[4, 0]
[4, 1]
[4, 1]
[4, 1]
[5, 1]
[4, 1]
[4, 1]
[4, 1]
[4, 2]
[4, 1]
[4, 2]
[4, 1]
[4, 2]
[4, 2]
[5, 2]
[4, 2]
[4, 2]
[4, 3]
[4, 2]
[4, 3]
[4, 1]
[4, 0]
[4, 0]
[4, 0]
[5, 0]
[4, 0]
[4, 0]
[4, 0]
[4, 0]
[4, 0]
[4, 0]
[4, 0]
[4, 0]
[4, 0]
[5, 0]
[4, 0]
[4, 0]
[4, 0]
[4, 0]
[4, 0]
[4, 0]
[4, 0]
[4, 0]
[4, 0]
[5, 0]
[4, 0]
[4, 0]
[4, 0]
[4, 0]
[4, 0]
[4, 0]
[4, 0]
[4, 0]
[4, 0]
[5, 0]
[4, 0]
[4, 0]
[4, 0]
[4, 0]
[4, 0]
[4, 0]
[4, 0]
[4, 0]
[4, 0]
[5, 0]
[4, 0]
[4, 0]
[4, 0]
[4, 0]
[4, 0]
[4, 0]
[4, 0]
[4, 0]
[4, 0]
[5, 0]
[4, 0]
[4, 0]
[4, 0]
[4, 0]
[4, 0]
[4, 0]
[4, 0]
[4, 0]
[4, 0]
[5, 0]
[4, 0]
[4, 0]
[4, 0]
[4, 0]
[4, 0]
[4, 0]
[4, 0]
[4, 0]
[4, 0]
[5, 0]
[4, 0]
[4, 0]
[4, 0]
[4, 0]
[4, 0]
[4, 0]
[4, 0]
[4, 0]
[4, 0]
[5, 0]
[4, 0]
[4, 0]
[4, 0]
[4, 0]
[4, 0]
[4, 0]
[4, 0]
[4, 0]
[4, 0]
[5, 0]
[4, 0]
[4, 0]
[4, 0]
[4, 0]
[4, 0]
[4, 0]
[4, 0]
[4, 0]
[4, 0]
[5, 0]
[4, 0]
[4, 0]
[4, 0]
[4, 0]
[4, 0]
[4, 0]
[4, 0]
[4, 0]
[4, 0]
[5, 0]
[4, 0]
[4, 0]
[4, 0]
[4, 0]
[4, 0]
[4, 0]
[4, 0]
[4, 0]
[4, 0]
[5, 0]
[4, 0]
[4, 0]
[4, 0]
[4, 0]
[4, 0]
[4, 0]
[4, 0]
[4, 0]
[4, 0]
[5, 0]
[4, 0]
[4, 0]
[4, 0]
[4, 0]
[4, 0]
[4, 0]
[4, 0]
[4, 0]
[4, 0]
[5, 0]
[4, 0]
[4, 0]
[4, 0]
[4, 0]
[4, 0]
[4, 0]
[4, 0]
[4, 0]
[4, 0]
[5, 0]
[4, 0]
[4, 0]
[4, 0]
[4, 0]
[4, 0]
[4, 0]
[4, 0]
[4, 0]
[4, -6]
[5, -6]
[4, -6]
[4, -6]
[4, -6]
[4, -6]
[4, -6]
[4, -5]
[4, -6]
[4, -5]
[4, -6]
[5, -5]
[4, -5]
[4, -5]
[4, -5]
[4, -4]
[4, -5]
[4, -5]
[4, -4]
[4, -5]
[4, -4]
[5, -4]
[4, -4]
[4, -4]
[4, -4]
[4, -4]
[4, -4]
[4, -3]
[4, -4]
[4, -3]
[4, -3]
[5, -4]
[4, -3]
[4, -3]
[4, -3]
[4, -2]
[4, -3]
[4, -3]
[4, -2]
[4, -3]
[4, -2]
[5, -2]
[4, -2]
[4, -2]
[4, -2]
[4, -2]
[4, -2]
[4, -1]
[4, -2]
[4, -1]
[4, -1]
[5, -2]
[4, -1]
[4, -1]
[4, -1]
[4, 0]
[4, -1]
[4, -1]
[4, 0]
[4, 0]
[4, -1]
[5, 0]
[4, 0]
[4, 0]
[4, 0]
[4, 0]
[4, 1]
[4, 0]
[4, 0]
[4, 1]
[4, 1]
[5, 1]
[4, 0]
[4, 1]
[4, 2]
[4, 1]
[4, 1]
[4, 2]
[4, 1]
[4, 2]
[4, 1]
[5, 2]
[4, 2]
[4, 2]
[4, 2]
[4, 2]
[4, 3]
[4, 2]
[4, 3]
[4, 2]
[4, 3]
[5, 3]
[4, 3]
[4, 3]
[4, 3]
[4, 1]
[4, 0]
[4, 0]
[4, 0]
[4, 0]
[4, 0]
[5, 0]
[4, 0]
[4, 0]
[4, 0]
[4, 0]
[4, 0]
[4, 0]
[4, 0]
[4, 0]
[4, 0]
[0, 0]
[0, 0]
[0, 0]
[0, 0]
[0, 0]
[0, 0]
[0, 0]
[0, 0]
[0, 0]
[0, 0]
[0, 0]
[0, 0]
[0, 0]
[0, 0]
[0, 0]
[0, 0]
[0, 0]
[0, 0]
[0, 0]
[0, 0]
[0, 0]
[0, 0]
[0, 0]
[0, 0]
[0, 0]
[0, 0]
[0, 0]
[0, 0]
[0, 0]
[0, 0]
[0, 0]
[0, 0]
[0, 0]
[0, 0]
[0, 0]
[0, 0]
[0, 0]
[0, 0]
[0, 0]
[0, 0]
[0, 0]
[0, 0]
[0, 0]
