[0, 0]
[0, 0]
[0, 0]
[0, 1]
[0, 0]
[0, 0]
[0, 1]
[0, 0]
[0, 1]
[0, 1]
[0, 1]
[0, 1]
[0, 1]
[0, 1]
[0, 1]
[0, 2]
[0, 1]
[0, 2]
[0, 2]
[0, 1]
[0, 2]
[0, 2]
[0, 2]
[0, 3]
[0, 2]
[0, 2]
[0, 3]
[0, 2]
[0, 3]
[0, 3]
[0, 3]
[0, 3]
[0, 3]
[0, 3]
[0, 3]
[0, 4]
[0, 3]
[0, 4]
[0, 4]
[0, 3]
[0, 4]
[0, 4]
[0, 4]
[0, 5]
[0, 4]
[0, 4]
[0, 5]
[0, 4]
[0, 5]
[0, 5]
[0, 5]
[0, 5]
[0, 5]
[0, 2]
[0, 0]
[0, 0]
[0, 0]
[0, 0]
[0, 0]
[0, 0]
[0, 0]
[0, 0]
[0, 0]
[0, 0]
[0, 0]
[0, 0]
[0, 0]
[0, 0]
[0, 0]
[0, 0]
[0, 0]
[0, 0]
[0, 0]
[0, 0]
[0, 0]
[0, 0]
[0, 0]
[0, 0]
[0, 0]
[0, 0]
[0, 0]
[0, 0]
[0, 0]
[0, 0]
[0, 0]
[0, 0]
[0, 0]
[0, 0]
[0, 0]
[0, 0]
[0, 0]
[0, 0]
[0, 0]
[0, 0]
[0, 0]
[0, 0]
[0, 0]
[0, 0]
[0, 0]
[0, 0]
[0, 0]
[0, 0]
[0, 0]
[0, 0]
[0, 0]
[0, 0]
[0, 0]
[0, 0]
[0, 0]
[0, 0]
[0, 0]
[0, 0]
[0, 0]
[0, 0]
[0, 0]
[0, 0]
[0, 0]
[0, 0]
[0, 0]
[0, 0]
[0, 0]
[0, 0]
[0, 0]
[0, 0]
[0, 0]
[0, 0]
[0, 0]
[0, 0]
[0, 0]
[0, 0]
[0, 0]
[0, 0]
[0, 0]
[0, 0]
[0, 0]
[0, 0]
[0, 0]
[0, 0]
[0, 0]
[0, 0]
[0, 0]
[0, 0]
[0, 0]
[0, 0]
[0, 0]
[0, 0]
[0, 0]
[0, 0]
[0, 0]
[0, 0]
[0, 0]
[0, 0]
[0, 0]
[0, 0]
[0, 0]
[0, 0]
[0, 0]
[0, 0]
[0, 0]
[0, 0]
[0, 0]
[0, 0]
[0, 0]
[0, 0]
[0, 0]
[0, 0]
[0, 0]
[0, 0]
[0, 0]
[0, 0]
[0, 0]
[0, 0]
[0, 0]
[0, 0]
[0, 0]
[0, 0]
[0, 0]
[0, 0]
[0, 0]
[0, 0]
[0, 0]
[0, 0]
[0, 0]
[0, 0]
[0, 0]
[0, 0]
[0, 0]
[0, 0]
[0, 0]
[0, 0]
[0, 0]
[0, 0]
[0, 0]
[0, 0]
[0, 0]
[0, 0]
[0, 0]
[0, 0]
[0, 0]
[0, 0]
[0, 0]
[0, 0]
[0, 0]
[0, 0]
[0, 0]
[0, 0]
[0, 0]
[0, 0]
[0, 0]
[0, 0]
[0, 0]
[0, 0]
[0, 0]
[0, 0]
[0, 0]
[0, 0]
[0, 0]
[0, 0]
[0, 0]
[0, 0]
[0, 0]
[0, 0]
[0, 0]
[0, 0]
[0, 0]
[0, 0]
[0, 0]
[0, 0]
[0, 0]
[0, 0]
[0, 0]
[0, 0]
[0, 0]
[0, 0]
[0, 0]
[0, 0]
[0, 0]
[0, 0]
[0, 0]
[0, 0]
[0, 0]
[0, 0]
[0, 0]
[0, 0]
[0, 0]
[0, 0]
[0, 0]
[0, 0]
[0, 0]
[0, 0]
[0, 0]
[0, 0]
[0, 0]
[0, 0]
[0, 0]
[0, 0]
[0, 0]
[0, 0]
[0, 0]
[0, 0]
[0, 0]
[0, 0]
[0, 0]
[0, 0]
[0, 0]
[0, 0]
[0, 0]
[0, 0]
[0, 0]
[0, 0]
[0, 0]
[0, 0]
[0, 0]
[0, 0]
[0, 0]
[0, 0]
[0, 0]
[0, 0]
[0, 0]
[0, 0]
[0, 0]
[0, 0]
[0, 0]
[0, 0]
[0, 0]
[0, 0]
[0, 0]
[0, 0]
[0, 0]
[0, 0]
[0, 0]
[0, 0]
[0, 0]
[0, 0]
[0, 0]
[0, 0]
[0, 0]
[0, 0]
[0, 0]
[0, 0]
[0, 0]
[0, 0]
[0, 0]
[0, 0]
[0, 0]
[0, 0]
[0, 0]
[0, 0]
[0, 0]
[0, 0]
[0, 0]
[0, 0]
[0, 0]
[0, 0]
[0, 0]
[0, 0]
[0, 0]
[0, 0]
[0, 0]
[0, 0]
[0, 0]
[0, 0]
[0, 0]
[0, 0]
[0, 0]
[0, 0]
[0, 0]
[0, 0]
[0, 0]
[0, 0]
[0, 0]
[0, 0]
[0, 0]
[0, 0]
[0, 0]
[0, 0]
[0, 0]
[0, 0]
[0, 0]
[0, 0]
[0, 0]
[0, 0]
[0, 0]
[0, 0]
[0, 0]
[0, 0]
[0, 0]
[0, 0]
[0, 0]
[0, 0]
[0, 0]
[0, 0]
[0, 0]
[0, 0]
[0, 0]
[0, 0]
[0, 0]
[0, 0]
[0, 0]
[0, 0]
[0, 0]
[0, 0]
[0, 0]
[0, 0]
[0, 0]
[0, 0]
[0, 0]
[0, 0]
[0, 0]
[0, 0]
[0, 0]
[0, 0]
[0, 0]
[0, 0]
[0, 0]
[0, 0]
[0, 0]
[0, 0]
[0, 0]
[0, 0]
[0, 0]
[0, 0]
[4, 0]
[4, 0]
[4, 0]
[4, 0]
[4, 0]
[4, 0]
[4, 0]
[4, 0]
[4, 0]
[5, 0]
[4, 0]
[4, 0]
[4, 0]
[4, 0]
[4, 0]
[4, 0]
[4, 0]
[4, 0]
[4, 0]
[5, 0]
[4, 0]
[4, 0]
[4, 0]
[4, 0]
[4, 0]
[4, 0]
[4, 0]
[4, 0]
[4, 0]
[5, 0]
[4, 0]
[4, 0]
[4, 0]
[4, 0]
[4, 0]
[4, 0]
[4, 0]
[4, 0]
[4, 0]
[5, 0]
[4, 0]
[4, 0]
[4, 0]
[4, 0]
[4, 0]
[4, 0]
[4, 0]
[4, 0]
[4, 0]
[5, 0]
[4, 0]
[4, 0]
[4, 0]
[4, 0]
[4, 0]
[4, 0]
[4, 0]
[4, 0]
[4, 0]
[5, 0]
[4, 0]
[4, 0]
[4, 0]
[4, 0]
[4, 0]
[4, 0]
[4, 0]
[4, 0]
[4, 0]
[5, 0]
[4, 0]
[4, 0]
[4, 0]
[4, 0]
[4, 0]
[4, 0]
[4, 0]
[0, 0]
[0, 0]
[0, 0]
[0, 0]
[0, 0]
[0, 0]
[0, 0]
[0, 0]
[0, 0]
[0, 0]
[0, 0]
[0, 0]
[0, 0]
[0, 0]
[0, 0]
[0, 0]
[0, 0]
[0, 0]
[0, 0]
[0, 0]
[0, 0]
[0, 0]
[0, 0]
[0, 0]
[0, 0]
[0, 0]
[0, 0]
[0, 0]
[0, 0]
[0, 0]
[0, 0]
[0, 0]
[0, 0]
[0, 0]
[0, 0]
[0, 0]
[0, 0]
[0, 0]
[0, 0]
[0, 0]
[0, 0]
[0, 0]
[0, 0]
[0, 0]
[0, 0]
[0, 0]
[0, 0]
[0, 0]
[0, 0]
[0, 0]
[0, 0]
[0, 0]
[0, 0]
[0, 0]
[0, 0]
[0, 0]
[0, 0]
[0, 0]
[0, 0]
[0, 0]
[0, 0]
[0, 0]
[0, 0]
[0, 0]
[0, 0]
[0, 0]
[0, 0]
[0, 0]
[0, 0]
[0, 0]
[0, 0]
[0, 0]
[0, 0]
[0, 0]
[0, 0]
[0, 0]
[0, 0]
[0, 0]
[0, 0]
[0, -6]
[0, -6]
[0, -7]
[0, -6]
[0, -5]
[0, -6]
[0, -6]
[0, -6]
[0, -5]
[0, -5]
[0, -6]
[0, -5]
[0, -5]
[0, -5]
[0, -5]
[0, -5]
[0, -4]
[0, -5]
[0, -4]
[0, -5]
[0, -4]
[0, -4]
[0, -4]
[0, -4]
[0, -4]
[0, -4]
[0, -4]
[0, -3]
[0, -4]
[0, -3]
[0, -4]
[0, -3]
[0, -3]
[0, -3]
[0, -3]
[0, -3]
[0, -2]
[0, -3]
[0, -2]
[0, -3]
[0, -2]
[0, -2]
[0, -2]
[0, -2]
[0, -2]
[0, -1]
[0, 0]
[0, 0]
[0, 0]
[0, 0]
[-4, 0]
[-4, 1]
[-4, 0]
[-4, 0]
[-4, 0]
[-4, 1]
[-4, 1]
[-5, 0]
[-4, 1]
[-4, 1]
[-4, 1]
[-4, 1]
[-4, 1]
[-4, 2]
[-4, 1]
[-4, 1]
[-4, 2]
[-5, 2]
[-4, 2]
[-4, 1]
[-4, 2]
[0, 3]
[0, 2]
[0, 2]
[0, 2]
[0, 3]
[0, 3]
[0, 2]
[0, 3]
[0, 3]
[0, 3]
[0, 3]
[0, 0]
[0, 0]
[0, 0]
[0, 0]
[0, 0]
[0, 0]
[0, 0]
[0, 0]
[0, 0]
[0, 0]
[0, 0]
[0, 0]
[0, 0]
[0, 0]
[0, 0]
[0, 0]
[0, 0]
[0, 0]
[0, 0]
[0, 0]
[0, 0]
[0, 0]
[0, 0]
[0, 0]
[0, 0]
[0, 0]
[0, 0]
[0, 0]
[0, 0]
[0, 0]
[0, 0]
[0, 0]
[0, 0]
[0, 0]
[0, 0]
[0, 0]
[0, 0]
[0, 0]
[0, 0]
[0, 0]
[0, 0]
[0, 0]
[0, 0]
[0, 0]
[0, 0]
[0, 0]
[0, 0]
[0, 0]
[0, 0]
[0, 0]
[0, 0]
[0, 0]
[0, 0]
[0, 0]
[0, 0]
[0, 0]
[0, 0]
[0, -13]
[0, -12]
[0, -12]
[0, -13]
[0, -12]
[0, -12]
[0, -12]
[0, -12]
[0, -12]
[0, -11]
[0, -12]
[0, -11]
[0, -12]
[0, -11]
[0, -11]
[0, -11]
[0, -11]
[0, -11]
[0, -11]
[0, -11]
[0, -10]
[0, -11]
[0, -10]
[0, -11]
[0, -10]
[0, -10]
[0, -10]
[0, -10]
[0, -9]
[0, -10]
[0, -10]
[0, -9]
[0, -10]
[0, -9]
[0, -9]
[0, -9]
[0, -9]
[0, -9]
[0, -9]
[0, -9]
[0, -8]
[0, -9]
[0, -8]
[0, -8]
[0, -9]
[0, -8]
[0, -8]
[0, -7]
[0, -8]
[0, -8]
[0, -8]
[0, -7]
[0, -7]
[0, -8]
[0, -7]
[0, -7]
[0, -7]
[0, -7]
[0, -7]
[0, -6]
[0, -7]
[0, -6]
[0, -7]
[0, -6]
[0, -6]
[0, -6]
[0, -6]
[0, -6]
[0, -2]
[0, 0]
[0, 0]
[0, 0]
[0, 0]
[0, 0]
[0, 1]
[0, 0]
[0, 0]
[0, 0]
[0, 1]
[0, 1]
[0, 0]
[0, 1]
[0, 1]
[0, 1]
[0, 1]
[0, 1]
[0, 2]
[0, 1]
[0, 1]
[0, 2]
[0, 2]
[0, 2]
[0, 1]
[0, 2]
[0, 3]
[0, 2]
[0, 2]
[0, 2]
[0, 3]
[0, 3]
[0, 2]
[0, 3]
[0, 3]
[0, 3]
[0, 3]
[0, 3]
[0, 4]
[0, 3]
[0, 3]
[0, 4]
[0, 4]
[0, 4]
[0, 3]
[0, 4]
[0, 5]
[0, 4]
[0, 4]
[0, 4]
[0, 5]
[0, 5]
[0, 4]
[0, 5]
[0, 5]
[0, 5]
[0, 5]
[0, 5]
[0, 6]
[0, 5]
[0, 5]
[0, 6]
[0, 6]
[0, 6]
[0, 5]
[0, 6]
[0, 7]
[0, 6]
[0, 6]
[0, 6]
[0, 7]
[0, 7]
[0, 6]
[0, 7]
[0, 7]
[0, 7]
[0, 7]
[0, 7]
[0, 8]
[0, 7]
[0, 7]
[0, 8]
[0, 8]
[0, 8]
[0, 7]
[0, 8]
[0, 9]
[0, 8]
[0, 8]
[0, 8]
[0, 9]
[0, 9]
[0, 8]
[0, 9]
[0, 9]
[0, 9]
[0, 9]
[0, 9]
[0, 10]
[0, 9]
[0, 9]
[0, 10]
[0, 10]
[0, 10]
[0, 9]
[0, 10]
[0, 11]
[0, 10]
[0, 10]
[0, 10]
[0, 11]
[0, 11]
[0, 10]
[0, 11]
[0, 11]
[0, 11]
[0, 11]
[0, 8]
[0, 0]
[0, 0]
[0, 0]
[0, 0]
[0, 0]
[0, 0]
[0, 0]
[0, 0]
[0, 0]
[0, 0]
[0, 0]
[0, 0]
[0, 0]
[0, 0]
[0, 0]
[0, 0]
[0, 0]
[0, 0]
[0, 0]
[0, 0]
[0, 0]
[0, 0]
[0, 0]
[0, 0]
[0, 0]
[0, 0]
[0, 0]
[0, 0]
[0, 0]
[0, 0]
[0, 0]
[0, 0]
[0, 0]
[0, 0]
[0, 0]
[0, 0]
[0, 0]
[0, 0]
[0, 0]
[0, 0]
[0, 0]
[0, 0]
[0, 0]
[4, 0]
[4, 0]
[4, 0]
[5, 0]
[4, 0]
[4, 0]
[4, 0]
[4, 0]
[4, 0]
[4, 0]
[4, 0]
[4, 0]
[4, 0]
[5, 1]
[4, 0]
[4, 0]
[4, 1]
[4, 0]
[4, 1]
[4, 1]
[4, 1]
[4, 1]
[4, 1]
[5, 1]
[4, 1]
[4, 2]
[4, 1]
[4, 2]
[4, 2]
[4, 1]
[4, 2]
[4, 2]
[4, 2]
[5, 3]
[4, 2]
[4, 2]
[4, 3]
[4, 2]
[4, 3]
[4, 3]
[4, 3]
[4, 3]
[4, 3]
[5, 3]
[4, 3]
[4, 4]
[4, 3]
[4, 4]
[4, 4]
[4, 3]
[4, 4]
[4, 4]
[4, 4]
[5, 5]
[4, 4]
[4, 4]
[4, 5]
[4, 4]
[4, 5]
[4, 5]
[4, 5]
[4, 5]
[4, 5]
[5, 2]
[4, 0]
[4, 0]
[4, 0]
[4, 0]
[4, 0]
[4, 0]
[4, 0]
[4, 0]
[4, 0]
[5, 0]
[4, 0]
[4, 0]
[4, 0]
[4, 0]
[4, 0]
[4, 0]
[4, 0]
[4, 0]
[4, 0]
[5, 0]
[4, 0]
[4, 0]
[4, 0]
[4, 0]
[4, 0]
[4, 0]
[4, 0]
[4, 0]
[0, 0]
[0, 0]
[0, 0]
[0, 0]
[0, 0]
[0, 0]
[0, 0]
[0, 0]
[0, 0]
[0, 0]
[0, 0]
[0, 0]
[0, 0]
[0, 0]
[0, 0]
[0, 0]
[0, 0]
[0, 0]
[0, 0]
[-4, 0]
[-4, 0]
[-4, 0]
[-4, 0]
[-4, 0]
[-4, 0]
[-4, 0]
[-4, 0]
[-5, 0]
[-4, 0]
[-4, 0]
[-4, 0]
[-4, 0]
[-4, 0]
[-4, 0]
[-4, 0]
[-4, 0]
[-4, 0]
[-5, 0]
[-4, 0]
[-4, 0]
[-4, 0]
[-4, 0]
[-4, 0]
[-4, 0]
[-4, 0]
[-4, 0]
[-4, 0]
[-5, 0]
[-4, 0]
[0, 0]
[0, 0]
[0, 0]
[0, 0]
[0, 0]
[0, 0]
[0, 0]
[0, 0]
[0, 0]
[0, 0]
[0, 0]
[0, 0]
[0, 0]
[0, 0]
[0, 0]
[0, 0]
[0, 0]
[0, 0]
[0, 0]
[0, 0]
[0, 0]
[0, 0]
[0, 0]
[0, 0]
[0, 0]
[0, 0]
[0, 0]
[0, 0]
[0, 0]
[0, 0]
[0, 0]
[0, 0]
[0, 0]
[0, 0]
[0, 0]
[0, 0]
[0, 0]
[0, 0]
[0, 0]
[0, 0]
[0, 0]
[0, 0]
[0, 0]
[0, 0]
[0, 0]
[0, 0]
[0, 0]
[0, 0]
[0, 0]
[0, 0]
[0, 0]
[0, 0]
[0, 0]
[0, 0]
[0, 0]
[0, 0]
[0, 0]
[0, 0]
[0, 0]
[0, 0]
[0, 0]
[0, 0]
[0, 0]
[0, 0]
[0, 0]
[0, 0]
[0, 0]
[0, 0]
[0, 0]
[0, 0]
[0, 0]
[0, 0]
[0, 0]
[0, 0]
[0, 0]
[0, 0]
[0, 0]
[0, 0]
[0, 0]
[0, 0]
[0, 0]
[0, 0]
[0, 0]
[0, 0]
[0, 0]
[0, 0]
[0, 0]
[0, 0]
[0, 0]
[0, 0]
[0, 0]
[0, 0]
[0, 0]
[0, 0]
[0, 0]
[0, 0]
[0, 0]
[0, 0]
[0, 0]
[0, 0]
[0, 0]
[0, 0]
[0, 0]
[0, 0]
[0, 0]
[0, 0]
[0, 0]
[0, 0]
[0, 0]
[0, 0]
[0, 0]
[0, 0]
[0, 0]
[0, 0]
[0, 0]
[0, 0]
[0, 0]
[0, 0]
[0, 0]
[0, 0]
[0, 0]
[0, 0]
[0, 0]
[0, 0]
[0, 0]
[0, 0]
[0, 0]
[0, 0]
[0, 0]
[0, 0]
[0, 0]
[0, 0]
[0, 0]
[0, 0]
[0, 0]
[0, 0]
[0, 0]
[0, 0]
[0, 0]
[0, 0]
[0, 0]
[0, 0]
[0, 0]
[0, 0]
[-4, 0]
[-4, 0]
[-4, 0]
[-4, 0]
[-4, 0]
[-4, 0]
[-4, 0]
[-4, 0]
[-5, 0]
[-4, 0]
[-4, 0]
[-4, 0]
[-4, 0]
[0, 0]
[0, 0]
[0, 0]
[0, 0]
[0, 0]
[0, 0]
[0, 0]
[0, 0]
[0, 0]
[0, 0]
[0, 0]
[0, 0]
[0, 0]
[0, 0]
[0, 0]
[0, 0]
[0, 0]
[0, 0]
[0, 0]
[0, 0]
[0, 0]
[0, 0]
[0, 0]
[0, 0]
[0, 0]
[0, 0]
[0, 0]
[0, 0]
[0, 0]
[0, 0]
[0, 0]
[0, 0]
[0, 0]
[0, 0]
[0, 0]
[0, 0]
[0, 0]
[0, 0]
[0, 0]
[0, 0]
[0, 0]
[0, 0]
[0, 0]
[0, 0]
[0, 0]
[0, 0]
[0, 0]
[0, 0]
[0, 0]
[0, 0]
[0, 0]
[0, 0]
[0, 0]
[0, 0]
[0, 0]
[0, 0]
[0, 0]
[0, 0]
[0, 0]
[0, 0]
[0, 0]
[0, 0]
[0, 0]
[0, 0]
[0, 0]
[0, 0]
[0, 0]
[0, 0]
[0, 0]
[0, 0]
[0, 0]
[0, 0]
[0, 0]
[0, 0]
[0, 0]
[0, 0]
[0, 0]
[0, 0]
[0, 0]
[0, 0]
[0, 0]
[0, 0]
[0, 0]
[0, 0]
[0, 0]
[0, 0]
[0, 0]
[0, 0]
[0, 0]
[0, 0]
[0, 0]
[0, 0]
[0, 0]
[0, 0]
[0, 0]
[0, 0]
[0, 0]
[0, 0]
[0, 0]
[0, 0]
[0, 0]
[0, 0]
[0, 0]
[0, 0]
[0, 0]
[0, 0]
[0, 0]
[0, 0]
[0, 0]
[0, 0]
[0, 0]
[0, 0]
[0, 0]
[0, 0]
[0, 0]
[0, 0]
[0, 0]
[0, 0]
[0, 0]
[0, 0]
[0, 0]
[0, 0]
[0, 0]
[0, 0]
[0, 0]
[0, 0]
[0, 0]
[0, 0]
[0, 0]
[0, 0]
[0, 0]
[0, 0]
[0, 0]
[0, 0]
[0, 0]
[0, 0]
[0, 0]
[0, 0]
[0, 0]
[0, 0]
[0, 0]
[0, 0]
[0, 0]
[0, 0]
[0, 0]
[0, 0]
[0, 0]
[0, 0]
[0, 0]
[0, 0]
[0, 0]
[0, 0]
[0, 0]
[0, 0]
[0, 0]
[0, 0]
[0, 0]
[0, 0]
[0, 0]
[0, 0]
[0, 0]
[0, 0]
[0, 0]
[0, 0]
[0, 0]
[0, 0]
[0, 0]
[0, 0]
[0, 0]
[0, 0]
[0, 0]
[0, 0]
[0, 0]
[0, 0]
[0, 0]
[0, 0]
[0, 0]
[0, 0]
[0, 0]
[0, 0]
[0, 0]
[0, 0]
[0, 0]
[0, 0]
[0, 0]
[0, 0]
[0, 0]
[0, 0]
[0, 0]
[0, 0]
[0, 0]
[0, 0]
[0, 0]
[0, 0]
[0, 0]
[0, 0]
[0, 0]
[0, 0]
[0, 0]
[0, 0]
[0, 0]
[0, 0]
[0, 0]
[0, 0]
[0, 0]
[0, 0]
[0, 0]
[0, 0]
[0, 0]
[0, 0]
[0, 0]
[0, 0]
[0, 0]
[0, 0]
[0, 0]
[0, 0]
[0, 0]
[0, 0]
[0, 0]
[0, 0]
[0, 0]
[0, 0]
[0, 0]
[0, 0]
[0, 0]
[0, 0]
[0, 0]
[0, 0]
[0, 0]
[0, 0]
[0, 0]
[0, 0]
[0, 0]
[0, 0]
[0, 0]
[0, 0]
[0, 0]
[0, 0]
[0, 0]
[0, 0]
[0, 0]
[0, 0]
[0, 0]
[0, 0]
[0, 0]
[0, 0]
[0, 0]
[0, 0]
[0, 0]
[0, 0]
[0, 0]
[0, 0]
[0, 0]
[0, 0]
[0, 0]
[0, 0]
[0, 0]
[0, 0]
[0, 0]
[0, 0]
[0, 0]
[0, 0]
[0, 0]
[0, 0]
[0, 0]
[0, 0]
[0, 0]
[0, 0]
[0, 0]
[0, 0]
[0, 0]
[0, 0]
[0, 0]
[0, 0]
[0, 0]
[0, 0]
[0, 0]
[0, 0]
[0, 0]
[0, 0]
[0, 0]
[0, 0]
[0, 0]
[0, 0]
[0, 0]
[0, 0]
[0, 0]
[0, 0]
[0, 0]
[0, 0]
[0, 0]
[0, 0]
[0, 0]
[0, 0]
[0, 0]
[0, 0]
[0, 0]
[0, 0]
[0, 0]
[0, 0]
[0, 0]
[0, 0]
[0, 0]
[0, 0]
[0, 0]
[0, 0]
[0, 0]
[0, 0]
[0, 0]
[0, 0]
[0, 0]
[0, 0]
[0, 0]
[0, 0]
[0, 0]
[0, 0]
[0, 0]
[0, 0]
[0, 0]
[0, 0]
[0, 0]
[0, 0]
[0, 0]
[0, 0]
[0, 0]
[0, 0]
[0, 0]
[0, 0]
[0, 0]
[0, 0]
[0, 0]
[0, 0]
[0, 0]
[0, 0]
[0, 0]
[0, 0]
[0, 0]
[0, 0]
[0, 0]
[0, 0]
[0, 0]
[0, 0]
[0, 0]
[0, 0]
[0, 0]
[0, 0]
[0, 0]
[0, 0]
[0, 0]
[0, 0]
[0, 0]
[0, 0]
[0, 0]
[0, 0]
[0, 0]
[0, 0]
[0, 0]
[0, 0]
[0, 0]
[0, 0]
[0, 0]
[0, 0]
[0, 0]
[0, 0]
[0, 0]
[0, 0]
[0, 0]
[0, 0]
[0, 0]
[0, 0]
[0, 0]
[0, 0]
[0, 0]
[0, 0]
[0, 0]
[0, 0]
[0, 0]
[0, 0]
[0, 0]
[0, 0]
[0, 0]
[0, 0]
[0, 0]
[0, 0]
[0, 0]
[0, 0]
[0, 0]
[0, 0]
[0, 0]
[0, 0]
[0, 0]
[0, 0]
[0, 0]
[0, 0]
[0, 0]
[0, 0]
[0, 0]
[0, 0]
[0, 0]
[0, 0]
[0, 0]
[0, 0]
[0, 0]
[0, 0]
[0, 0]
[0, 0]
[0, 0]
[0, 0]
[-4, 0]
[-4, 0]
[-4, 0]
[-4, 0]
[-4, 0]
[-5, 0]
[-4, 0]
[-4, 0]
[-4, 0]
[-4, 0]
[-4, 0]
[-4, 0]
[-4, 0]
[-4, 0]
[-4, 0]
[-5, 0]
[0, 0]
[0, 0]
[0, 0]
[0, 0]
[0, 0]
[0, 0]
[0, 0]
[0, 0]
[0, -6]
[0, -6]
[0, -7]
[0, -6]
[0, -5]
[0, -6]
[0, -6]
[0, -6]
[0, -5]
[0, -5]
[0, -6]
[0, -5]
[0, -5]
[0, -5]
[0, -5]
[0, -5]
[0, -4]
[0, -5]
[0, -4]
[0, -5]
[0, -4]
[0, -4]
[0, -4]
[0, -4]
[0, -4]
[0, -4]
[0, -4]
[0, -3]
[0, -4]
[0, -3]
[0, -4]
[0, -3]
[0, -3]
[0, -3]
[0, -3]
[0, -3]
[0, -2]
[-4, -3]
[-4, -2]
[-4, -3]
[-4, -2]
[-4, -2]
[-4, -2]
[-4, -2]
[-4, -2]
[-4, -1]
[-5, 0]
[-4, 0]
[-4, 0]
[-4, 0]
[-4, 0]
[-4, 1]
[-4, 0]
[-4, 0]
[-4, 0]
[-4, 1]
[-5, 1]
[-4, 0]
[-4, 1]
[-4, 1]
[-4, 1]
[-4, 1]
[-4, 1]
[-4, 2]
[-4, 1]
[-4, 1]
[-5, 2]
[-4, 2]
[-4, 2]
[-4, 1]
[-4, 2]
[-4, 3]
[-4, 2]
[-4, 2]
[-4, 2]
[-4, 3]
[0, 3]
[0, 2]
[0, 3]
[0, 3]
[0, 3]
[0, 3]
[0, 0]
[0, 0]
[0, 0]
[0, 0]
[0, 0]
[0, 0]
[0, 0]
[0, 0]
[0, 0]
[0, 0]
[0, 0]
[0, 0]
[0, 0]
[0, 0]
[0, 0]
[0, 0]
[0, 0]
[0, 0]
[0, 0]
[0, 0]
[0, -13]
[0, -12]
[0, -12]
[0, -13]
[0, -12]
[0, -12]
[0, -12]
[0, -12]
[0, -12]
[0, -11]
[0, -12]
[0, -11]
[0, -12]
[0, -11]
[0, -11]
[0, -11]
[0, -11]
[0, -11]
[0, -11]
[0, -11]
[0, -10]
[0, -11]
[0, -10]
[0, -10]
[0, -11]
[0, -10]
[0, -10]
[0, -10]
[0, -9]
[0, -10]
[0, -10]
[0, -9]
[0, -10]
[0, -9]
[0, -9]
[0, -9]
[0, -9]
[0, -9]
[0, -9]
[0, -9]
[0, -8]
[0, -9]
[0, -8]
[0, -8]
[0, -8]
[0, -9]
[0, -8]
[0, -7]
[0, -8]
[0, -8]
[0, -8]
[0, -7]
[0, -7]
[0, -8]
[0, -7]
[0, -7]
[0, -7]
[0, -7]
[0, -7]
[0, -6]
[0, -7]
[0, -6]
[0, -7]
[0, -6]
[0, -6]
[0, -6]
[0, -6]
[0, -6]
[0, -2]
[0, 0]
[0, 0]
[0, 0]
[0, 0]
[0, 0]
[0, 1]
[0, 0]
[0, 0]
[0, 0]
[0, 1]
[0, 1]
[0, 0]
[0, 1]
[0, 1]
[0, 1]
[0, 1]
[0, 1]
[0, 2]
[0, 1]
[0, 1]
[0, 2]
[0, 2]
[0, 2]
[0, 1]
[0, 2]
[0, 3]
[0, 2]
[0, 2]
[0, 2]
[0, 3]
[0, 3]
[0, 2]
[0, 3]
[0, 3]
[0, 3]
[0, 3]
[0, 3]
[0, 4]
[0, 3]
[0, 3]
[0, 4]
[0, 4]
[0, 4]
[0, 3]
[0, 4]
[0, 5]
[0, 4]
[0, 4]
[0, 4]
[0, 5]
[0, 5]
[0, 4]
[0, 5]
[0, 5]
[0, 5]
[0, 5]
[0, 5]
[0, 6]
[0, 5]
[0, 5]
[0, 6]
[0, 6]
[0, 6]
[0, 5]
[0, 6]
[0, 7]
[0, 6]
[0, 6]
[0, 6]
[0, 7]
[0, 7]
[0, 6]
[0, 7]
[0, 7]
[0, 7]
[0, 7]
[0, 7]
[0, 8]
[0, 7]
[0, 7]
[0, 8]
[0, 8]
[0, 8]
[0, 7]
[0, 8]
[0, 9]
[0, 8]
[0, 8]
[0, 8]
[0, 9]
[0, 9]
[0, 8]
[0, 9]
[0, 9]
[0, 9]
[0, 9]
[0, 9]
[0, 10]
[0, 9]
[0, 9]
[0, 10]
[0, 10]
[0, 10]
[0, 9]
[0, 10]
[0, 11]
[0, 10]
[0, 10]
[0, 10]
[0, 11]
[0, 11]
[0, 10]
[0, 11]
[0, 11]
[0, 11]
[0, 11]
[0, 8]
[0, 0]
[0, 0]
[0, 0]
[0, 0]
[0, 0]
[0, 0]
[0, 0]
[0, 0]
[0, 0]
[0, 0]
[0, 0]
[0, 0]
[0, 0]
[0, 0]
[0, 0]
[0, 0]
[0, 0]
[0, 0]
[0, 0]
[0, 0]
[0, 0]
[0, 0]
[0, 0]
[0, 0]
[0, 0]
[0, -12]
[0, -13]
[0, -12]
[0, -13]
[0, -12]
[0, -12]
[0, -12]
[0, -12]
[0, -11]
[0, -12]
[0, -12]
[0, -11]
[0, -12]
[0, -11]
[0, -11]
[0, -11]
[0, -11]
[0, -11]
[0, -11]
[0, -11]
[0, -10]
[0, -11]
[0, -10]
[0, -10]
[0, -10]
[4, -11]
[4, -10]
[4, -9]
[4, -10]
[4, -10]
[4, -10]
[4, -9]
[4, -9]
[4, -10]
[5, -9]
[4, -9]
[4, -9]
[4, -9]
[4, -9]
[4, -8]
[4, -9]
[4, -8]
[1, -9]
[0, -8]
[0, -8]
[0, -8]
[0, -8]
[0, -8]
[0, -8]
[0, -8]
[0, -7]
[0, -8]
[0, -7]
[0, -8]
[0, -7]
[0, -7]
[0, -7]
[0, -7]
[0, -6]
[0, -7]
[0, -7]
[0, -6]
[0, -7]
[0, -6]
[0, -6]
[0, -6]
[0, -6]
[0, -6]
[0, -6]
[0, -6]
[0, -5]
[0, -6]
[0, -5]
[0, -5]
[0, -5]
[0, -6]
[0, -5]
[0, -4]
[0, -5]
[0, -5]
[0, -5]
[0, -4]
[0, -4]
[0, -5]
[0, -4]
[0, -4]
[0, -4]
[0, -4]
[0, -4]
[0, -3]
[0, -4]
[0, -3]
[0, -4]
[0, -3]
[0, -3]
[0, -3]
[0, -3]
[-4, -3]
[-4, -3]
[-4, -3]
[-4, -2]
[-4, -3]
[-4, -2]
[-4, -3]
[-4, -2]
[-5, -2]
[-4, -2]
[-4, -2]
[-4, -1]
[-4, -2]
[-4, -2]
[-4, -1]
[-4, -2]
[-4, -1]
[-4, -1]
[-5, -1]
[-4, -1]
[0, -1]
[0, -1]
[0, -1]
[0, 0]
[0, -1]
[0, 0]
[0, 0]
[0, 0]
[0, -1]
[0, 0]
[0, 1]
[0, 0]
[0, 0]
[0, 0]
[0, 1]
[0, 1]
[0, 0]
[0, 1]
[0, 1]
[0, 1]
[0, 1]
[0, 1]
[0, 2]
[0, 1]
[0, 2]
[0, 1]
[0, 2]
[0, 2]
[0, 2]
[0, 2]
[0, 2]
[0, 2]
[0, 2]
[0, 3]
[0, 2]
[0, 3]
[0, 2]
[0, 3]
[0, 3]
[0, 3]
[0, 3]
[0, 4]
[0, 3]
[0, 3]
[0, 4]
[0, 3]
[0, 4]
[0, 4]
[0, 4]
[0, 4]
[0, 4]
[0, 4]
[0, 4]
[0, 4]
[0, 0]
[0, 0]
[0, 0]
[0, 0]
[0, 0]
[0, 0]
[0, 0]
[0, 0]
[0, 0]
[0, 0]
[0, 0]
[0, 0]
[0, 0]
[0, 0]
[0, 0]
[0, 0]
[0, 0]
[0, 0]
[0, 0]
[0, 0]
[0, 0]
[0, 0]
[0, 0]
[0, 0]
[0, 0]
[0, 0]
[0, 0]
[0, 0]
[0, 0]
[0, 0]
[0, 0]
[0, 0]
[0, 0]
[0, 0]
[0, 0]
[0, 0]
[0, 0]
[0, 0]
[0, 0]
[0, 0]
[0, 0]
[0, 0]
[0, 0]
[0, 0]
[0, 0]
[0, 0]
[0, 0]
[0, 0]
[0, 0]
[0, 0]
[0, 0]
[0, 0]
[0, 0]
[0, 0]
[0, 0]
[0, 0]
[0, 0]
[0, 0]
[0, 0]
[0, 0]
[0, 0]
[0, 0]
[0, 0]
[0, 0]
[0, 0]
[0, 0]
[0, 0]
[0, 0]
[0, 0]
[0, 0]
[0, 0]
[0, 0]
[0, 0]
[0, 0]
[0, 0]
[0, 0]
[0, 0]
[0, 0]
[0, 0]
[0, 0]
[0, 0]
[0, 0]
[0, 0]
[0, 0]
[0, 0]
[0, 0]
[0, 0]
[0, 0]
[0, 0]
[0, 0]
[0, 0]
[0, 0]
[0, 0]
[0, 0]
[0, 0]
[0, 0]
[0, 0]
[0, 0]
[0, 0]
[0, 0]
[0, 0]
[0, 0]
[0, 0]
[0, 0]
[0, 0]
[0, -13]
[0, -12]
[0, -13]
[0, -12]
[0, -12]
[0, -12]
[0, -12]
[0, -12]
[0, -12]
[0, -12]
[0, -11]
[0, -12]
[0, -11]
[0, -11]
[0, -11]
[0, -2]
[0, 1]
[0, 0]
[0, 0]
[0, 0]
[0, 1]
[0, 1]
[0, 0]
[0, 1]
[0, 1]
[0, 1]
[4, 1]
[5, 1]
[4, 2]
[4, 1]
[4, 1]
[4, 2]
[4, 2]
[4, 2]
[4, 1]
[4, 2]
[4, 3]
[5, 2]
[4, 2]
[4, 2]
[4, 3]
[4, 3]
[4, 2]
[4, 3]
[4, 3]
[4, 3]
[0, -34]
[5, 0]
[4, 0]
[4, 1]
[4, 0]
[4, 0]
[4, 1]
[4, 1]
[4, 1]
[4, 0]
[4, 1]
[5, 2]
[4, 1]
[4, 1]
[4, 1]
[4, 2]
[0, 2]
[0, 1]
[0, 2]
[0, 0]
[0, 0]
[0, 0]
[0, 0]
[0, 0]
[0, 0]
[0, 0]
[0, 0]
[0, 0]
[0, 0]
[0, 0]
[0, 0]
[0, 0]
[0, 0]
[0, 0]
[0, 0]
[0, 0]
[0, 0]
[-4, 0]
[-4, 0]
[-4, 0]
[-4, 0]
[-5, 0]
[-4, 0]
[-4, 0]
[-4, 0]
[-4, 0]
[-4, 0]
[-4, 0]
[-4, 0]
[-4, 0]
[-4, 0]
[-5, 0]
[-4, 0]
[-4, 0]
[-4, 1]
[-4, 0]
[-4, 1]
[-4, 0]
[-4, 1]
[-4, 1]
[-4, 1]
[-5, 1]
[-4, 1]
[-4, 1]
[-4, 1]
[-4, 2]
[-4, 1]
[-4, 2]
[-4, 1]
[-4, 2]
[0, 2]
[0, 2]
[0, 2]
[0, 2]
[0, 3]
[0, 2]
[0, 3]
[0, 2]
[0, 3]
[0, 3]
[0, 3]
[0, 3]
[0, 3]
[0, 3]
[0, 3]
[0, 4]
[0, 3]
[0, 4]
[0, 3]
[0, 4]
[0, 4]
[0, 4]
[0, 4]
[0, 4]
[0, 5]
[0, 4]
[0, 5]
[0, 4]
[0, 5]
[0, 5]
[0, 5]
[0, 5]
[0, 5]
[0, 5]
[0, 5]
[0, 6]
[0, 1]
[0, 0]
[0, 0]
[0, 0]
[0, 0]
[0, 0]
[0, 0]
[0, 0]
[0, 0]
[0, 0]
[0, 0]
[0, 0]
[0, 0]
[0, 0]
[0, 0]
[0, 0]
[0, 0]
[0, 0]
[0, 0]
[0, 0]
[0, 0]
[0, 0]
[0, 0]
[0, 0]
[0, 0]
[0, 0]
[0, 0]
[0, 0]
[0, 0]
[0, 0]
[0, 0]
[0, 0]
[0, 0]
[0, 0]
[0, 0]
[0, 0]
[0, 0]
[0, 0]
[0, 0]
[0, 0]
[0, 0]
[0, 0]
[0, 0]
[0, 0]
[0, 0]
[0, 0]
[0, 0]
[0, 0]
[0, 0]
[0, 0]
[0, 0]
[0, 0]
[0, 0]
[0, 0]
[0, 0]
[0, 0]
[0, 0]
[0, 0]
[0, 0]
[0, 0]
[0, 0]
[0, 0]
[0, 0]
[0, 0]
[0, 0]
[0, 0]
[0, 0]
[0, 0]
[0, 0]
[0, 0]
[0, 0]
[0, 0]
[0, 0]
[0, 0]
[0, 0]
[0, 0]
[0, 0]
[0, 0]
[0, 0]
[0, 0]
[0, 0]
[0, 0]
[0, 0]
[0, 0]
[0, 0]
[0, 0]
[0, 0]
[0, 0]
[0, 0]
[0, 0]
[0, 0]
[0, 0]
[0, 0]
[0, 0]
[0, 0]
[0, 0]
[0, 0]
[0, 0]
[0, 0]
[0, 0]
[0, 0]
[0, 0]
[0, 0]
[0, 0]
[0, 0]
[0, 0]
[0, 0]
[0, 0]
[0, -13]
[0, -12]
[0, -12]
[0, -13]
[0, -12]
[4, -12]
[4, -12]
[4, -12]
[4, -12]
[4, -11]
[4, -12]
[4, -11]
[4, -12]
[5, -11]
[4, -11]
[4, -11]
[4, -11]
[4, -11]
[4, -11]
[4, -11]
[4, -10]
[4, -11]
[4, -10]
[5, -11]
[4, -10]
[4, -10]
[4, -10]
[4, -10]
[4, -9]
[4, -10]
[4, -10]
[4, -9]
[4, -10]
[5, -9]
[4, -9]
[4, -9]
[4, -9]
[4, -9]
[4, -9]
[4, -9]
[4, -8]
[4, -9]
[4, -8]
[5, -8]
[4, -9]
[4, -8]
[4, -8]
[4, -7]
[4, -8]
[4, -8]
[4, -8]
[4, -7]
[4, -7]
[5, -8]
[4, -7]
[4, -7]
[4, -7]
[4, -7]
[4, -7]
[4, -6]
[4, -7]
[4, -6]
[4, -7]
[5, -6]
[4, -6]
[4, -6]
[4, -6]
[4, -6]
[4, -6]
[4, -6]
[4, -5]
[4, -6]
[4, -5]
[5, -6]
[4, -5]
[4, -5]
[4, -5]
[4, -5]
[4, -4]
[4, -5]
[4, -5]
[4, -4]
[4, -5]
[4, -4]
[0, -4]
[0, -4]
[0, -4]
[0, -4]
[0, -25]
[4, 0]
[4, 0]
[4, 0]
[4, 0]
[0, 0]
[0, 0]
[-4, 0]
[-4, 0]
[-4, 0]
[-4, 0]
[-4, 0]
[-4, 0]
[-4, 1]
[-4, 0]
[-4, 0]
[-5, 1]
[-4, 1]
[-4, 1]
[-4, 0]
[-4, 1]
[-4, 2]
[-4, 1]
[-4, 1]
[-4, 1]
[0, 2]
[0, 2]
[0, 1]
[0, 2]
[0, 2]
[0, 2]
[4, 2]
[4, 2]
[4, 3]
[4, 2]
[4, 2]
[4, 3]
[4, 3]
[4, 3]
[5, 2]
[4, 3]
[4, 4]
[4, 3]
[4, 3]
[4, 3]
[0, 4]
[0, 4]
[0, 3]
[4, 4]
[5, 4]
[4, 4]
[4, 4]
[4, 4]
[4, 5]
[4, 4]
[4, 4]
[4, 5]
[4, 5]
[0, 5]
[0, 4]
[0, 5]
[0, 6]
[0, 5]
[0, 5]
[0, 5]
[0, 6]
[0, 6]
[0, 5]
[0, 6]
[0, 6]
[0, 6]
[0, 6]
[0, 6]
[0, 7]
[0, 6]
[0, 6]
[0, 7]
[0, 7]
[0, 7]
[0, 6]
[0, 7]
[0, 8]
[-4, 7]
[-4, 7]
[-4, 7]
[-4, 8]
[-4, 8]
[-4, 7]
[-4, 0]
[-4, 0]
[-5, 0]
[-4, 0]
[-4, 0]
[-4, 0]
[-4, 0]
[-4, 0]
[-4, 0]
[-4, 0]
[-4, 0]
[-4, 0]
[-5, 0]
[-4, 0]
[-4, 0]
[-4, 0]
[-4, 0]
[-4, 0]
[-4, 1]
[-4, 0]
[-4, 0]
[-4, 1]
[-5, 0]
[-4, 1]
[-4, 1]
[-4, 1]
[-4, 1]
[-4, 1]
[-4, 1]
[-4, 1]
[-4, 2]
[-4, 1]
[-5, 2]
[-4, 2]
[-4, 1]
[-4, 2]
[-4, 2]
[-4, 2]
[-4, 3]
[-4, 2]
[-4, 2]
[-4, 3]
[-5, 2]
[-4, 3]
[-4, 3]
[-4, 3]
[-4, 3]
[-4, 3]
[-4, 3]
[-4, 3]
[-4, 4]
[-4, 3]
[-4, 4]
[0, 4]
[0, 3]
[0, 4]
[0, 4]
[0, 4]
[0, 5]
[0, 4]
[0, 4]
[0, 5]
[0, 4]
[0, 5]
[0, 5]
[0, 5]
[0, 5]
[0, 5]
[0, 5]
[0, 5]
[0, 6]
[0, 5]
[0, 6]
[0, 6]
[0, 5]
[0, 6]
[0, 6]
[0, 6]
[0, 7]
[0, 6]
[0, 6]
[0, 7]
[0, 6]
[0, 7]
[0, 7]
[0, 7]
[0, 7]
[0, 7]
[0, 7]
[0, 7]
[0, 8]
[0, 7]
[0, 8]
[0, 7]
[0, 0]
[0, 0]
[0, 0]
[0, 0]
[0, 0]
[0, 0]
[0, 0]
[0, 0]
[0, 0]
[0, 0]
[0, 0]
[0, 0]
[0, 0]
[0, 0]
[0, 0]
[0, 0]
[0, 0]
[0, 0]
[0, 0]
[0, 0]
[0, 0]
[0, 0]
[0, 0]
[0, 0]
[0, 0]
[0, 0]
[0, 0]
[-4, 0]
[-4, 0]
[-4, 0]
[-4, 0]
[-4, 0]
[-4, 0]
[-4, 0]
[-4, 0]
[-4, 0]
[-5, 0]
[-4, 0]
[-4, 0]
[-4, 0]
[-4, 0]
[-4, 0]
[-4, 0]
[-4, 1]
[-4, 0]
[-4, 1]
[0, 0]
[0, 1]
[0, 1]
[0, 1]
[0, 1]
[0, 1]
[0, 2]
[0, 1]
[0, 2]
[0, 1]
[0, 2]
[0, 2]
[0, 2]
[0, 2]
[0, 2]
[0, 2]
[0, 2]
[0, 3]
[0, 2]
[0, 3]
[0, 2]
[0, 3]
[0, 3]
[0, 3]
[0, 3]
[0, 3]
[0, 4]
[0, 3]
[0, 4]
[0, 3]
[0, 4]
[0, 4]
[0, 4]
[0, 4]
[0, 4]
[0, 4]
[0, 4]
[0, 5]
[0, 4]
[0, 5]
[0, 4]
[0, 5]
[0, 5]
[0, 5]
[0, 5]
[0, 5]
[0, 6]
[0, 5]
[0, 2]
[0, 0]
[0, 0]
[0, 0]
[0, 0]
[0, 0]
[0, 0]
[0, 0]
[0, 0]
[0, 0]
[0, 0]
[0, 0]
[0, 0]
[0, 0]
[0, 0]
[0, 0]
[0, 0]
[0, 0]
[0, 0]
[0, 0]
[0, 0]
[0, 0]
[0, 0]
[0, 0]
[0, 0]
[0, 0]
[0, 0]
[0, 0]
[0, 0]
[0, 0]
[0, 0]
[0, 0]
[0, -13]
[0, -13]
[0, -12]
[0, -12]
[0, -12]
[0, -13]
[0, -12]
[0, -11]
[0, -12]
[0, -12]
[0, -11]
[4, -12]
[4, -11]
[4, -12]
[4, -11]
[4, -11]
[4, -11]
[4, -11]
[4, -11]
[4, -10]
[5, -11]
[4, -10]
[4, -11]
[4, -10]
[4, -10]
[4, -10]
[4, -10]
[4, -10]
[4, -10]
[4, -10]
[5, -9]
[4, -10]
[4, -9]
[4, -9]
[4, -10]
[4, -9]
[4, -9]
[4, -9]
[4, -8]
[4, -9]
[5, -9]
[4, -8]
[4, -9]
[4, -8]
[4, -8]
[4, -8]
[4, -8]
[4, -8]
[4, -8]
[4, -7]
[5, -8]
[4, -8]
[4, -7]
[4, -7]
[4, -7]
[4, -8]
[4, -7]
[4, -6]
[4, -7]
[4, -7]
[5, -6]
[4, -7]
[4, -6]
[4, -7]
[4, -6]
[4, -6]
[4, -6]
[4, -6]
[0, -6]
[0, -5]
[0, -6]
[0, -5]
[-4, -6]
[-4, -5]
[-4, -5]
[-4, -5]
[-4, -5]
[-4, -5]
[-4, -5]
[-5, -5]
[-4, -4]
[-4, -5]
[-4, -4]
[-4, -4]
[-4, -5]
[-3, -4]
[0, -4]
[0, -4]
[0, -3]
[0, -4]
[0, -4]
[0, -3]
[0, -4]
[4, -3]
[4, -3]
[4, -3]
[4, -3]
[4, -3]
[4, -3]
[4, -2]
[4, -3]
[5, -3]
[4, -2]
[4, -2]
[4, -2]
[4, -3]
[4, -2]
[4, -1]
[4, -2]
[4, -2]
[4, -1]
[5, -2]
[4, -1]
[4, -2]
[4, -1]
[4, -1]
[4, -1]
[4, -1]
[4, -1]
[4, 0]
[4, -1]
[5, 0]
[4, -1]
[4, 0]
[0, 0]
[0, 0]
[0, 0]
[0, 0]
[0, 0]
[0, 0]
[0, 1]
[0, 0]
[0, 1]
[0, 1]
[0, 0]
[0, 1]
[0, 1]
[0, 1]
[0, 2]
[0, 1]
[0, 1]
[0, 2]
[0, 1]
[0, 2]
[0, 2]
[0, 2]
[0, 2]
[0, 2]
[0, 2]
[0, 3]
[0, 2]
[0, 2]
[0, 3]
[0, 3]
[0, 3]
[0, 2]
[0, 3]
[0, 3]
[0, 0]
[0, 0]
[0, 0]
[0, 0]
[0, 0]
[0, 0]
[0, 0]
[0, 0]
[0, 0]
[0, 0]
[0, 0]
[0, 0]
[0, 0]
[0, 0]
[0, 0]
[0, 0]
[0, 0]
[0, 0]
[0, 0]
[0, 0]
[0, 0]
[0, -13]
[0, -12]
[0, -13]
[0, -12]
[0, -12]
[0, -12]
[0, -12]
[0, -12]
[0, -12]
[0, -12]
[0, -11]
[0, -12]
[0, -11]
[0, -12]
[0, -11]
[0, -11]
[0, -11]
[0, -11]
[0, -11]
[0, -10]
[0, -11]
[0, -10]
[0, -11]
[0, -10]
[0, -10]
[0, -10]
[0, -10]
[0, -10]
[0, -10]
[0, -10]
[0, -9]
[0, -10]
[-4, -9]
[-4, -9]
[-5, -10]
[-4, -9]
[-4, -9]
[-4, -9]
[-4, -8]
[-4, -9]
[-4, -9]
[-4, -8]
[-4, -8]
[-4, -9]
[-5, -8]
[-4, -8]
[-4, -8]
[-4, -8]
[-4, -8]
[-4, -7]
[-4, -8]
[-4, -7]
[-4, -8]
[-4, -7]
[-5, -7]
[-4, -7]
[-4, -7]
[-4, -7]
[-4, -7]
[-4, -7]
[-4, -6]
[-4, -7]
[-4, -6]
[-4, -7]
[-5, -6]
[-4, -6]
[-4, -6]
[-4, -6]
[-4, -6]
[-4, -5]
[-4, -6]
[-4, -5]
[-4, -6]
[0, -5]
[0, -5]
[0, -5]
[0, -5]
[0, -5]
[0, -5]
[0, -5]
[0, -4]
[0, -5]
[0, -4]
[0, -4]
[0, -5]
[0, -4]
[0, -4]
[0, -4]
[0, -3]
[0, -4]
[0, -4]
[0, -3]
[0, -3]
[0, -4]
[0, -3]
[0, -3]
[0, -3]
[0, -3]
[0, -3]
[0, -2]
[0, -3]
[0, -2]
[0, -3]
[0, -2]
[0, -2]
[0, -2]
[0, -2]
[0, -2]
[0, -2]
[0, -2]
[0, -1]
[0, -2]
[0, -1]
[0, -2]
[0, -1]
[0, -1]
[0, -1]
[0, -1]
[0, -1]
[0, 0]
[0, -1]
[0, 0]
[0, -1]
[0, 0]
[0, 0]
[0, 0]
[0, 0]
[0, 0]
[0, 0]
[0, 0]
[0, 1]
[0, 0]
[0, 1]
[0, 1]
[0, 0]
[0, 1]
[0, 1]
[0, 1]
[0, 2]
[0, 1]
[0, 1]
[0, 2]
[0, 2]
[0, 1]
[0, 2]
[0, 2]
[0, 2]
[0, 2]
[0, 2]
[0, 3]
[0, 2]
[0, 3]
[0, 2]
[0, 3]
[0, 3]
[0, 3]
[0, 3]
[0, 3]
[0, 3]
[0, 3]
[0, 4]
[0, 3]
[0, 4]
[0, 3]
[0, 4]
[0, 4]
[0, 4]
[0, 4]
[-4, 4]
[-5, 5]
[-4, 4]
[-4, 5]
[-4, 4]
[-4, 5]
[-4, 5]
[-4, 5]
[-4, 5]
[-4, 5]
[-4, 5]
[-5, 5]
[-4, 6]
[-4, 5]
[-4, 6]
[-4, 6]
[-4, 5]
[-4, 6]
[-4, 6]
[-4, 6]
[-4, 7]
[-5, 6]
[-4, 6]
[-4, 7]
[-4, 7]
[-4, 6]
[-4, 7]
[-4, 7]
[-4, 7]
[-4, 7]
[-4, 7]
[-5, 8]
[-4, 7]
[0, 8]
[0, 7]
[0, 8]
[0, 8]
[0, 8]
[0, 8]
[0, 8]
[0, 8]
[0, 8]
[0, 9]
[0, 8]
[0, 9]
[0, 8]
[0, 9]
[0, 9]
[0, 9]
[0, 9]
[0, 9]
[0, 10]
[0, 9]
[0, 10]
[0, 9]
[0, 10]
[0, 10]
[0, 10]
[0, 10]
[0, 10]
[0, 10]
[0, 10]
[0, 11]
[0, 10]
[0, 11]
[0, 11]
[0, 10]
[0, 11]
[0, 11]
[0, 11]
[0, 12]
[0, 11]
[0, 11]
[0, 12]
[0, 12]
[0, 11]
[0, 12]
[0, 12]
[0, 12]
[0, 12]
[0, 12]
[0, 13]
[0, 12]
[0, 13]
[0, 12]
[0, 13]
[0, 13]
[4, 13]
[5, 13]
[4, 13]
[4, 13]
[4, 13]
[4, 7]
[4, 0]
[4, 0]
[4, 0]
[4, 0]
[4, 0]
[5, 0]
[4, 0]
[0, 0]
[0, 0]
[0, 0]
[0, 0]
[0, 0]
[0, 0]
[0, 0]
[0, 0]
[0, 0]
[0, 0]
[0, 0]
[0, 0]
[0, 0]
[0, 0]
[0, 0]
[0, 0]
[0, 0]
[0, 0]
[0, 0]
[0, 0]
[0, 0]
[-4, 0]
[-5, 0]
[-4, 0]
[-4, 0]
[-4, 0]
[-4, 0]
[-4, 0]
[-4, 0]
[-4, 0]
[-4, 0]
[-4, 0]
[-5, 0]
[-4, 0]
[-4, 0]
[-4, 0]
[-4, 1]
[-4, 0]
[-4, 1]
[-4, 0]
[-4, 1]
[-4, 1]
[-5, 1]
[-4, 1]
[-4, 1]
[-4, 2]
[-4, 1]
[-4, 2]
[-4, 1]
[-4, 2]
[-4, 2]
[-4, 2]
[-5, 2]
[-4, 2]
[-4, 2]
[0, 2]
[0, 3]
[0, 2]
[0, 3]
[0, 2]
[0, 3]
[0, 3]
[0, 3]
[0, 3]
[0, 3]
[0, 4]
[0, 3]
[0, 4]
[0, 3]
[0, 4]
[0, 4]
[0, 4]
[0, 4]
[0, 4]
[0, 4]
[0, 4]
[0, 5]
[0, 4]
[0, 5]
[0, 4]
[0, 5]
[0, 5]
[0, 5]
[4, 5]
[4, 5]
[5, 6]
[4, 5]
[4, 6]
[4, 5]
[4, 6]
[4, 6]
[4, 6]
[4, 6]
[4, 6]
[4, 6]
[5, 5]
[4, 0]
[4, 0]
[0, 0]
[0, 0]
[0, 0]
[0, 0]
[0, 0]
[0, 0]
[0, 0]
[0, 0]
[0, 0]
[0, 0]
[0, 0]
[0, 0]
[0, 0]
[0, 0]
[0, 0]
[0, 0]
[0, 0]
[0, 0]
[0, 0]
[0, 0]
[0, 0]
[0, 0]
[0, 0]
[-4, 0]
[-4, 0]
[-5, 0]
[-4, 0]
[-4, 0]
[-4, 0]
[-4, 0]
[-4, 0]
[-4, 0]
[-4, 0]
[-4, 0]
[-4, 0]
[-5, 0]
[-4, 0]
[-4, 0]
[-4, 0]
[-4, 0]
[-4, 0]
[-4, 0]
[-4, 1]
[-4, 0]
[0, 1]
[0, 0]
[0, 1]
[0, 1]
[0, 1]
[0, 1]
[0, 1]
[0, 1]
[0, 1]
[0, 2]
[0, 1]
[0, 2]
[0, 1]
[0, 2]
[0, 2]
[0, 2]
[0, 2]
[0, 2]
[0, 3]
[0, 2]
[0, 3]
[0, 2]
[0, 3]
[0, 3]
[0, 3]
[0, 3]
[0, 3]
[0, 3]
[0, 3]
[0, 4]
[0, 3]
[0, 4]
[0, 3]
[0, 4]
[0, 4]
[0, 4]
[0, 4]
[0, 4]
[0, 5]
[0, 4]
[0, 5]
[0, 4]
[0, 5]
[0, 5]
[0, 5]
[0, 5]
[0, 5]
[0, 5]
[0, 5]
[0, 6]
[0, 5]
[0, 6]
[0, 5]
[0, 6]
[0, 6]
[0, 6]
[0, 6]
[0, 6]
[0, 5]
[0, 0]
[0, 0]
[0, 0]
[0, 0]
[0, 0]
[0, 0]
[0, 0]
[0, 0]
[0, 0]
[0, 0]
[0, 0]
[0, 0]
[0, 0]
[-4, 0]
[-5, 0]
[-4, 0]
[-4, 0]
[-4, 0]
[-4, 0]
[-4, 0]
[-4, 0]
[-4, 0]
[-4, 0]
[-4, 0]
[-5, 0]
[-4, 0]
[-4, 0]
[-4, 0]
[-4, 0]
[-4, 0]
[-4, 0]
[-4, 0]
[-4, 0]
[-4, 0]
[-5, 0]
[0, 0]
[0, 0]
[0, 1]
[0, 0]
[0, 1]
[0, 1]
[0, 0]
[0, 1]
[0, 1]
[0, 1]
[0, 2]
[0, 1]
[0, 1]
[0, 2]
[0, 1]
[0, 2]
[0, 2]
[0, 2]
[0, 2]
[0, 2]
[0, 2]
[0, 2]
[0, 3]
[0, 2]
[0, 3]
[0, 3]
[0, 2]
[0, 3]
[0, 3]
[0, 3]
[0, 4]
[0, 3]
[0, 3]
[0, 4]
[0, 3]
[0, 4]
[0, 4]
[0, 4]
[0, 4]
[0, 4]
[0, 4]
[0, 4]
[0, 5]
[0, 4]
[0, 5]
[0, 5]
[0, 4]
[0, 5]
[0, 5]
[0, 5]
[0, 6]
[0, 5]
[0, 5]
[0, 2]
[0, 0]
[0, 0]
[0, 0]
[0, 0]
[0, 0]
[0, 0]
[0, 0]
[0, 0]
[0, 0]
[-4, 0]
[-4, 0]
[-4, 0]
[-4, 0]
[-4, 0]
[-4, 0]
[-4, 0]
[-4, 0]
[-4, 0]
[-5, 0]
[-4, 0]
[-4, 0]
[-4, 0]
[-4, 0]
[-4, 0]
[-4, 0]
[-4, 0]
[-4, 0]
[-4, 0]
[-5, 0]
[-4, 0]
[-4, 0]
[-4, 0]
[-4, 0]
[-4, 0]
[-4, 0]
[-4, 1]
[-4, 0]
[-4, 1]
[-5, 1]
[-4, 0]
[-4, 1]
[-4, 1]
[-4, 1]
[-4, 2]
[-4, 1]
[-4, 1]
[-4, 2]
[-4, 1]
[-5, 2]
[-4, 2]
[-4, 2]
[-4, 2]
[-4, 2]
[-4, 2]
[-4, 2]
[-4, 3]
[-4, 2]
[-4, 3]
[-5, 3]
[-4, 2]
[-4, 3]
[0, 3]
[0, 3]
[0, 4]
[0, 3]
[0, 3]
[0, 4]
[0, 3]
[0, 4]
[0, 4]
[0, 4]
[0, 4]
[0, 4]
[0, 4]
[0, 4]
[0, 5]
[0, 4]
[0, 5]
[0, 5]
[0, 4]
[0, 5]
[0, 5]
[0, 5]
[0, 6]
[0, 5]
[0, 5]
[0, 6]
[0, 5]
[0, 6]
[0, 6]
[0, 6]
[0, 6]
[0, 6]
[0, 6]
[0, 6]
[0, 7]
[0, 6]
[0, 7]
[0, 7]
[0, 6]
[0, 7]
[0, 7]
[0, 7]
[0, 8]
[4, 7]
[4, 7]
[5, 8]
[4, 7]
[4, 8]
[4, 8]
[4, 8]
[4, 8]
[4, 8]
[4, 8]
[4, 8]
[4, 9]
[5, 8]
[4, 9]
[4, 9]
[4, 8]
[4, 9]
[4, 9]
[4, 9]
[4, 10]
[4, 9]
[4, 9]
[5, 10]
[4, 9]
[4, 10]
[4, 10]
[0, 10]
[0, 10]
[0, 10]
[0, 10]
[0, 10]
[0, 11]
[0, 10]
[0, 11]
[-4, 11]
[-4, 10]
[-4, 11]
[-5, 11]
[-4, 11]
[-4, 12]
[-4, 11]
[-4, 11]
[-4, 12]
[-4, 11]
[-4, 12]
[-4, 12]
[-4, 12]
[-5, 12]
[-4, 12]
[-4, 12]
[-4, 12]
[-4, 13]
[-4, 12]
[-4, 13]
[-4, 13]
[-4, 12]
[-4, 13]
[-5, 13]
[0, 13]
[0, 14]
[0, 13]
[5, 13]
[4, 14]
[4, 13]
[4, 4]
[4, 0]
[4, 0]
[4, 0]
[4, 0]
[4, 0]
[4, 0]
[5, 0]
[4, 0]
[4, 0]
[4, 0]
[4, 0]
[4, 0]
[4, 0]
[4, 0]
[4, 0]
[4, 0]
[5, 0]
[4, 0]
[4, 0]
[4, 0]
[4, 0]
[4, 0]
[4, 0]
[4, 0]
[4, 0]
[4, 0]
[5, 0]
[4, 0]
[4, 0]
[4, 0]
[4, 0]
[4, 0]
[4, 0]
[4, 0]
[4, 0]
[4, 0]
[5, 0]
[4, 0]
[4, 0]
[4, 0]
[4, 0]
[4, 0]
[4, 0]
[4, 0]
[4, 0]
[4, 0]
[5, 0]
[4, 0]
[4, 0]
[4, 0]
[4, 0]
[4, 0]
[4, 0]
[4, 0]
[4, 0]
[4, 0]
[5, 0]
[4, 0]
[4, 0]
[4, 0]
[4, 0]
[4, 0]
[4, 0]
[4, 0]
[4, 0]
[4, 0]
[5, 0]
[4, 0]
[4, 0]
[4, 0]
[4, 0]
[4, 0]
[4, 0]
[4, 0]
[4, 0]
[4, 0]
[5, 0]
[4, 0]
[4, 0]
[4, 0]
[4, 0]
[4, 0]
[4, 0]
[4, 0]
[4, 0]
[4, 0]
[5, 0]
[4, 0]
[4, 0]
[4, 0]
[4, 0]
[4, 0]
[4, 0]
[4, 0]
[4, 0]
[4, 0]
[5, 0]
[4, 0]
[4, 0]
[4, 0]
[4, 0]
[4, 0]
[4, 0]
[0, -6]
[0, -6]
[0, -6]
[0, -6]
[0, -6]
[0, -6]
[0, -6]
[0, -5]
[0, -6]
[0, -5]
[0, -6]
[0, -5]
[0, -5]
[0, -5]
[0, -5]
[0, -5]
[0, -4]
[0, -5]
[0, -4]
[0, -5]
[0, -4]
[0, -4]
[0, -4]
[0, -4]
[0, -4]
[0, -4]
[0, -4]
[0, -3]
[0, -4]
[0, -3]
[0, -4]
[0, -3]
[-4, -3]
[-4, -3]
[-4, -3]
[-4, -3]
[-4, -2]
[-4, -3]
[-5, -2]
[-4, -3]
[-4, -2]
[-4, -2]
[-4, -2]
[-4, -2]
[-4, -2]
[-4, -2]
[-4, -2]
[-4, -1]
[-5, -2]
[-4, -1]
[0, -1]
[0, -2]
[0, -1]
[0, -1]
[0, -1]
[0, 0]
[0, -1]
[0, -1]
[0, 0]
[0, -1]
[0, 0]
[0, 0]
[0, 0]
[0, 0]
[0, 0]
[0, 0]
[0, 0]
[0, 1]
[0, 0]
[0, 1]
[0, 1]
[0, 0]
[0, 1]
[0, 1]
[0, 1]
[0, 2]
[0, 1]
[0, 1]
[0, 2]
[0, 1]
[0, 2]
[0, 2]
[0, 2]
[0, 2]
[0, 2]
[0, 2]
[0, 3]
[0, 2]
[0, 2]
[0, 3]
[0, 3]
[0, 3]
[0, 2]
[0, 3]
[0, 4]
[0, 3]
[0, 3]
[0, 3]
[0, 4]
[0, 3]
[0, 0]
[0, 0]
[0, 0]
[0, 0]
[0, 0]
[0, 0]
[0, 0]
[0, 0]
[0, 0]
[0, 0]
[0, 0]
[0, 0]
[0, 0]
[0, 0]
[0, -13]
[0, -12]
[0, -13]
[0, -12]
[0, -12]
[0, -12]
[0, -12]
[0, -12]
[0, -12]
[0, -12]
[0, -11]
[0, -12]
[0, -11]
[0, -12]
[0, -11]
[0, -11]
[0, -11]
[0, -11]
[0, -11]
[0, -10]
[0, -11]
[0, -10]
[0, -11]
[0, -10]
[0, -10]
[0, -10]
[0, -10]
[0, -10]
[0, -10]
[0, -10]
[0, -9]
[0, -10]
[0, -9]
[0, -9]
[0, -10]
[0, -9]
[0, -9]
[0, -9]
[0, -8]
[0, -9]
[0, -9]
[0, -8]
[0, -8]
[0, -9]
[0, -8]
[0, -8]
[0, -8]
[0, -8]
[0, -8]
[0, -7]
[0, -8]
[0, -7]
[0, -8]
[0, -7]
[0, -7]
[0, -7]
[-4, -7]
[-4, -7]
[-4, -7]
[-4, -7]
[-4, -6]
[-4, -7]
[-4, -6]
[-4, -7]
[-5, -6]
[-4, -6]
[-4, -6]
[-4, -6]
[-4, -1]
[-4, 1]
[-4, 0]
[-4, 0]
[-4, 0]
[-4, 1]
[-5, 1]
[-4, 0]
[-4, 1]
[-4, 1]
[-4, 1]
[-4, 1]
[-4, 1]
[-4, 2]
[-4, 1]
[-4, 1]
[-5, 2]
[-4, 2]
[-4, 2]
[-4, 1]
[-4, 2]
[0, 3]
[0, 2]
[0, 2]
[0, 2]
[0, 0]
[0, 0]
[0, 0]
[0, 0]
[0, 0]
[4, 0]
[4, 0]
[4, 0]
[4, 0]
[5, 0]
[4, 0]
[4, 0]
[4, 0]
[4, 0]
[4, 0]
[4, 0]
[4, 0]
[4, 0]
[4, 1]
[5, 0]
[4, 0]
[4, 0]
[0, 1]
[0, 1]
[0, 0]
[0, 1]
[0, 1]
[0, 1]
[0, 1]
[0, 1]
[0, 2]
[0, 1]
[0, 1]
[0, 2]
[0, 2]
[0, 2]
[0, 1]
[0, 2]
[0, 3]
[0, 2]
[0, 2]
[0, 2]
[0, 3]
[0, 3]
[0, 2]
[0, 3]
[0, 3]
[0, 3]
[0, 3]
[0, 3]
[0, 4]
[0, 3]
[0, 3]
[0, 4]
[0, 4]
[0, 4]
[0, 3]
[0, 4]
[0, 5]
[0, 4]
[0, 4]
[0, 4]
[0, 5]
[0, 5]
[0, 4]
[0, 5]
[0, 5]
[0, 5]
[0, 5]
[0, 5]
[0, 6]
[0, 5]
[0, 5]
[0, 6]
[0, 6]
[0, 6]
[0, 5]
[0, 6]
[0, 7]
[0, 6]
[0, 6]
[0, 6]
[0, 7]
[0, 7]
[0, 6]
[0, 7]
[0, 7]
[0, 7]
[4, 7]
[4, 7]
[4, 8]
[4, 7]
[4, 7]
[4, 8]
[4, 8]
[5, 8]
[4, 7]
[4, 8]
[0, 9]
[0, 8]
[0, 8]
[0, 8]
[0, 9]
[0, 9]
[0, 8]
[0, 9]
[0, 9]
[0, 9]
[0, 9]
[0, 9]
[0, 10]
[0, 9]
[0, 9]
[0, 10]
[0, 10]
[0, 10]
[0, 9]
[0, 10]
[0, 11]
[0, 10]
[0, 10]
[0, 10]
[0, 11]
[0, 11]
[0, 10]
[0, 11]
[0, 11]
[0, 0]
[0, 0]
[0, 0]
[0, 0]
[0, 0]
[0, 0]
[0, 0]
[0, 0]
[0, 0]
[0, 0]
[0, 0]
[0, 0]
[0, 0]
[0, 0]
[0, 0]
[0, 0]
[0, 0]
[0, 0]
[0, 0]
[0, 0]
[0, 0]
[0, 0]
[0, 0]
[0, 0]
[0, 0]
[0, 0]
[0, 0]
[0, 0]
[0, 0]
[0, 0]
[0, 0]
[0, 0]
[0, 0]
[0, 0]
[0, 0]
[0, 0]
[0, 0]
[0, 0]
[0, 0]
[0, 0]
[0, 0]
[0, 0]
[0, 0]
[0, 0]
[0, 0]
[0, 0]
[0, 0]
[0, 0]
[0, 0]
[0, 0]
[0, 0]
[0, 0]
[0, 0]
[0, 0]
[0, 0]
[0, 0]
[0, 0]
[0, 0]
[0, 0]
[0, 0]
[0, 0]
[0, 0]
[0, 0]
[0, 0]
[0, 0]
[0, 0]
[0, 0]
[0, 0]
[0, 0]
[0, 0]
[0, 0]
[0, 0]
[0, 0]
[0, -13]
[0, -12]
[0, -12]
[0, -13]
[0, -12]
[0, -12]
[0, -12]
[0, -12]
[0, -12]
[0, -11]
[0, -12]
[0, -11]
[0, -12]
[0, -11]
[0, -11]
[0, -11]
[0, -11]
[0, -11]
[0, -11]
[0, -11]
[0, -10]
[0, -11]
[0, -10]
[0, -11]
[0, -10]
[0, -10]
[0, -10]
[0, -10]
[0, -10]
[0, -9]
[0, -10]
[0, -9]
[0, -10]
[0, -9]
[0, -9]
[0, -9]
[0, -9]
[0, -9]
[0, -9]
[0, -9]
[0, -8]
[0, -9]
[0, -8]
[0, -8]
[0, -9]
[0, -8]
[0, -8]
[0, -8]
[0, -7]
[0, -8]
[0, -8]
[0, -7]
[0, -7]
[0, -8]
[0, -7]
[0, -7]
[0, -7]
[0, -7]
[0, -7]
[0, -6]
[0, -7]
[0, -6]
[0, -7]
[0, -6]
[0, -6]
[0, -6]
[0, -6]
[-4, -6]
[-4, -2]
[-5, 0]
[-4, 0]
[-4, 0]
[-4, 0]
[-4, 0]
[-4, 0]
[-4, 1]
[-4, 0]
[-4, 0]
[-4, 0]
[-5, 1]
[-4, 1]
[-4, 0]
[-4, 1]
[-4, 1]
[-4, 1]
[-4, 1]
[0, 1]
[0, 2]
[0, 1]
[0, 1]
[0, 2]
[4, 2]
[4, 2]
[4, 1]
[4, 2]
[4, 3]
[4, 2]
[5, 2]
[4, 2]
[4, 3]
[4, 3]
[4, 2]
[4, 3]
[4, 3]
[4, 3]
[4, 3]
[4, 3]
[5, 4]
[4, 3]
[4, 3]
[4, 4]
[4, 4]
[4, 4]
[4, 3]
[4, 4]
[4, 5]
[4, 4]
[5, 4]
[4, 4]
[4, 5]
[4, 5]
[4, 4]
[4, 5]
[4, 5]
[4, 5]
[4, 5]
[4, 5]
[5, 6]
[0, 5]
[0, 5]
[0, 6]
[0, 6]
[0, 6]
[0, 5]
[0, 6]
[0, 7]
[0, 6]
[0, 6]
[0, 6]
[0, 7]
[0, 7]
[0, 6]
[-5, 7]
[-4, 7]
[-4, 7]
[-4, 7]
[-4, 7]
[-4, 8]
[-4, 7]
[-4, 7]
[-4, 8]
[-4, 8]
[-5, 8]
[-4, 7]
[-4, 8]
[-4, 9]
[-4, 8]
[-4, 8]
[-4, 8]
[-4, 9]
[0, 9]
[0, 8]
[0, 9]
[0, 9]
[0, 9]
[0, 9]
[0, 9]
[0, 10]
[0, 9]
[0, 9]
[0, 10]
[0, 10]
[0, 10]
[0, 9]
[0, 10]
[0, 11]
[0, 10]
[0, 10]
[0, 10]
[0, 11]
[0, 11]
[0, 10]
[0, 11]
[0, 11]
[0, 11]
[0, 11]
[0, 8]
[0, 0]
[0, 0]
[0, 0]
[0, 0]
[0, 0]
[0, 0]
[0, 0]
[0, 0]
[0, 0]
[0, 0]
[0, 0]
[0, 0]
[0, 0]
[0, 0]
[0, 0]
[0, 0]
[0, 0]
[0, 0]
[0, 0]
[0, 0]
[0, 0]
[0, 0]
[0, 0]
[0, 0]
[0, 0]
[0, 0]
[0, 0]
[0, 0]
[0, 0]
[0, 0]
[0, 0]
[0, 0]
[0, 0]
[0, 0]
[0, 0]
[0, 0]
[0, 0]
[0, 0]
[0, 0]
[0, -12]
[0, -13]
[0, -12]
[0, -12]
[0, -13]
[0, -12]
[0, -12]
[0, -12]
[0, -11]
[0, -12]
[0, -12]
[4, -11]
[4, -12]
[4, -11]
[4, -11]
[4, -11]
[4, -11]
[4, -11]
[5, -11]
[4, -11]
[4, -10]
[4, -11]
[4, -10]
[4, -10]
[4, -10]
[4, -11]
[4, -10]
[4, -9]
[5, -10]
[4, -10]
[4, -10]
[4, -9]
[4, -9]
[2, -10]
[0, -9]
[0, -9]
[0, -9]
[0, -9]
[0, -9]
[0, -8]
[0, -9]
[0, -8]
[0, -9]
[0, -8]
[0, -8]
[0, -8]
[0, -8]
[0, -8]
[0, -8]
[0, -8]
[0, -7]
[0, -8]
[0, -7]
[0, -7]
[0, -8]
[0, -7]
[0, -7]
[0, -7]
[0, -6]
[0, -7]
[0, -7]
[0, -6]
[0, -7]
[0, -6]
[0, -6]
[0, -6]
[0, -6]
[0, -6]
[0, -6]
[0, -6]
[0, -5]
[0, -6]
[0, -5]
[0, -5]
[0, -5]
[0, -6]
[0, -5]
[0, -4]
[0, -5]
[0, -5]
[0, -5]
[0, -4]
[0, -4]
[0, -5]
[0, -4]
[0, -4]
[0, -4]
[0, -4]
[0, -4]
[-4, -3]
[-4, -4]
[-4, -3]
[-4, -4]
[-4, -3]
[-4, -3]
[-5, -3]
[-4, -3]
[-4, -3]
[-4, -3]
[-4, -3]
[-4, -2]
[-4, -3]
[-4, -2]
[-4, -2]
[-4, -3]
[-5, -2]
[0, -2]
[0, -2]
[0, -1]
[0, -2]
[0, -2]
[0, -1]
[0, -2]
[0, -1]
[0, -1]
[0, -1]
[0, -1]
[0, -1]
[0, -1]
[0, -1]
[0, 0]
[0, -1]
[0, 0]
[0, 0]
[0, 0]
[0, -1]
[0, 0]
[0, 1]
[0, 0]
[0, 0]
[0, 0]
[0, 1]
[0, 1]
[0, 0]
[0, 1]
[0, 1]
[0, 1]
[0, 1]
[0, 1]
[0, 2]
[0, 1]
[0, 2]
[0, 1]
[0, 2]
[0, 2]
[0, 2]
[0, 2]
[0, 2]
[0, 2]
[0, 2]
[0, 3]
[0, 2]
[0, 3]
[0, 3]
[0, 2]
[0, 3]
[0, 3]
[0, 3]
[0, 4]
[0, 3]
[0, 3]
[0, 4]
[0, 3]
[0, 4]
[0, 4]
[0, 4]
[0, 4]
[0, 4]
[0, 4]
[0, 4]
[0, 4]
[0, 0]
[0, 0]
[0, 0]
[0, 0]
[0, 0]
[0, 0]
[0, 0]
[0, 0]
[0, 0]
[0, 0]
[0, 0]
[0, 0]
[0, 0]
[0, 0]
[0, 0]
[0, 0]
[0, 0]
[0, 0]
[0, 0]
[0, 0]
[0, 0]
[0, 0]
[0, 0]
[0, 0]
[0, 0]
[0, 0]
[0, 0]
[0, 0]
[0, 0]
[0, 0]
[0, 0]
[0, 0]
[0, -13]
[0, -12]
[0, -13]
[0, -12]
[0, -12]
[5, -12]
[4, -12]
[4, -12]
[4, -12]
[4, -12]
[4, -11]
[4, -12]
[4, -11]
[4, -11]
[4, -11]
[5, -12]
[4, -11]
[4, -10]
[4, -11]
[4, -11]
[4, -11]
[4, -10]
[4, -10]
[4, -11]
[4, -10]
[5, -10]
[4, -10]
[4, -10]
[4, -10]
[4, -9]
[4, -10]
[4, -9]
[4, -10]
[4, -9]
[4, -9]
[5, -9]
[4, -9]
[4, -9]
[4, -9]
[4, -9]
[4, -8]
[4, -9]
[4, -8]
[4, -8]
[4, -9]
[5, -8]
[4, -8]
[4, -8]
[4, -7]
[4, -8]
[4, -8]
[4, -7]
[4, -8]
[4, -7]
[4, -7]
[5, -7]
[4, -7]
[4, -7]
[4, -7]
[4, -7]
[4, -6]
[4, -7]
[4, -6]
[4, -6]
[4, -6]
[5, -7]
[4, -6]
[4, -5]
[4, -6]
[4, -6]
[4, -6]
[4, -5]
[4, -5]
[4, -6]
[4, -5]
[5, -5]
[4, -5]
[4, -5]
[4, -5]
[4, -4]
[4, -5]
[4, -4]
[4, -5]
[0, -4]
[0, -4]
[0, -4]
[0, -4]
[0, -4]
[0, -4]
[0, -4]
[0, -3]
[-4, -4]
[-5, -3]
[-4, -3]
[-4, -4]
[-4, -3]
[-4, -3]
[-4, -3]
[-4, -2]
[-4, -3]
[-4, -3]
[-4, -2]
[-5, -3]
[-4, -2]
[-4, -2]
[-4, -2]
[-4, -2]
[0, -2]
[0, -2]
[0, -2]
[0, -1]
[4, -2]
[4, -1]
[4, -1]
[4, -1]
[5, -2]
[4, -1]
[4, 0]
[4, -1]
[4, -1]
[4, -1]
[4, 0]
[4, 0]
[4, -1]
[4, 0]
[5, 0]
[4, 0]
[4, 0]
[4, 0]
[4, 1]
[4, 0]
[4, 1]
[4, 0]
[4, 1]
[4, 1]
[5, 1]
[4, 1]
[0, 1]
[0, 1]
[0, 1]
[0, 2]
[0, 1]
[0, 2]
[0, 2]
[0, 1]
[0, 2]
[0, 2]
[0, 2]
[0, 3]
[0, 2]
[0, 2]
[0, 3]
[0, 2]
[0, 3]
[0, 3]
[0, 3]
[0, 3]
[0, 2]
[0, 0]
[0, 0]
[0, 0]
[0, 0]
[0, 0]
[0, 0]
[0, 0]
[0, 0]
[0, 0]
[0, 0]
[0, 0]
[0, 0]
[0, 0]
[0, 0]
[0, 0]
[0, 0]
[0, 0]
[0, 0]
[0, 0]
[0, 0]
[0, 0]
[0, 0]
[0, 0]
[0, 0]
[0, 0]
[0, 0]
[0, 0]
[0, 0]
[0, 0]
[0, 0]
[0, 0]
[0, 0]
[0, 0]
[0, 0]
[0, 0]
[0, 0]
[0, 0]
[0, 0]
[0, 0]
[0, 0]
[0, 0]
[0, 0]
[0, 0]
[0, 0]
[0, 0]
[0, 0]
[0, 0]
[0, 0]
[0, 0]
[0, 0]
[0, 0]
[0, 0]
[0, 0]
[0, 0]
[0, 0]
[0, 0]
[0, 0]
[0, 0]
[0, 0]
[0, 0]
[0, 0]
[0, 0]
[0, 0]
[0, 0]
[0, 0]
[0, 0]
[0, 0]
[0, 0]
[0, 0]
[0, 0]
[0, 0]
[0, 0]
[0, 0]
[0, 0]
[0, 0]
[0, 0]
[0, 0]
[0, 0]
[0, 0]
[0, 0]
[0, 0]
[0, 0]
[0, 0]
[0, 0]
[0, 0]
[0, 0]
[0, 0]
[0, 0]
[0, 0]
[0, 0]
[0, 0]
[0, 0]
[0, 0]
[0, 0]
[0, 0]
[0, 0]
[0, 0]
[0, 0]
[0, 0]
[0, 0]
[0, 0]
[0, 0]
[0, 0]
[0, 0]
[0, 0]
[0, 0]
[0, 0]
[0, 0]
[0, 0]
[0, 0]
[0, 0]
[0, 0]
[0, 0]
[0, 0]
[0, 0]
[0, 0]
[0, 0]
[0, 0]
[0, 0]
[0, 0]
[0, 0]
[0, 0]
[0, 0]
[0, 0]
[0, 0]
[0, 0]
[0, 0]
[0, 0]
[0, 0]
[0, 0]
[0, 0]
[0, 0]
[0, 0]
[0, 0]
[0, 0]
[0, 0]
[0, 0]
[0, 0]
[0, 0]
[0, 0]
[0, 0]
[0, 0]
[0, -13]
[0, -12]
[0, -13]
[0, -12]
[0, -12]
[0, -12]
[0, -12]
[0, -12]
[0, -12]
[0, -11]
[0, -12]
[0, -12]
[0, -11]
[0, -11]
[0, -11]
[0, -11]
[0, -11]
[0, -11]
[0, -11]
[0, -11]
[0, -10]
[0, -11]
[0, -10]
[0, -11]
[0, -10]
[0, -10]
[0, -10]
[4, -10]
[4, -10]
[4, -9]
[4, -10]
[4, -9]
[4, -10]
[4, -9]
[4, -9]
[5, -9]
[4, -9]
[4, -9]
[4, -9]
[4, -9]
[4, -8]
[4, -9]
[4, -8]
[4, -8]
[4, -9]
[5, -8]
[4, -8]
[4, -8]
[4, -7]
[4, -8]
[4, -8]
[4, -7]
[4, -8]
[4, 1]
[4, 0]
[5, 0]
[4, 0]
[4, 1]
[4, 1]
[4, 0]
[4, 1]
[4, 1]
[4, 1]
[4, 1]
[4, 1]
[5, 2]
[4, 1]
[4, 1]
[4, 2]
[4, 2]
[4, 2]
[4, 1]
[4, 2]
[4, 3]
[4, 2]
[5, 2]
[4, 2]
[4, 3]
[4, 3]
[4, 2]
[4, 3]
[4, 3]
[4, 3]
[4, 3]
[4, 3]
[5, 4]
[4, 3]
[4, 3]
[4, 4]
[4, 4]
[4, 4]
[4, 3]
[4, 4]
[4, 5]
[4, 4]
[5, 4]
[4, 4]
[4, 5]
[4, 5]
[0, 4]
[0, 5]
[0, 5]
[0, 5]
[0, 5]
[-4, 5]
[-4, 6]
[-4, 5]
[-5, 5]
[-4, 6]
[-4, 6]
[-4, 6]
[-4, 5]
[-4, 6]
[-4, 7]
[-4, 6]
[-4, 6]
[-4, 6]
[-5, 7]
[-4, 7]
[-4, 6]
[-4, 7]
[-4, 7]
[-4, 7]
[-4, 7]
[-4, 7]
[-4, 8]
[-4, 7]
[-5, 7]
[-4, 8]
[-4, 8]
[-4, 8]
[-4, 7]
[-4, 8]
[-4, 9]
[-4, 8]
[-4, 8]
[-4, 8]
[-5, 9]
[-4, 9]
[-4, 8]
[-4, 9]
[-4, 9]
[-4, 9]
[-4, 9]
[-4, 9]
[-4, 2]
[-4, 0]
[-5, 0]
[-4, 0]
[-4, 0]
[-4, 0]
[-4, 0]
[-4, 0]
[-4, 1]
[-4, 0]
[-4, 1]
[-4, 0]
[-5, 1]
[-4, 1]
[-4, 1]
[-4, 1]
[-4, 1]
[-4, 2]
[0, 1]
[0, 2]
[0, 1]
[0, 2]
[0, 2]
[0, 2]
[0, 2]
[0, 2]
[0, 2]
[0, 2]
[0, 3]
[0, 2]
[0, 3]
[0, 2]
[0, 3]
[0, 3]
[0, 3]
[0, 3]
[0, 3]
[0, 4]
[0, 3]
[0, 4]
[0, 3]
[0, 4]
[0, 4]
[0, 4]
[0, 4]
[0, 4]
[0, 4]
[0, 4]
[0, 5]
[0, 1]
[0, 0]
[0, 0]
[0, 0]
[0, 0]
[0, 0]
[0, 0]
[0, 0]
[0, 0]
[0, 0]
[0, 0]
[0, 0]
[0, 0]
[0, 0]
[0, 0]
[0, 0]
[0, 0]
[0, 0]
[0, 0]
[0, 0]
[0, 0]
[0, 0]
[0, 0]
[0, 0]
[0, 0]
[0, 0]
[0, 0]
[0, 0]
[0, 0]
[0, 0]
[0, 0]
[0, 0]
[0, 0]
[0, 0]
[0, 0]
[0, 0]
[0, 0]
[0, -12]
[0, -13]
[0, -12]
[0, -13]
[0, -12]
[0, -12]
[0, -12]
[0, -12]
[0, -12]
[0, -11]
[0, -12]
[0, -11]
[0, -12]
[0, -11]
[0, -11]
[0, -11]
[0, -11]
[0, -11]
[0, -11]
[0, -11]
[0, -10]
[0, -11]
[0, -10]
[0, -10]
[0, -11]
[0, -10]
[0, -10]
[0, -10]
[0, -9]
[0, -10]
[0, -10]
[0, -9]
[0, -10]
[0, -9]
[0, -9]
[0, -9]
[0, -9]
[0, -9]
[0, -9]
[0, -9]
[0, -8]
[0, -9]
[0, -8]
[0, -8]
[0, -8]
[0, -9]
[0, -8]
[0, -7]
[0, -8]
[0, -8]
[0, -7]
[0, -8]
[0, -7]
[0, -8]
[0, -7]
[0, -7]
[0, -7]
[0, -7]
[0, -7]
[0, -6]
[0, -7]
[0, -6]
[0, -7]
[0, -6]
[0, -6]
[0, -6]
[0, -6]
[0, -6]
[0, -6]
[0, -6]
[0, -5]
[0, -6]
[0, -5]
[0, -5]
[0, -6]
[0, -5]
[0, -5]
[0, -5]
[0, -4]
[0, -5]
[0, -5]
[0, -4]
[0, -5]
[0, -4]
[0, -4]
[0, -4]
[0, -4]
[0, -4]
[0, -4]
[0, -4]
[0, -3]
[0, -4]
[0, -3]
[0, -3]
[0, -3]
[0, -4]
[0, -3]
[0, -2]
[0, -3]
[0, -3]
[0, -2]
[0, -3]
[0, -2]
[0, -3]
[0, -2]
[0, -2]
[0, -2]
[0, -2]
[0, -2]
[0, -1]
[0, -2]
[0, -1]
[0, -2]
[0, -1]
[0, -1]
[0, -1]
[0, -1]
[0, -1]
[0, -1]
[0, -1]
[0, 0]
[0, -1]
[0, 0]
[0, 0]
[0, -1]
[0, 0]
[0, 0]
[0, 0]
[0, 1]
[0, 0]
[0, 0]
[0, 1]
[0, 0]
[0, 1]
[0, 1]
[0, 1]
[0, 1]
[0, 1]
[0, 1]
[0, 1]
[0, 2]
[0, 1]
[0, 2]
[0, 2]
[0, 2]
[0, 1]
[0, 2]
[0, 3]
[0, 2]
[0, 2]
[0, 3]
[0, 2]
[0, 3]
[0, 2]
[0, 3]
[0, 3]
[0, 3]
[0, 3]
[0, 3]
[0, 4]
[0, 3]
[0, 4]
[0, 3]
[0, 4]
[0, 4]
[0, 4]
[0, 4]
[0, 4]
[0, 4]
[0, 4]
[0, 5]
[0, 4]
[0, 5]
[0, 5]
[0, 4]
[0, 5]
[0, 5]
[0, 5]
[0, 6]
[0, 5]
[0, 5]
[0, 6]
[0, 5]
[0, 6]
[0, 6]
[0, 6]
[0, 6]
[0, 6]
[0, 6]
[0, 6]
[0, 7]
[0, 6]
[0, 7]
[0, 7]
[0, 7]
[0, 6]
[0, 7]
[0, 8]
[0, 7]
[0, 7]
[0, 8]
[0, 7]
[0, 8]
[0, 7]
[0, 8]
[0, 8]
[0, 8]
[0, 8]
[0, 8]
[0, 9]
[0, 8]
[0, 9]
[0, 8]
[0, 9]
[0, 9]
[0, 9]
[0, 9]
[0, 9]
[0, 9]
[0, 9]
[0, 10]
[0, 9]
[0, 10]
[0, 10]
[0, 9]
[0, 10]
[0, 10]
[0, 10]
[0, 11]
[0, 10]
[0, 10]
[0, 11]
[0, 10]
[0, 11]
[0, 11]
[0, 11]
[0, 11]
[0, 11]
[0, 11]
[0, 11]
[0, 12]
[0, 11]
[0, 12]
[0, 12]
[0, 12]
[0, 11]
[0, 12]
[0, 13]
[0, 12]
[0, 12]
[0, 13]
[0, 12]
[0, 10]
[0, 0]
[0, 0]
[0, 0]
[0, 0]
[0, 0]
[0, 0]
[0, 0]
[0, 0]
[0, 0]
[0, 0]
[0, 0]
[0, 0]
[0, 0]
[0, 0]
[0, 0]
[0, 0]
[0, 0]
[0, 0]
[0, 0]
[0, 0]
[0, 0]
[0, 0]
[0, 0]
[0, 0]
[0, 0]
[0, 0]
[0, 0]
[0, 0]
[0, 0]
[0, 0]
[0, 0]
[0, 0]
[0, 0]
[0, 0]
[0, 0]
[0, 0]
[0, 0]
[0, 0]
[0, 0]
[0, 0]
[0, 0]
[0, 0]
[0, 0]
[0, 0]
[0, 0]
[0, 0]
[0, 0]
[0, 0]
[0, 0]
[0, 0]
[0, 0]
[0, 0]
[0, 0]
[0, 0]
[0, 0]
[0, 0]
[0, 0]
[0, 0]
[0, 0]
[0, 0]
[0, 0]
[0, 0]
[0, 0]
[0, 0]
[0, 0]
[0, -13]
[0, -12]
[0, -13]
[4, -12]
[4, -12]
[4, -12]
[4, -12]
[4, -12]
[5, -12]
[4, -12]
[4, -11]
[4, -12]
[4, -11]
[4, -12]
[4, -11]
[4, -11]
[4, -11]
[4, -11]
[5, -10]
[4, -11]
[4, -11]
[4, -10]
[4, -11]
[4, -10]
[4, -10]
[4, -10]
[4, -10]
[4, -10]
[5, -10]
[4, -10]
[4, -9]
[4, -10]
[4, -9]
[4, -9]
[4, -10]
[4, -9]
[4, -9]
[4, -8]
[5, -9]
[4, -9]
[4, -9]
[4, -8]
[4, -8]
[4, -9]
[4, -8]
[4, -8]
[4, -8]
[4, -8]
[5, -8]
[4, -7]
[4, -8]
[4, -7]
[4, -8]
[4, 0]
[4, 0]
[4, 1]
[4, 0]
[4, 1]
[5, 0]
[4, 1]
[4, 1]
[4, 1]
[4, 1]
[4, 1]
[4, 1]
[4, 1]
[4, 2]
[4, 1]
[5, 2]
[4, 1]
[4, 2]
[4, 2]
[0, 2]
[0, 2]
[0, 2]
[0, 3]
[0, 2]
[-4, 3]
[-4, 2]
[-4, 3]
[-5, 3]
[-4, 3]
[-4, 3]
[-4, 3]
[-4, 3]
[-4, 3]
[-4, 4]
[-4, 3]
[-4, 4]
[-4, 3]
[-5, 4]
[-4, 4]
[-4, 4]
[-4, 4]
[-4, 4]
[-4, 5]
[-4, 4]
[-4, 5]
[-4, 4]
[-4, 5]
[-5, 5]
[-4, 5]
[-4, 5]
[-4, 5]
[-4, 5]
[-4, 5]
[-4, 6]
[-4, 5]
[-4, 6]
[-4, 5]
[-5, 6]
[-4, 6]
[-4, 6]
[-4, 6]
[-4, 6]
[-4, 7]
[-4, 6]
[-4, 7]
[-4, 6]
[-4, 7]
[-5, 7]
[-4, 7]
[-4, 7]
[-4, 7]
[-4, 7]
[-4, 7]
[-4, 8]
[-4, 7]
[-4, 8]
[-4, 7]
[-5, 8]
[-4, 8]
[-4, 8]
[-4, 8]
[-4, 8]
[0, 9]
[0, 8]
[0, 9]
[0, 8]
[0, 9]
[0, 9]
[0, 9]
[0, 9]
[0, 9]
[0, 9]
[0, 9]
[0, 10]
[0, 9]
[0, 10]
[0, 9]
[0, 10]
[0, 10]
[0, 10]
[0, 10]
[0, 10]
[0, 5]
[0, 0]
[0, 0]
[0, 0]
[0, 0]
[0, 0]
[0, 0]
[0, 0]
[0, 0]
[0, 0]
[0, 0]
[0, 0]
[0, 0]
[0, 0]
[0, 0]
[0, 0]
[0, 0]
[0, 0]
[0, 0]
[0, 0]
[0, 0]
[0, 0]
[0, 0]
[0, 0]
[0, 0]
[0, 0]
[0, 0]
[0, 0]
[0, 0]
[0, 0]
[0, 0]
[0, 0]
[0, 0]
[0, 0]
[0, 0]
[0, 0]
[0, 0]
[0, 0]
[0, 0]
[0, 0]
[0, 0]
[0, 0]
[0, 0]
[0, 0]
[0, 0]
[0, 0]
[0, 0]
[0, 0]
[0, 0]
[0, 0]
[0, 0]
[0, 0]
[0, 0]
[0, 0]
[0, 0]
[0, 0]
[0, 0]
[0, 0]
[0, 0]
[0, 0]
[0, 0]
[0, 0]
[0, 0]
[0, 0]
[0, 0]
[0, 0]
[0, 0]
[0, 0]
[0, 0]
[0, 0]
[0, 0]
[0, 0]
[0, 0]
[0, 0]
[0, 0]
[0, 0]
[0, 0]
[0, 0]
[0, 0]
[0, 0]
[0, 0]
[0, 0]
[0, 0]
[0, 0]
[0, 0]
[0, 0]
[0, 0]
[0, -13]
[0, -12]
[0, -13]
[0, -12]
[0, -12]
[0, -12]
[0, -12]
[0, -12]
[0, -12]
[0, -12]
[0, -11]
[0, -12]
[0, -11]
[0, -11]
[0, -12]
[0, -11]
[0, -11]
[0, -11]
[0, -10]
[0, -11]
[0, -11]
[0, -10]
[0, -11]
[0, -10]
[0, -10]
[0, -10]
[0, -10]
[0, -10]
[0, -10]
[0, -9]
[0, -10]
[0, -10]
[0, -9]
[0, -9]
[0, -9]
[4, -9]
[4, -9]
[4, -9]
[4, -9]
[5, -9]
[4, -8]
[4, -9]
[4, -8]
[4, -9]
[4, -8]
[4, -8]
[4, -8]
[4, -8]
[4, -8]
[5, -7]
[4, -8]
[4, -7]
[4, -8]
[4, 0]
[4, 0]
[4, 1]
[4, 0]
[4, 0]
[4, 0]
[5, 1]
[4, 1]
[4, 0]
[4, 1]
[4, 1]
[4, 1]
[4, 1]
[4, 1]
[4, 2]
[4, 1]
[5, 1]
[4, 2]
[4, 2]
[0, 2]
[0, 1]
[0, 2]
[0, 3]
[0, 2]
[0, 2]
[0, 2]
[0, 3]
[-4, 3]
[-4, 2]
[-5, 3]
[-4, 3]
[-4, 3]
[-4, 3]
[-4, 3]
[-4, 4]
[-4, 3]
[-4, 3]
[-4, 4]
[-4, 4]
[-5, 4]
[-4, 3]
[-4, 4]
[-4, 5]
[-4, 4]
[-4, 4]
[-4, 4]
[-4, 5]
[-4, 5]
[-4, 4]
[-5, 5]
[-4, 5]
[-4, 5]
[-4, 5]
[-4, 5]
[-4, 6]
[-4, 5]
[-4, 5]
[-4, 6]
[-4, 6]
[-5, 6]
[-4, 5]
[-4, 6]
[-4, 7]
[-4, 6]
[-4, 6]
[-4, 6]
[-4, 7]
[-4, 7]
[-4, 6]
[-5, 7]
[-4, 7]
[-4, 7]
[-4, 7]
[-4, 7]
[-4, 8]
[-4, 7]
[-4, 7]
[0, 8]
[0, 8]
[0, 8]
[0, 7]
[0, 8]
[0, 9]
[0, 8]
[0, 8]
[0, 8]
[0, 9]
[0, 9]
[0, 8]
[0, 9]
[0, 9]
[0, 9]
[0, 9]
[0, 9]
[0, 10]
[0, 9]
[0, 9]
[0, 10]
[0, 10]
[0, 10]
[0, 9]
[0, 10]
[0, 11]
[0, 10]
[0, 4]
[0, 0]
[0, 0]
[0, 0]
[0, 0]
[0, 0]
[0, 0]
[0, 0]
[0, 0]
[0, 0]
[0, 0]
[0, 0]
[0, 0]
[0, 0]
[0, 0]
[0, 0]
[0, 0]
[0, 0]
[0, 0]
[0, 0]
[0, 0]
[0, 0]
[0, 0]
[0, 0]
[0, 0]
[0, 0]
[0, 0]
[0, 0]
[0, 0]
[0, 0]
[0, 0]
[0, 0]
[0, 0]
[0, 0]
[0, 0]
[0, 0]
[0, 0]
[0, 0]
[0, 0]
[0, 0]
[0, 0]
[0, 0]
[4, 0]
[4, 0]
[4, 0]
[4, 0]
[4, 0]
[4, 0]
[4, 0]
[0, 0]
[0, 0]
[0, 0]
[0, 0]
[0, 0]
[0, 0]
[0, 0]
[0, 0]
[0, 0]
[0, 0]
[0, 0]
[0, 0]
[0, 0]
[0, 0]
[0, 0]
[0, 0]
[0, 0]
[0, 0]
[0, 0]
[0, 0]
[0, 0]
[0, 0]
[0, 0]
[0, 0]
[0, 0]
[0, 0]
[0, 0]
[0, 0]
[0, 0]
[0, 0]
[0, 0]
[0, 0]
[0, 0]
[0, 0]
[0, 0]
[0, 0]
[0, 0]
[0, 0]
[0, 0]
[0, 0]
[0, 0]
[0, 0]
[0, 0]
[0, 0]
[0, 0]
[0, 0]
[0, 0]
[0, 0]
[0, 0]
[0, 0]
[0, 0]
[0, -13]
[0, -12]
[0, -12]
[0, -13]
[0, -12]
[0, -12]
[0, -12]
[0, -12]
[0, -12]
[0, -11]
[0, -12]
[0, -11]
[0, -12]
[0, -11]
[0, -11]
[0, -11]
[0, -11]
[0, -11]
[0, -11]
[0, -11]
[0, -10]
[5, -11]
[4, -10]
[4, -10]
[4, -11]
[4, -10]
[4, -10]
[4, -10]
[4, -9]
[4, -10]
[4, -10]
[5, -9]
[4, -10]
[4, -9]
[4, -9]
[4, -9]
[4, -9]
[4, -9]
[4, -9]
[4, -9]
[4, -8]
[5, -9]
[4, -8]
[4, -8]
[4, -8]
[4, -9]
[4, -8]
[4, -7]
[4, -8]
[4, -8]
[4, -8]
[5, -7]
[4, -7]
[4, -1]
[4, 0]
[4, 1]
[4, 0]
[4, 0]
[4, 0]
[4, 1]
[4, 1]
[5, 0]
[4, 1]
[4, 1]
[4, 1]
[4, 1]
[4, 1]
[4, 2]
[4, 1]
[4, 1]
[4, 2]
[5, 2]
[0, 2]
[0, 1]
[0, 2]
[0, 3]
[0, 2]
[-5, 2]
[-4, 2]
[-4, 3]
[-4, 3]
[-4, 2]
[-4, 3]
[-4, 3]
[-4, 3]
[-4, 3]
[-4, 3]
[-5, 4]
[-4, 3]
[-4, 3]
[-4, 4]
[-4, 4]
[-4, 4]
[-4, 3]
[-4, 4]
[-4, 5]
[-4, 4]
[-5, 4]
[-4, 4]
[-4, 5]
[-4, 5]
[-4, 4]
[-4, 5]
[-4, 5]
[-4, 5]
[-4, 5]
[-4, 5]
[-5, 6]
[-4, 5]
[-4, 5]
[-4, 6]
[-4, 6]
[-4, 6]
[-4, 5]
[-4, 6]
[-4, 7]
[-4, 6]
[-5, 6]
[-4, 6]
[-4, 7]
[0, 7]
[0, 6]
[0, 7]
[0, 7]
[0, 7]
[0, 7]
[0, 7]
[0, 8]
[0, 7]
[0, 7]
[0, 8]
[0, 8]
[0, 8]
[0, 7]
[0, 8]
[0, 9]
[0, 8]
[0, 8]
[0, 8]
[0, 9]
[0, 9]
[0, 8]
[0, 9]
[0, 9]
[0, 9]
[0, 9]
[0, 9]
[0, 10]
[0, 9]
[0, 9]
[0, 10]
[0, 10]
[0, 10]
[0, 9]
[0, 10]
[0, 11]
[0, 10]
[0, 4]
[0, 0]
[0, 0]
[0, 0]
[0, 0]
[0, 0]
[0, 0]
[0, 0]
[0, 0]
[0, 0]
[0, 0]
[0, 0]
[0, 0]
[0, 0]
[0, 0]
[0, 0]
[0, 0]
[0, 0]
[0, 0]
[0, 0]
[0, 0]
[0, 0]
[0, 0]
[0, 0]
[0, 0]
[0, 0]
[0, 0]
[0, 0]
[0, 0]
[0, 0]
[0, 0]
[0, 0]
[0, 0]
[0, 0]
[0, 0]
[0, 0]
[0, 0]
[0, 0]
[0, 0]
[0, 0]
[0, 0]
[0, 0]
[0, 0]
[0, 0]
[0, 0]
[0, 0]
[0, 0]
[0, 0]
[0, 0]
[0, 0]
[0, 0]
[0, 0]
[0, 0]
[0, 0]
[0, 0]
[0, 0]
[0, 0]
[0, -13]
[0, -12]
[0, -12]
[0, -13]
[0, -12]
[0, -12]
[0, -12]
[0, -12]
[0, -12]
[0, -11]
[0, -12]
[0, -11]
[0, -12]
[0, -11]
[0, -11]
[0, -11]
[0, -11]
[0, -11]
[0, -11]
[0, -11]
[0, -10]
[0, -11]
[0, -10]
[4, -11]
[4, -10]
[5, -10]
[4, -10]
[4, -10]
[4, -9]
[4, -10]
[4, -10]
[4, -9]
[4, -10]
[4, -9]
[4, -9]
[5, -9]
[4, -9]
[4, -9]
[4, -9]
[4, -9]
[4, -8]
[4, -9]
[4, -8]
[4, -8]
[4, -9]
[5, -8]
[4, -8]
[4, -7]
[4, -8]
[4, -8]
[4, -8]
[4, -7]
[4, -7]
[4, -1]
[4, 0]
[5, 0]
[4, 1]
[4, 0]
[4, 0]
[4, 0]
[4, 1]
[4, 1]
[4, 0]
[4, 1]
[4, 1]
[5, 1]
[4, 1]
[4, 1]
[4, 2]
[4, 1]
[4, 1]
[4, 2]
[4, 2]
[0, 2]
[0, 1]
[0, 2]
[0, 3]
[-4, 2]
[-4, 2]
[-4, 2]
[-4, 3]
[-4, 3]
[-4, 2]
[-4, 3]
[-5, 3]
[-4, 3]
[-4, 3]
[-4, 3]
[-4, 4]
[-4, 3]
[-4, 3]
[-4, 4]
[-4, 4]
[-4, 4]
[-5, 3]
[-4, 4]
[-4, 5]
[-4, 4]
[-4, 4]
[-4, 4]
[-4, 5]
[-4, 5]
[-4, 4]
[-4, 5]
[-5, 5]
[-4, 5]
[-4, 5]
[-4, 5]
[-4, 6]
[-4, 5]
[-4, 5]
[-4, 6]
[-4, 6]
[-4, 6]
[-5, 5]
[-4, 6]
[-4, 7]
[-4, 6]
[-4, 6]
[-4, 6]
[-4, 7]
[-4, 7]
[-4, 6]
[-4, 7]
[-5, 7]
[-4, 7]
[0, 7]
[0, 7]
[0, 8]
[0, 7]
[0, 7]
[0, 8]
[0, 8]
[0, 8]
[0, 7]
[0, 8]
[0, 9]
[0, 8]
[0, 8]
[0, 8]
[0, 9]
[0, 9]
[0, 8]
[0, 9]
[0, 9]
[0, 9]
[0, 9]
[0, 9]
[0, 2]
[0, 0]
[0, 0]
[0, 0]
[0, 0]
[0, 0]
[0, 0]
[0, 0]
[0, 0]
[0, 0]
[0, 0]
[0, 0]
[0, 0]
[0, 0]
[0, 0]
[0, 0]
[0, 0]
[0, 0]
[0, 0]
[0, 0]
[0, 0]
[0, 0]
[0, 0]
[0, 0]
[0, 0]
[0, 0]
[0, 0]
[0, 0]
[0, 0]
[0, 0]
[0, 0]
[0, 0]
[0, 0]
[0, 0]
[0, 0]
[0, 0]
[0, 0]
[0, 0]
[0, 0]
[0, 0]
[0, 0]
[0, 0]
[0, 0]
[0, 0]
[0, 0]
[0, 0]
[0, 0]
[-4, 0]
[-4, 0]
[-4, 0]
[-4, 0]
[-4, 1]
[-4, 0]
[-4, 1]
[-4, 0]
[-5, 1]
[-4, 1]
[-4, 1]
[0, 1]
[0, 1]
[0, 2]
[0, 1]
[0, 2]
[0, 1]
[0, 2]
[0, 2]
[0, 2]
[0, 2]
[0, 2]
[0, 2]
[0, 2]
[0, 3]
[0, 2]
[0, 3]
[0, 2]
[0, 3]
[0, 3]
[0, 3]
[0, 3]
[0, 3]
[0, 4]
[0, 3]
[0, 4]
[0, 3]
[0, 4]
[0, 4]
[0, 4]
[0, 4]
[0, 4]
[0, 4]
[0, 4]
[0, 5]
[0, 1]
[0, 0]
[0, 0]
[0, 0]
[0, 0]
[0, 0]
[0, 0]
[0, 0]
[0, 0]
[0, 0]
[0, 0]
[0, 0]
[0, 0]
[0, 0]
[0, 0]
[0, 0]
[0, 0]
[0, 0]
[0, 0]
[0, 0]
[0, 0]
[0, 0]
[0, 0]
[0, 0]
[0, 0]
[0, 0]
[0, 0]
[0, 0]
[0, 0]
[0, 0]
[0, 0]
[0, 0]
[0, 0]
[0, 0]
[0, 0]
[0, 0]
[0, 0]
[0, 0]
[0, 0]
[0, 0]
[0, 0]
[0, 0]
[0, 0]
[0, 0]
[0, 0]
[0, 0]
[0, 0]
[0, 0]
[0, 0]
[0, 0]
[0, 0]
[0, 0]
[0, 0]
[0, 0]
[0, 0]
[0, 0]
[0, 0]
[0, 0]
[0, 0]
[0, 0]
[0, 0]
[0, 0]
[0, 0]
[0, 0]
[0, 0]
[0, 0]
[0, 0]
[0, 0]
[0, 0]
[0, 0]
[0, 0]
[0, 0]
[0, 0]
[0, 0]
[0, 0]
[0, 0]
[-4, 0]
[-4, 0]
[-4, 0]
[-4, 0]
[-4, 0]
[-4, 0]
[-4, 0]
[-5, 0]
[-4, 0]
[-4, 0]
[-4, 0]
[-4, 0]
[-4, 0]
[-4, 0]
[-4, 0]
[-4, 0]
[-4, 0]
[-5, 0]
[-4, 0]
[-4, 0]
[-4, 0]
[-4, 0]
[-4, 0]
[-4, 0]
[0, 0]
[0, 0]
[0, 0]
[0, 0]
[0, 0]
[0, 0]
[0, 0]
[0, 0]
[0, 0]
[0, 0]
[0, 0]
[0, 0]
[0, 0]
[0, 0]
[0, 0]
[0, 0]
[0, 0]
[0, 0]
[0, 0]
[0, 0]
[0, 0]
[0, 0]
[0, 0]
[0, 0]
[0, 0]
[0, 0]
[0, 0]
[0, 0]
[0, 0]
[0, 0]
[0, 0]
[0, 0]
[0, 0]
[0, 0]
[0, 0]
[0, 0]
[0, 0]
[0, 0]
[0, 0]
[0, 0]
[0, 0]
[0, 0]
[0, 0]
[0, 0]
[0, 0]
[0, 0]
[0, 0]
[0, 0]
[0, 0]
[0, 0]
[0, 0]
[0, 0]
[0, 0]
[0, 0]
[0, 0]
[0, 0]
[0, 0]
[0, 0]
[0, 0]
[0, 0]
[0, 0]
[0, 0]
[0, 0]
[0, 0]
[0, 0]
[0, 0]
[0, 0]
[0, 0]
[0, 0]
[0, 0]
[0, 0]
[0, 0]
[0, 0]
[0, 0]
[0, 0]
[0, 0]
[0, 0]
[0, 0]
[0, 0]
[0, 0]
[0, 0]
[0, 0]
[0, 0]
[0, 0]
[0, 0]
[0, 0]
[0, 0]
[0, 0]
[0, 0]
[0, 0]
[0, 0]
[0, 0]
[0, 0]
[0, 0]
[0, 0]
[0, 0]
[0, 0]
[0, 0]
[0, 0]
[0, 0]
[0, 0]
[0, 0]
[0, 0]
[0, 0]
[0, 0]
[0, 0]
[0, 0]
[0, 0]
[0, 0]
[0, 0]
[0, 0]
[0, 0]
[0, 0]
[0, 0]
[0, 0]
[0, 0]
[0, 0]
[0, 0]
[0, 0]
[0, 0]
[0, 0]
[0, 0]
[0, 0]
[0, 0]
[0, 0]
[0, 0]
[0, 0]
[0, 0]
[0, 0]
[0, 0]
[0, 0]
[0, 0]
[0, 0]
[0, 0]
[0, 0]
[0, 0]
[0, 0]
[0, 0]
[0, 0]
[0, 0]
[0, 0]
[0, 0]
[0, 0]
[0, 0]
[0, 0]
[0, 0]
[0, 0]
[0, 0]
[0, 0]
[0, 0]
[0, 0]
[0, 0]
[0, 0]
[0, 0]
[0, 0]
[0, 0]
[0, 0]
[0, 0]
[0, 0]
[0, 0]
[0, 0]
[0, 0]
[0, 0]
[0, 0]
[0, 0]
[0, 0]
[0, 0]
[0, 0]
[0, 0]
[0, 0]
[0, 0]
[0, 0]
[0, 0]
[0, 0]
[0, 0]
[0, 0]
[0, 0]
[0, 0]
[0, 0]
[0, 0]
[0, 0]
[0, 0]
[0, 0]
[0, 0]
[0, 0]
[0, 0]
[0, 0]
[0, 0]
[0, 0]
[0, 0]
[0, 0]
[0, 0]
[0, 0]
[0, 0]
[0, 0]
[0, 0]
[0, 0]
[0, 0]
[0, 0]
[0, 0]
[0, 0]
[0, 0]
[0, 0]
[0, 0]
[0, 0]
[0, 0]
[0, 0]
[0, 0]
[0, 0]
[0, 0]
[0, -13]
[0, -12]
[0, -12]
[4, -13]
[4, -12]
[4, -12]
[4, -12]
[4, -12]
[4, -12]
[5, -11]
[4, -12]
[4, -11]
[4, -12]
[4, -11]
[4, -11]
[4, -11]
[4, -11]
[4, -11]
[4, -11]
[5, -11]
[4, -10]
[4, -11]
[4, -10]
[4, -10]
[4, -11]
[4, -10]
[4, -10]
[4, -10]
[4, -9]
[5, -10]
[4, -10]
[4, -9]
[4, -10]
[4, -9]
[4, -9]
[4, -9]
[4, -9]
[4, -9]
[4, -9]
[5, -9]
[4, -8]
[4, -9]
[4, -8]
[4, -8]
[4, -8]
[4, -9]
[4, -8]
[4, -7]
[4, -8]
[5, -8]
[4, -8]
[4, -7]
[4, -7]
[4, -1]
[4, 0]
[4, 1]
[4, 0]
[4, 0]
[4, 0]
[5, 1]
[4, 1]
[4, 0]
[4, 1]
[4, 1]
[4, 1]
[4, 1]
[4, 1]
[4, 2]
[4, 1]
[5, 1]
[4, 2]
[4, 2]
[4, 2]
[4, 1]
[4, 2]
[4, 3]
[4, 2]
[4, 2]
[4, 2]
[5, 3]
[4, 3]
[4, 2]
[4, 3]
[4, 3]
[4, 3]
[4, 3]
[4, 3]
[4, 4]
[4, 3]
[0, 3]
[0, 4]
[0, 4]
[0, 4]
[0, 3]
[0, 4]
[-4, 5]
[-4, 4]
[-4, 4]
[-4, 4]
[-4, 5]
[-4, 5]
[-4, 4]
[-4, 5]
[-4, 5]
[-5, 5]
[-4, 5]
[-4, 5]
[-4, 6]
[-4, 5]
[-4, 5]
[-4, 6]
[-4, 6]
[-4, 6]
[-4, 5]
[-5, 6]
[-4, 7]
[-4, 6]
[-4, 6]
[-4, 6]
[-4, 7]
[-4, 7]
[-4, 6]
[-4, 7]
[-4, 7]
[-5, 7]
[-4, 7]
[-4, 7]
[-4, 8]
[-4, 7]
[-4, 7]
[-4, 8]
[-4, 8]
[-4, 8]
[-4, 7]
[-5, 8]
[-4, 9]
[-4, 8]
[-4, 8]
[-4, 8]
[-4, 9]
[-4, 9]
[-4, 8]
[-4, 9]
[-4, 9]
[-5, 9]
[-4, 9]
[-4, 9]
[-4, 10]
[-4, 9]
[-4, 9]
[-4, 10]
[0, 10]
[0, 10]
[0, 9]
[0, 10]
[0, 11]
[0, 10]
[0, 4]
[0, 0]
[0, 0]
[0, 0]
[0, 0]
[0, 0]
[0, 0]
[0, 0]
[0, 0]
[0, 0]
[0, 0]
[0, 0]
[0, 0]
[0, 0]
[0, 0]
[0, 0]
[0, 0]
[0, 0]
[0, 0]
[0, 0]
[0, 0]
[0, 0]
[0, 0]
[0, 0]
[0, 0]
[0, 0]
[0, 0]
[0, 0]
[0, 0]
[0, 0]
[0, 0]
[0, 0]
[0, 0]
[0, 0]
[0, 0]
[0, 0]
[0, 0]
[0, 0]
[0, 0]
[0, 0]
[0, 0]
[0, 0]
[0, 0]
[0, 0]
[0, 0]
[0, 0]
[0, 0]
[0, 0]
[0, 0]
[0, 0]
[0, 0]
[0, 0]
[0, 0]
[0, 0]
[0, 0]
[0, 0]
[0, 0]
[0, 0]
[0, 0]
[0, 0]
[0, 0]
[0, 0]
[0, 0]
[0, 0]
[0, 0]
[0, 0]
[0, 0]
[0, 0]
[0, 0]
[0, 0]
[0, 0]
[0, 0]
[0, 0]
[0, 0]
[0, 0]
[0, 0]
[0, 0]
[0, 0]
[0, 0]
[0, 0]
[0, 0]
[0, 0]
[0, 0]
[0, 0]
[0, 0]
[0, 0]
[0, 0]
[0, 0]
[0, 0]
[0, 0]
[0, 0]
[0, 0]
[0, 0]
[0, 0]
[0, 0]
[0, 0]
[0, -13]
[0, -12]
[0, -12]
[0, -13]
[0, -12]
[0, -12]
[0, -12]
[4, -12]
[4, -12]
[4, -11]
[4, -12]
[4, -11]
[4, -12]
[5, -11]
[4, -11]
[4, -11]
[4, -11]
[4, -11]
[4, -11]
[4, -11]
[4, -10]
[4, -11]
[4, -10]
[5, -11]
[4, -10]
[4, -10]
[4, -10]
[4, -10]
[4, -10]
[4, -9]
[4, -10]
[4, -9]
[4, -10]
[5, -9]
[4, -9]
[4, -9]
[4, -9]
[4, -9]
[4, -9]
[4, -9]
[4, -8]
[4, -9]
[4, -8]
[5, -8]
[4, -9]
[4, -8]
[4, -8]
[4, -8]
[4, -7]
[4, -8]
[4, -8]
[4, -7]
[4, -7]
[5, -8]
[0, -7]
[0, -7]
[0, -7]
[0, -7]
[0, -7]
[0, -6]
[0, -7]
[0, -6]
[0, -7]
[0, -6]
[0, -6]
[0, -6]
[0, -6]
[0, -6]
[0, -6]
[0, -6]
[0, -5]
[0, -6]
[0, -5]
[0, -6]
[0, -5]
[0, -5]
[0, -5]
[0, -5]
[0, -5]
[0, -4]
[0, -5]
[-5, -4]
[-4, -5]
[-4, -4]
[-4, -4]
[-4, -4]
[-4, -4]
[-4, -4]
[-4, -4]
[-4, -4]
[-4, -3]
[-5, -4]
[-4, -3]
[-4, -3]
[-4, -4]
[-4, -3]
[-4, -3]
[-4, -3]
[-4, -2]
[-4, -3]
[-4, -3]
[-5, -2]
[-4, -2]
[-4, -3]
[0, -2]
[0, -2]
[0, -2]
[0, -2]
[0, -2]
[0, -1]
[0, -2]
[0, -1]
[0, -2]
[0, -1]
[0, -1]
[0, -1]
[0, -1]
[0, -1]
[0, -1]
[0, -1]
[0, 0]
[0, -1]
[0, 0]
[0, -1]
[0, 0]
[0, 0]
[0, 0]
[0, 0]
[0, 0]
[0, 1]
[0, 0]
[0, 1]
[0, 0]
[0, 1]
[0, 1]
[0, 1]
[0, 1]
[0, 1]
[0, 1]
[0, 1]
[0, 2]
[0, 1]
[0, 2]
[0, 2]
[0, 1]
[0, 2]
[0, 2]
[0, 2]
[0, 3]
[0, 2]
[0, 2]
[0, 3]
[0, 3]
[0, 2]
[0, 3]
[0, 3]
[0, 3]
[0, 3]
[0, 3]
[0, 4]
[0, 3]
[0, 4]
[0, 3]
[0, 4]
[0, 4]
[0, 4]
[0, 4]
[0, 4]
[0, 4]
[0, 4]
[0, 5]
[0, 4]
[0, 5]
[0, 4]
[0, 5]
[0, 5]
[0, 5]
[0, 5]
[0, 5]
[0, 6]
[0, 5]
[0, 6]
[0, 5]
[0, 6]
[0, 6]
[0, 6]
[0, 6]
[0, 6]
[0, 6]
[0, 3]
[0, 0]
[0, 0]
[0, 0]
[0, 0]
[0, 0]
[0, 0]
[0, 0]
[0, 0]
[0, 0]
[0, 0]
[0, 0]
[0, 0]
[0, 0]
[0, 0]
[0, 0]
[0, 0]
[0, 0]
[0, 0]
[0, 0]
[0, 0]
[0, 0]
[0, 0]
[0, 0]
[0, 0]
[0, 0]
[0, 0]
[0, 0]
[0, 0]
[0, 0]
[0, 0]
[0, 0]
[0, 0]
[0, 0]
[0, 0]
[0, 0]
[0, 0]
[0, 0]
[0, 0]
[0, 0]
[0, 0]
[0, 0]
[0, 0]
[0, 0]
[0, 0]
[0, 0]
[0, 0]
[0, 0]
[0, 0]
[0, 0]
[0, 0]
[0, 0]
[0, 0]
[0, 0]
[0, 0]
[0, 0]
[0, 0]
[0, 0]
[0, 0]
