Résumé,Date de soumission
Export CRA : Les calendriers affichés dans la popup d'export ne s'ouvrent pas sur le bon mois,28-05-19
Edition CRA : une tâche autre un week-end ou jour férié en doit pas apparaître sur le CRA,28-05-19
Modifier le texte d'explication de l'écran,24-05-19
"Titre du sous-menu 'Plan de production détaillé' doit être 'Détaillé'",28-05-19
"Dans l'écran 'Ajouter un projet', il possible de n'avoir que la liste sans la totalité de la fenêtre",24-05-19
"Menu clic droit sur une tâche, changer le libellé 'Dupliquer le jour suivant' en 'Dupliquer sur le jour suivant'",28-05-19
Fenêtre Exporter le CRA : faute sur le titre,28-05-19
Onglet détail du tâche : Les boutons de l'écran de modification des commentaires ne sont pas traduits,24-05-19
Etude de peuplement des listes groupes,22-05-19
Liste des groupes différente de celle du plan prod général,24-05-19
"Le titre de l'écran devrait être 'Plan de production détaillé'",22-05-19
Possibilité de dupliquer sur un jour suivant férié,06-05-19
Fichier Export CRA : la ligne Autre est mal remplie,23-05-19
Export CRA : le nom du projet dépasse la cellule du tableau,22-05-19
"Changer le titre de l'entrée 'Créer projet tâche' en 'Ajout projet/tâche'",24-05-19
"Dans l'écran 'Autres projets', il manque le champ 'Type d’imputation'",22-05-19
Changer l'ordre des entrées du menu général,22-05-19
L'année n'est pas la bonne pour la tâche en base de données,24-05-19
Impossible de créer une tâche avec le rôle utilisateur,23-05-19
Message de notification : Mauvais affichage de la notification,22-05-19
Semaine Mission : RG\_CDT\_37 non respectée,22-05-19
Mettre en français le calendrier du champs Semaine mission,22-05-19
Semaine Mission : la date dans le libellé change si on rentre une mauvaise date,22-05-19
Retirer l'année dans le libellé de la semaine mission,22-05-19
Semaine Mission : possibilité de saisir -1 dans le champ,22-05-19
Export du CRA : Les congés ne sont pas visibles dans le fichier pdf,13-05-19
Dans fichier CRA : les congés ne sont pas identifiables,16-05-19
Ecran de duplication sur une période : le message de confirmation est toujours visible pour une même tâche,06-05-19
Message de notification incorrecte pour les week-end,06-05-19
Dupliquer sur une période : l'utilisateur peut saisir une date supérieur à 2050.,02-05-19
Supprimer dans la popup des infos l'entrée tâche planifiées,29-04-19
Accueil : Supprimer le tableau en bas de la page d'accueil,29-04-19
Ne pas compter les jours fériés et les week-end dans le message de confirmation,29-04-19
L'icone calendar n'est pas renseigner dans les champs dates,16-05-19
Fichier Export : Saisie de temps supérieure à 1 mal exporter dans fichier,16-05-19
Les champs date et visa  sont trop collés au cadre de signature,16-05-19
L'icône calendar à rajouter dans les champs dates,16-05-19
colonne tâche existantes non triées,21-05-19
Renommer Plan de Production,29-04-19
Supprimer l'entrée planning de l'écran projet,29-04-19
"La fonction 'Synchroniser les utilisateurs LDAP' semble ne pas fonctionner",22-03-19
Date de début ne doit pas être supérieure à la date de fin,13-05-19
Création de tâche impossible pour un nouveau projet,10-05-19
Impossible de créer un nouveau projet,13-05-19
Possibilité de dupliquer une tâche qui n'est pas de type support,30-04-19