{
	"title": "Kubernets Lab Environment",
	"description": "Anleitung für eine einfache K8S Lab Umgebung",
	"author": "Marco Berger, TBZ",
	"language": "de",

	"pdf": {
		"pageNumbers": true,
		"language": "de",
		"fontSize": 12,
		"fontFamily": "Arial, Helvetica, Verdana, Lucida, sans-serif"
	},

	"plugins": [ "include-codeblock", "ace", "mcqx", "expandable-chapters-small" ],

	"pluginsConfig": {
    "include-codeblock": {
        "template": "ace"
        }
    },

	"gitbook": "3.2.3"


}