[
	{
		"id": "542a523.f4d3aac",
		"type": "tab",
		"label": "CEC",
		"disabled": false,
		"info": ""
	},
	{
		"id": "485890c0.e568a8",
		"type": "cec-out",
		"z": "542a523.f4d3aac",
		"cec_adapter": "b2894984.786168",
		"name": "Send cmd",
		"x": 720,
		"y": 220,
		"wires": []
	},
	{
		"id": "23f8e0e9.689c98",
		"type": "cec-state",
		"z": "542a523.f4d3aac",
		"cec_adapter": "b2894984.786168",
		"name": "Get state",
		"output": "payload",
		"flow_name": "cec",
		"flow": true,
		"scan": false,
		"x": 560,
		"y": 420,
		"wires": [
			[
				"daa6a0c.ed5976",
				"1a06201d.9497f8"
			]
		]
	},
	{
		"id": "2e7d3458.5c8c64",
		"type": "change",
		"z": "542a523.f4d3aac",
		"name": "Set properties",
		"rules": [
			{
				"t": "move",
				"p": "payload.address",
				"pt": "msg",
				"to": "address",
				"tot": "msg"
			},
			{
				"t": "move",
				"p": "payload.command",
				"pt": "msg",
				"to": "command",
				"tot": "msg"
			}
		],
		"action": "",
		"property": "",
		"from": "",
		"to": "",
		"reg": false,
		"x": 400,
		"y": 420,
		"wires": [
			[
				"23f8e0e9.689c98"
			]
		]
	},
	{
		"id": "371f94a8.21562c",
		"type": "function",
		"z": "542a523.f4d3aac",
		"name": "Get CEC Device State & Active Source from flow context ",
		"func": "// See RPI HDMI CEC Device State Node for \n// where the context property name 'cec' is\n// specified for the flow\nvar cec = flow.get('cec') ;\nmsg.payload = {\n  devices: cec.devices,\n  active_source: cec.active_source\n} ;\nreturn msg;\n",
		"outputs": 1,
		"noerr": 0,
		"x": 270,
		"y": 620,
		"wires": [
			[
				"781a7082.ea4768"
			]
		]
	},
	{
		"id": "d9550d3e.9688c",
		"type": "inject",
		"z": "542a523.f4d3aac",
		"name": "Empty Injection",
		"topic": "",
		"payload": "",
		"payloadType": "date",
		"repeat": "",
		"crontab": "",
		"once": false,
		"x": 220,
		"y": 660,
		"wires": [
			[
				"3f7c3856.e9c218"
			]
		]
	},
	{
		"id": "781a7082.ea4768",
		"type": "debug",
		"z": "542a523.f4d3aac",
		"name": "",
		"active": true,
		"tosidebar": true,
		"console": false,
		"complete": "false",
		"x": 570,
		"y": 640,
		"wires": []
	},
	{
		"id": "d371c60e.68f95",
		"type": "inject",
		"z": "542a523.f4d3aac",
		"name": "Get Power Status (tv)",
		"topic": "",
		"payload": "{\"command\":\"getpowerstatusname\",\"address\":\"0.0.0.0\"}",
		"payloadType": "json",
		"repeat": "5",
		"crontab": "",
		"once": false,
		"onceDelay": "",
		"x": 190,
		"y": 420,
		"wires": [
			[
				"2e7d3458.5c8c64"
			]
		]
	},
	{
		"id": "3f7c3856.e9c218",
		"type": "function",
		"z": "542a523.f4d3aac",
		"name": "Filter devices",
		"func": "payload = Object.values(flow.get('cec').devices);\ndevices = new Array()\n\npayload.forEach((elt) => {\n if (elt.physical !== null) {\n     devices.push(elt);\n }\n});\n\nmsg.payload = devices;\nreturn msg;",
		"outputs": 1,
		"noerr": 0,
		"x": 400,
		"y": 660,
		"wires": [
			[
				"781a7082.ea4768"
			]
		]
	},
	{
		"id": "112b76bd.694dc9",
		"type": "mqtt in",
		"z": "542a523.f4d3aac",
		"name": "",
		"topic": "enact/actuators/cec/power",
		"qos": "2",
		"datatype": "auto",
		"broker": "3d661480.8530ac",
		"x": 130,
		"y": 140,
		"wires": [
			[
				"8354ecc1.87f51"
			]
		]
	},
	{
		"id": "8354ecc1.87f51",
		"type": "switch",
		"z": "542a523.f4d3aac",
		"name": "Power",
		"property": "payload",
		"propertyType": "msg",
		"rules": [
			{
				"t": "eq",
				"v": "STANDBY",
				"vt": "str"
			},
			{
				"t": "eq",
				"v": "ON",
				"vt": "str"
			}
		],
		"checkall": "true",
		"repair": false,
		"outputs": 2,
		"x": 330,
		"y": 140,
		"wires": [
			[
				"2c8f6e22.cd4b62"
			],
			[
				"11a3f156.779a6f"
			]
		]
	},
	{
		"id": "11a3f156.779a6f",
		"type": "change",
		"z": "542a523.f4d3aac",
		"name": "TV On",
		"rules": [
			{
				"t": "set",
				"p": "payload",
				"pt": "msg",
				"to": "{\"source\":\"1.0.0.0\",\"target\":\"0.0.0.0\",\"opcode\":\"IMAGE_VIEW_ON\",\"args\":[]}",
				"tot": "json"
			}
		],
		"action": "",
		"property": "",
		"from": "",
		"to": "",
		"reg": false,
		"x": 490,
		"y": 160,
		"wires": [
			[
				"485890c0.e568a8",
				"15fa70ee.45027f"
			]
		]
	},
	{
		"id": "2c8f6e22.cd4b62",
		"type": "change",
		"z": "542a523.f4d3aac",
		"name": "TV Off",
		"rules": [
			{
				"t": "set",
				"p": "payload",
				"pt": "msg",
				"to": "{\"source\":\"1.0.0.0\",\"target\":\"0.0.0.0\",\"opcode\":\"STANDBY\"}",
				"tot": "json"
			}
		],
		"action": "",
		"property": "",
		"from": "",
		"to": "",
		"reg": false,
		"x": 490,
		"y": 120,
		"wires": [
			[
				"485890c0.e568a8",
				"15fa70ee.45027f"
			]
		]
	},
	{
		"id": "52f62113.c9139",
		"type": "mqtt in",
		"z": "542a523.f4d3aac",
		"name": "",
		"topic": "enact/actuators/cec/source",
		"qos": "2",
		"datatype": "auto",
		"broker": "3d661480.8530ac",
		"x": 140,
		"y": 280,
		"wires": [
			[
				"38058f12.4dcec"
			]
		]
	},
	{
		"id": "38058f12.4dcec",
		"type": "switch",
		"z": "542a523.f4d3aac",
		"name": "Source",
		"property": "payload",
		"propertyType": "msg",
		"rules": [
			{
				"t": "eq",
				"v": "0",
				"vt": "str"
			},
			{
				"t": "eq",
				"v": "1",
				"vt": "str"
			},
			{
				"t": "eq",
				"v": "2",
				"vt": "str"
			},
			{
				"t": "eq",
				"v": "3",
				"vt": "str"
			},
			{
				"t": "eq",
				"v": "4",
				"vt": "str"
			}
		],
		"checkall": "true",
		"repair": false,
		"outputs": 5,
		"x": 340,
		"y": 280,
		"wires": [
			[
				"899c52a7.85ee5"
			],
			[
				"1c97e5ec.1f1c12"
			],
			[
				"de0897d5.ab3b5"
			],
			[
				"b46a681b.1ac7e8"
			],
			[
				"6a41b723.28ce88"
			]
		]
	},
	{
		"id": "6a41b723.28ce88",
		"type": "change",
		"z": "542a523.f4d3aac",
		"name": "Freebox Player",
		"rules": [
			{
				"t": "set",
				"p": "payload",
				"pt": "msg",
				"to": "{\"source\":\"1.0.0.0\",\"target\":\"BROADCAST\",\"opcode\":\"active_source\",\"args\":\"4.0.0.0\"}",
				"tot": "json"
			}
		],
		"action": "",
		"property": "",
		"from": "",
		"to": "",
		"reg": false,
		"x": 500,
		"y": 360,
		"wires": [
			[
				"485890c0.e568a8"
			]
		]
	},
	{
		"id": "b46a681b.1ac7e8",
		"type": "change",
		"z": "542a523.f4d3aac",
		"name": "RasPlex",
		"rules": [
			{
				"t": "set",
				"p": "payload",
				"pt": "msg",
				"to": "{\"source\":\"1.0.0.0\",\"target\":\"BROADCAST\",\"opcode\":\"active_source\",\"args\":\"3.0.0.0\"}",
				"tot": "json"
			}
		],
		"action": "",
		"property": "",
		"from": "",
		"to": "",
		"reg": false,
		"x": 500,
		"y": 320,
		"wires": [
			[
				"485890c0.e568a8"
			]
		]
	},
	{
		"id": "de0897d5.ab3b5",
		"type": "change",
		"z": "542a523.f4d3aac",
		"name": "Extra",
		"rules": [
			{
				"t": "set",
				"p": "payload",
				"pt": "msg",
				"to": "{\"source\":\"1.0.0.0\",\"target\":\"BROADCAST\",\"opcode\":\"active_source\",\"args\":\"2.0.0.0\"}",
				"tot": "json"
			}
		],
		"action": "",
		"property": "",
		"from": "",
		"to": "",
		"reg": false,
		"x": 490,
		"y": 280,
		"wires": [
			[
				"485890c0.e568a8"
			]
		]
	},
	{
		"id": "1c97e5ec.1f1c12",
		"type": "change",
		"z": "542a523.f4d3aac",
		"name": "RPi HDMI CEC",
		"rules": [
			{
				"t": "set",
				"p": "payload",
				"pt": "msg",
				"to": "{\"source\":\"1.0.0.0\",\"target\":\"BROADCAST\",\"opcode\":\"active_source\",\"args\":\"1.0.0.0\"}",
				"tot": "json"
			}
		],
		"action": "",
		"property": "",
		"from": "",
		"to": "",
		"reg": false,
		"x": 520,
		"y": 240,
		"wires": [
			[
				"485890c0.e568a8"
			]
		]
	},
	{
		"id": "899c52a7.85ee5",
		"type": "change",
		"z": "542a523.f4d3aac",
		"name": "TV",
		"rules": [
			{
				"t": "set",
				"p": "payload",
				"pt": "msg",
				"to": "{\"source\":\"1.0.0.0\",\"target\":\"BROADCAST\",\"opcode\":\"active_source\",\"args\":\"0.0.0.0\"}",
				"tot": "json"
			}
		],
		"action": "",
		"property": "",
		"from": "",
		"to": "",
		"reg": false,
		"x": 490,
		"y": 200,
		"wires": [
			[
				"485890c0.e568a8"
			]
		]
	},
	{
		"id": "6618de0c.3734c",
		"type": "mosca in",
		"z": "542a523.f4d3aac",
		"mqtt_port": 1883,
		"mqtt_ws_port": 8080,
		"name": "",
		"username": "",
		"password": "",
		"dburl": "",
		"x": 110,
		"y": 40,
		"wires": [
			[]
		]
	},
	{
		"id": "bee3caf0.5b032",
		"type": "inject",
		"z": "542a523.f4d3aac",
		"name": "Get Power Status (freebox)",
		"topic": "",
		"payload": "{\"command\":\"getpowerstatusname\",\"address\":\"4.0.0.0\"}",
		"payloadType": "json",
		"repeat": "5",
		"crontab": "",
		"once": false,
		"onceDelay": "",
		"x": 160,
		"y": 540,
		"wires": [
			[
				"ea1f2b32.246fb8"
			]
		]
	},
	{
		"id": "9a46b7c8.ed52a",
		"type": "cec-in",
		"z": "542a523.f4d3aac",
		"cec_adapter": "b2894984.786168",
		"name": "CEC In",
		"flow_in": true,
		"flow_out": false,
		"select_all": "false",
		"active_source": true,
		"image_view_on": true,
		"text_view_on": true,
		"inactive_source": true,
		"request_active_source": true,
		"routing_change": true,
		"routing_information": true,
		"set_stream_path": true,
		"standby": true,
		"record_off": true,
		"record_on": true,
		"record_status": true,
		"record_tv_screen": true,
		"clear_analogue_timer": true,
		"clear_digital_timer": true,
		"clear_external_timer": true,
		"set_analogue_timer": true,
		"set_digital_timer": true,
		"set_external_timer": true,
		"set_timer_program_title": true,
		"timer_cleared_status": true,
		"timer_status": true,
		"cec_version": true,
		"get_cec_version": true,
		"give_physical_address": true,
		"get_menu_language": true,
		"report_physical_address": true,
		"set_menu_language": true,
		"deck_control": true,
		"deck_status": true,
		"give_deck_status": true,
		"play": true,
		"give_tuner_device_status": true,
		"select_analogue_service": true,
		"select_digital_service": true,
		"tuner_device_status": true,
		"tuner_step_decrement": true,
		"tuner_step_increment": true,
		"device_vendor_id": true,
		"give_device_vendor_id": true,
		"vendor_command": true,
		"vendor_command_with_id": true,
		"vendor_remote_button_down": true,
		"vendor_remote_button_up": true,
		"set_osd_string": true,
		"give_osd_name": true,
		"set_osd_name": true,
		"menu_request": true,
		"menu_status": true,
		"user_control_pressed": true,
		"user_control_release": true,
		"give_device_power_status": true,
		"report_power_status": true,
		"feature_abort": true,
		"abort": true,
		"give_audio_status": true,
		"give_system_audio_mode_status": true,
		"report_audio_status": true,
		"set_system_audio_mode": true,
		"system_audio_mode_request": true,
		"system_audio_mode_status": true,
		"set_audio_rate": true,
		"start_arc": true,
		"report_arc_started": true,
		"report_arc_ended": true,
		"request_arc_start": true,
		"request_arc_end": true,
		"end_arc": true,
		"cdc": true,
		"none": true,
		"x": 670,
		"y": 40,
		"wires": [
			[
				"57f3bb5b.cf343c"
			]
		]
	},
	{
		"id": "57f3bb5b.cf343c",
		"type": "debug",
		"z": "542a523.f4d3aac",
		"name": "",
		"active": false,
		"tosidebar": true,
		"console": false,
		"tostatus": false,
		"complete": "false",
		"x": 840,
		"y": 40,
		"wires": []
	},
	{
		"id": "fbada3e5.54f28",
		"type": "cec-in",
		"z": "542a523.f4d3aac",
		"cec_adapter": "b2894984.786168",
		"name": "CEC Out",
		"flow_in": false,
		"flow_out": true,
		"select_all": "false",
		"active_source": true,
		"image_view_on": true,
		"text_view_on": true,
		"inactive_source": true,
		"request_active_source": true,
		"routing_change": true,
		"routing_information": true,
		"set_stream_path": true,
		"standby": true,
		"record_off": true,
		"record_on": true,
		"record_status": true,
		"record_tv_screen": true,
		"clear_analogue_timer": true,
		"clear_digital_timer": true,
		"clear_external_timer": true,
		"set_analogue_timer": true,
		"set_digital_timer": true,
		"set_external_timer": true,
		"set_timer_program_title": true,
		"timer_cleared_status": true,
		"timer_status": true,
		"cec_version": true,
		"get_cec_version": true,
		"give_physical_address": true,
		"get_menu_language": true,
		"report_physical_address": true,
		"set_menu_language": true,
		"deck_control": true,
		"deck_status": true,
		"give_deck_status": true,
		"play": true,
		"give_tuner_device_status": true,
		"select_analogue_service": true,
		"select_digital_service": true,
		"tuner_device_status": true,
		"tuner_step_decrement": true,
		"tuner_step_increment": true,
		"device_vendor_id": true,
		"give_device_vendor_id": true,
		"vendor_command": true,
		"vendor_command_with_id": true,
		"vendor_remote_button_down": true,
		"vendor_remote_button_up": true,
		"set_osd_string": true,
		"give_osd_name": true,
		"set_osd_name": true,
		"menu_request": true,
		"menu_status": true,
		"user_control_pressed": true,
		"user_control_release": true,
		"give_device_power_status": true,
		"report_power_status": true,
		"feature_abort": true,
		"abort": true,
		"give_audio_status": true,
		"give_system_audio_mode_status": true,
		"report_audio_status": true,
		"set_system_audio_mode": true,
		"system_audio_mode_request": true,
		"system_audio_mode_status": true,
		"set_audio_rate": true,
		"start_arc": true,
		"report_arc_started": true,
		"report_arc_ended": true,
		"request_arc_start": true,
		"request_arc_end": true,
		"end_arc": true,
		"cdc": true,
		"none": true,
		"x": 680,
		"y": 100,
		"wires": [
			[
				"8538e93c.486ef"
			]
		]
	},
	{
		"id": "8538e93c.486ef",
		"type": "debug",
		"z": "542a523.f4d3aac",
		"name": "",
		"active": false,
		"tosidebar": true,
		"console": false,
		"tostatus": false,
		"complete": "false",
		"x": 840,
		"y": 100,
		"wires": []
	},
	{
		"id": "daa6a0c.ed5976",
		"type": "mqtt out",
		"z": "542a523.f4d3aac",
		"name": "",
		"topic": "enact/sensors/cec/status",
		"qos": "",
		"retain": "",
		"broker": "3d661480.8530ac",
		"x": 750,
		"y": 420,
		"wires": []
	},
	{
		"id": "283d0f77.b0bb7",
		"type": "cec-state",
		"z": "542a523.f4d3aac",
		"cec_adapter": "b2894984.786168",
		"name": "Get state",
		"output": "payload",
		"flow_name": "cec",
		"flow": true,
		"scan": false,
		"x": 560,
		"y": 540,
		"wires": [
			[
				"50a7f8e5.f4e8d",
				"1a06201d.9497f8"
			]
		]
	},
	{
		"id": "ea1f2b32.246fb8",
		"type": "change",
		"z": "542a523.f4d3aac",
		"name": "Set properties",
		"rules": [
			{
				"t": "move",
				"p": "payload.address",
				"pt": "msg",
				"to": "address",
				"tot": "msg"
			},
			{
				"t": "move",
				"p": "payload.command",
				"pt": "msg",
				"to": "command",
				"tot": "msg"
			}
		],
		"action": "",
		"property": "",
		"from": "",
		"to": "",
		"reg": false,
		"x": 400,
		"y": 540,
		"wires": [
			[
				"283d0f77.b0bb7"
			]
		]
	},
	{
		"id": "50a7f8e5.f4e8d",
		"type": "mqtt out",
		"z": "542a523.f4d3aac",
		"name": "",
		"topic": "enact/sensors/freebox/status",
		"qos": "",
		"retain": "",
		"broker": "3d661480.8530ac",
		"x": 760,
		"y": 540,
		"wires": []
	},
	{
		"id": "3b796000.8aa5c8",
		"type": "cec-state",
		"z": "542a523.f4d3aac",
		"cec_adapter": "b2894984.786168",
		"name": "Get state",
		"output": "payload",
		"flow_name": "cec",
		"flow": true,
		"scan": false,
		"x": 560,
		"y": 480,
		"wires": [
			[
				"2324a463.78c2a4",
				"1a06201d.9497f8"
			]
		]
	},
	{
		"id": "eb19b308.07b61",
		"type": "change",
		"z": "542a523.f4d3aac",
		"name": "Set properties",
		"rules": [
			{
				"t": "move",
				"p": "payload.address",
				"pt": "msg",
				"to": "address",
				"tot": "msg"
			},
			{
				"t": "move",
				"p": "payload.command",
				"pt": "msg",
				"to": "command",
				"tot": "msg"
			}
		],
		"action": "",
		"property": "",
		"from": "",
		"to": "",
		"reg": false,
		"x": 400,
		"y": 480,
		"wires": [
			[
				"3b796000.8aa5c8"
			]
		]
	},
	{
		"id": "2324a463.78c2a4",
		"type": "mqtt out",
		"z": "542a523.f4d3aac",
		"name": "",
		"topic": "enact/sensors/cec/source",
		"qos": "",
		"retain": "",
		"broker": "3d661480.8530ac",
		"x": 750,
		"y": 480,
		"wires": []
	},
	{
		"id": "5a5c1a02.c78584",
		"type": "inject",
		"z": "542a523.f4d3aac",
		"name": "Get Active Source",
		"topic": "",
		"payload": "{\"command\":\"getactivesource\"}",
		"payloadType": "json",
		"repeat": "5",
		"crontab": "",
		"once": false,
		"onceDelay": "",
		"x": 190,
		"y": 480,
		"wires": [
			[
				"eb19b308.07b61"
			]
		]
	},
	{
		"id": "1a06201d.9497f8",
		"type": "debug",
		"z": "542a523.f4d3aac",
		"name": "",
		"active": false,
		"tosidebar": true,
		"console": false,
		"tostatus": false,
		"complete": "false",
		"x": 710,
		"y": 380,
		"wires": []
	},
	{
		"id": "15fa70ee.45027f",
		"type": "debug",
		"z": "542a523.f4d3aac",
		"name": "",
		"active": false,
		"tosidebar": true,
		"console": false,
		"tostatus": false,
		"complete": "false",
		"x": 720,
		"y": 180,
		"wires": []
	},
	{
		"id": "b2894984.786168",
		"type": "cec-config",
		"z": "",
		"OSDname": "node-red",
		"comport": "",
		"hdmiport": "1",
		"player": true,
		"recorder": false,
		"tuner": false,
		"audio": false
	},
	{
		"id": "3d661480.8530ac",
		"type": "mqtt-broker",
		"z": "",
		"name": "",
		"broker": "localhost",
		"port": "1883",
		"clientid": "",
		"usetls": false,
		"compatmode": false,
		"keepalive": "60",
		"cleansession": true,
		"birthTopic": "",
		"birthQos": "0",
		"birthPayload": "",
		"closeTopic": "",
		"closeQos": "0",
		"closePayload": "",
		"willTopic": "",
		"willQos": "0",
		"willPayload": ""
	}
]