[
    {
        "type": "node-red",
        "name": "OR",
        "class": "Logic",
        "metadata": { "physicalProcessType": "generic", "inputType": "boolean" },
        "codeTemplate": "{}",
        "description": "Logic OR between inputs"
    },
    {
        "type": "node-red",
        "name": "AND",
        "class": "Logic",
        "metadata": { "physicalProcessType": "generic", "inputType": "boolean" },
        "codeTemplate": "{}",
        "description": "Logic AND between inputs"
    },
    {
        "type": "node-red",
        "name": "Average",
        "class": "Math",
        "metadata": { "physicalProcessType": "generic", "inputType": "number" },
        "codeTemplate": "{}",
        "description": "Average between inputs"
    },
    {
        "type": "node-red",
        "name": "Min",
        "class": "Math",
        "metadata": { "physicalProcessType": "generic", "inputType": "number" },
        "codeTemplate": "{}",
        "description": "Min of inputs"
    },
    {
        "type": "node-red",
        "name": "Max",
        "class": "Math",
        "metadata": { "physicalProcessType": "generic", "inputType": "number" },
        "codeTemplate": "{}",
        "description": "Max of inputs"
    },
    {
        "type": "node-red",
        "name": "Random",
        "class": "Misc",
        "metadata": { "physicalProcessType": "generic", "inputType": "generic" },
        "codeTemplate": "{}",
        "description": "Random input"
    },
    {
        "type": "node-red",
        "name": "Light",
        "class": "Light",
        "metadata": { "physicalProcessType": "light", "inputType": "boolean" },
        "codeTemplate": "{}",
        "description": "Toggle for lights system"
    },
    {
        "type": "node-red",
        "name": "LightRGB",
        "class": "Light",
        "metadata": { "physicalProcessType": "light", "inputType": "grovergb" },
        "codeTemplate": "{}",
        "description": "Toggle for lights system, RGB LED variant"
    },
    {
        "type": "node-red",
        "name": "FSM",
        "class": "FSM",
        "metadata": { "physicalProcessType": "generic", "inputType": "generic" },
        "codeTemplate": "{}",
        "description": "FSM SCXML based behaviour"
    }, {
        "type": "node-red",
        "name": "SocketBefore",
        "class": "Demo",
        "metadata": { "physicalProcessType": "generic", "inputType": "generic" },
        "codeTemplate": "{}",
        "description": "Socket must be turned on before the light"
    }, {
        "type": "node-red",
        "name": "PassThrough",
        "class": "Generic",
        "metadata": { "physicalProcessType": "generic", "inputType": "generic" },
        "codeTemplate": "{}",
        "description": "Inputs are passed through to the output"
    }, {
        "type": "node-red",
        "name": "incColor",
        "class": "Generic",
        "metadata": { "physicalProcessType": "light", "inputType": "number" },
        "codeTemplate": "{}",
        "description": "honestly i have no idea"
    }, {
        "type": "node-red",
        "name": "onOffIncColor",
        "class": "Generic",
        "metadata": { "physicalProcessType": "light", "inputType": "number" },
        "codeTemplate": "{}",
        "description": "honestly i have no idea"
    }, {
        "type": "node-red",
        "name": "Broadcast",
        "class": "Generic",
        "metadata": { "physicalProcessType": "generic", "inputType": "generic" },
        "codeTemplate": "{}",
        "description": "Broadcasts the first input it receives to all outs"
    }, {
        "type": "node-red",
        "name": "SodiumColor",
        "class": "Generic",
        "metadata": { "physicalProcessType": "generic", "inputType": "generic" },
        "codeTemplate": "{}",
        "description": "Broadcasts the first input it receives to all outs"
    }, {
        "type": "node-red",
        "name": "AgendaLockACSCAAC",
        "class": "Generic",
        "metadata": { "physicalProcessType": "generic", "inputType": "generic", "for": "hackathon" },
        "codeTemplate": "{}",
        "description": "Lock ACS with agenda reservations and CAAC"
    }, {
        "type": "node-red",
        "name": "AgendaLockACS",
        "class": "Generic",
        "metadata": { "physicalProcessType": "generic", "inputType": "generic", "for": "hackathon" },
        "codeTemplate": "{}",
        "description": "Lock ACS with agenda reservations"
    }, {
        "type": "node-red",
        "name": "TimeLockACS",
        "class": "Generic",
        "metadata": { "physicalProcessType": "generic", "inputType": "generic", "for": "hackathon" },
        "codeTemplate": "{}",
        "description": "Lock ACS refusing overtime work"
    }, {
        "type": "node-red",
        "name": "SimpleLockACS",
        "class": "Generic",
        "metadata": { "physicalProcessType": "generic", "inputType": "generic", "for": "hackathon" },
        "codeTemplate": "{}",
        "description": "Simple lock ACS"
    }
]