<?xml version="1.0" encoding="UTF-8" standalone="no"?>
<svg
   xmlns:dc="http://purl.org/dc/elements/1.1/"
   xmlns:cc="http://creativecommons.org/ns#"
   xmlns:rdf="http://www.w3.org/1999/02/22-rdf-syntax-ns#"
   xmlns:svg="http://www.w3.org/2000/svg"
   xmlns="http://www.w3.org/2000/svg"
   xmlns:sodipodi="http://sodipodi.sourceforge.net/DTD/sodipodi-0.dtd"
   xmlns:inkscape="http://www.inkscape.org/namespaces/inkscape"
   inkscape:version="1.0rc1 (09960d6f05, 2020-04-09)"
   sodipodi:docname="aneth-log.svg"
   viewBox="0 0 682.66669 682.66669"
   height="682.66669"
   width="682.66669"
   id="svg2167"
   version="1.1">
  <metadata
     id="metadata2173">
    <rdf:RDF>
      <cc:Work
         rdf:about="">
        <dc:format>image/svg+xml</dc:format>
        <dc:type
           rdf:resource="http://purl.org/dc/dcmitype/StillImage" />
        <dc:title></dc:title>
      </cc:Work>
    </rdf:RDF>
  </metadata>
  <defs
     id="defs2171" />
  <sodipodi:namedview
     inkscape:current-layer="g2175"
     inkscape:window-maximized="1"
     inkscape:window-y="27"
     inkscape:window-x="1920"
     inkscape:cy="244.16258"
     inkscape:cx="263.70662"
     inkscape:zoom="1.0109417"
     showgrid="false"
     id="namedview2169"
     inkscape:window-height="1136"
     inkscape:window-width="1920"
     inkscape:pageshadow="2"
     inkscape:pageopacity="0"
     guidetolerance="10"
     gridtolerance="10"
     objecttolerance="10"
     borderopacity="1"
     bordercolor="#ffffff"
     pagecolor="#ffffff" />
  <g
     id="g2175"
     inkscape:label="Image"
     inkscape:groupmode="layer">
    <path
       sodipodi:nodetypes="ccssssssssssssssssssssssssssssssssssssssssssssccsssssssssssssssssccsssssscccccccccssc"
       inkscape:connector-curvature="0"
       d="m 143.27344,159.33398 -2.15039,4 c -1.18254,2.2 -4.32873,10.59935 -6.99219,18.66602 -5.15194,15.60338 -20.10557,47.33398 -22.30664,47.33398 -0.72367,0 -1.01676,-0.48264 -0.65234,-1.07226 0.8507,-1.37649 2.60208,-34.12492 2.46289,-46.05274 -0.12336,-10.57105 -1.55243,-13.81599 -1.80469,-4.09765 -0.0936,3.60556 -4.14106,14.97546 -4.31876,16.44213 -0.17769,1.46667 -2.36677,7.36703 -2.92237,12.86703 -0.5556,5.5 -0.68642,9.39984 -0.90957,11.59984 -0.41546,4.096 0.0854,15.5622 -0.71285,25.09795 -0.24556,2.93334 -0.82957,7.65315 -0.90569,12.05315 -0.17718,10.24026 1.32774,8.03939 -1.33818,-6.4019 -3.915079,-21.20799 -5.638622,-37.97964 -6.693363,-65.10351 -0.465782,-11.97809 -1.492599,-20.57464 -2.587891,-21.66993 -0.218016,-0.21801 -1.167702,3.2345 -2.109375,7.67188 -2.118343,9.98208 -4.54326,52.83212 -1.827132,60.64688 1.4759,4.24641 2.108278,-0.0209 -1.364274,-6.3168 -5.405603,-9.80059 -21.107952,-31.65738 -25.667969,-35.73047 -5.39097,-4.81531 -9.11222,-7.49607 -8.238281,-5.9336 0.410176,0.73333 1.844563,3.73268 3.1875,6.66602 1.342939,2.93333 4.661655,8.03398 7.375,11.33398 12.836428,15.6118 30.266425,52.87755 31.776127,62.70624 0.489651,3.1878 4.378729,12.96214 4.609949,18.14222 0.14804,3.31658 0.626759,3.66804 0.263939,10.10175 -0.26449,4.69021 0.84593,7.51871 0.66348,7.69741 -0.182463,0.17868 -9.253967,-5.06373 -22.874042,-14.24722 -19.267432,-12.99132 -25.134121,-17.62689 -26.433594,-20.88282 -0.918594,-2.3016 -3.477601,-9.28424 -5.685546,-15.51758 -4.119096,-11.62876 -12.501817,-30.66796 -13.503907,-30.66796 -2.281091,0 6.819713,35.18586 10.316407,39.88476 1.164265,1.56454 0.949712,1.63537 -1.263672,0.41406 -2.411275,-1.33049 -13.701905,-12.76193 -30.052735,-30.42578 -9.72732675,-10.50847 -10.99658929,-10.9713 -6.4335935,-2.34961 6.3949525,12.08315 17.3251345,24.49706 35.4511715,40.26563 6.00146,5.22091 8.561259,8.70713 11.59375,15.78906 2.140481,4.99878 7.090482,15.52927 11,23.40039 3.909519,7.87112 7.109375,14.69764 7.109375,15.16992 0,0.47228 -2.585647,-1.46714 -5.746093,-4.31054 C 54.669012,308.47976 51.710835,306.14146 42.9375,300.18359 27.224412,289.51304 15.766668,287.65847 29.447266,298 c 2.910332,2.2 6.032937,4.60065 6.939453,5.33398 0.906515,0.73334 4.639998,3.42105 8.296875,5.97266 14.928367,10.41639 32.897912,36.2362 38.197671,45.54812 2.31862,4.07391 13.099742,17.89352 16.31853,22.88948 5.731505,8.89599 2.381465,-2.64396 2.858795,10.00576 0.10591,2.80668 0.22437,5.63238 0.34766,8.42969 l 12.17773,5.80469 c -0.15211,-2.34249 -0.25201,-4.31459 -0.20703,-5.09766 0.17055,-2.96925 8.22428,-13.74105 17.29883,-23.13672 4.46565,-4.62368 10.37871,-8.73809 17.83594,-12.41211 20.02256,-9.86475 27.26758,-16.06759 25.28906,-21.64648 -0.72247,-2.03718 -1.28495,-1.87223 -4.80859,1.39648 -5.35317,4.96585 -17.13127,12.96644 -16.49805,11.20703 0.27787,-0.77206 4.73656,-5.81623 9.9082,-11.20898 13.43188,-14.00615 22.76928,-26.3001 26.66602,-35.11133 1.85826,-4.20186 3.15085,-7.86672 2.87305,-8.14453 -0.72816,-0.72815 -8.87575,8.30117 -16.30079,18.06445 -7.9013,10.38953 -30.33298,30.11208 -31.87479,30.11208 -0.27886,0 -0.15761,-7.01143 -0.1572,-10.86143 0.002,-21.24684 -4.3405,-32.47916 -8.92894,-32.47916 -1.44927,0 -1.1913,10.27979 0.43554,17.33398 1.59838,6.93083 0.83013,33.16681 -0.39695,36.3211 -0.45548,1.1708 -5.12185,4.69341 -11.75852,11.82805 -9.96165,10.70911 -9.27971,12.71827 -9.35231,10.15839 -0.0484,-1.70544 -0.94423,-4.57031 -1.39598,-13.12823 l -0.45855,-13.33589 3.1006,-18.06998 c 4.22788,-24.63968 22.02963,-52.26433 34.55468,-72.69727 7.24828,-11.8246 12.60658,-22.50477 11.73047,-23.38086 -1.45276,-1.45276 -22.112,23.55643 -28.54497,34.40535 -8.54045,14.40312 -14.65126,21.16215 -20.44675,36.07827 -2.48675,6.40028 -2.19529,6.04331 -2.61376,6.05971 -0.41844,0.0164 -0.57442,-5.1496 -0.39452,-28.26208 l 0.16129,-23.08936 5.47559,-8.81102 c 17.74417,-28.60634 29.75157,-77.87998 28.21078,-89.41016 z M 58.410156,282.32227 c 1.586051,-0.17632 15.813839,17.60783 34.317227,30.71846 l 6.998436,8.56932 0.631191,15.19284 c -0.12026,13.93086 1.04375,24.90767 0.71721,25.23422 -1.640114,1.6401 -38.052706,-66.0698 -42.765626,-79.52344 -0.04065,-0.11605 -0.0042,-0.17965 0.101562,-0.1914 z"
       style="fill:#609f60;stroke-width:1.33333"
       id="path2740" />
  </g>
</svg>
