<svg width="30" height="30" viewBox="0 0 30 30" fill="none" xmlns="http://www.w3.org/2000/svg">
<path fill-rule="evenodd" clip-rule="evenodd" d="M28.125 15.079C28.125 7.83093 22.248 1.95398 15 1.95398C7.75195 1.95398 1.875 7.83093 1.875 15.079C1.875 21.6298 6.67383 27.0596 12.9492 28.0452V18.8741H9.61582V15.079H12.9492V12.1874C12.9492 8.89851 14.9092 7.08035 17.9068 7.08035C19.343 7.08035 20.8453 7.33699 20.8453 7.33699V10.5673H19.1895C17.56 10.5673 17.0502 11.5786 17.0502 12.618V15.079H20.69L20.1088 18.8741H17.0508V28.0464C23.3262 27.0614 28.125 21.6315 28.125 15.079Z" fill="black"/>
</svg>
