<svg width="60" height="60" viewBox="0 0 60 60" fill="none" xmlns="http://www.w3.org/2000/svg">
<path d="M30 7.5C17.5781 7.5 7.5 17.5781 7.5 30C7.5 42.4219 17.5781 52.5 30 52.5C42.4219 52.5 52.5 42.4219 52.5 30C52.5 17.5781 42.4219 7.5 30 7.5ZM31.2234 42.8906H27.6832C27.6035 42.8903 27.5272 42.8584 27.471 42.802C27.4148 42.7456 27.3832 42.6691 27.3832 42.5895V39.0504C27.3832 38.9707 27.4148 38.8943 27.471 38.8378C27.5272 38.7814 27.6035 38.7495 27.6832 38.7492H31.2234C31.3031 38.7495 31.3794 38.7814 31.4356 38.8378C31.4919 38.8943 31.5234 38.9707 31.5234 39.0504V42.5895C31.5234 42.6691 31.4919 42.7456 31.4356 42.802C31.3794 42.8584 31.3031 42.8903 31.2234 42.8906ZM33.2156 31.2891C31.316 32.5641 31.0547 33.7324 31.0547 34.8047V36.0938C31.0547 36.187 31.0176 36.2764 30.9517 36.3423C30.8858 36.4083 30.7964 36.4453 30.7031 36.4453H28.125C28.0318 36.4453 27.9423 36.4083 27.8764 36.3423C27.8105 36.2764 27.7734 36.187 27.7734 36.0938V34.8047C27.7734 32.2371 28.9547 30.1957 31.3852 28.5633C33.6445 27.0469 34.9219 26.0859 34.9219 23.973C34.9219 22.5363 34.1016 21.4453 32.4035 20.6379C32.0039 20.448 31.1145 20.2629 30.0199 20.2758C28.6465 20.2934 27.5801 20.6215 26.7586 21.2824C25.2094 22.5293 25.0781 23.8875 25.0781 23.9062C25.0138 24.3046 24.9809 24.7074 24.9797 25.1109C24.9797 25.2042 24.9426 25.2936 24.8767 25.3595C24.8108 25.4255 24.7214 25.4625 24.6281 25.4625H22.1379C22.0506 25.463 21.9663 25.431 21.9013 25.3727C21.8363 25.3144 21.7953 25.2341 21.7863 25.1473C21.7441 24.6793 21.7477 24.2083 21.7969 23.741C21.8227 23.4562 22.0078 20.891 24.6996 18.7254C26.0953 17.6027 27.8707 17.0191 29.973 16.9934C31.4613 16.9758 32.8594 17.2277 33.8074 17.6754C36.6445 19.0242 38.2031 21.2613 38.2031 23.973C38.2031 27.9375 35.5535 29.7176 33.2156 31.2891Z" fill="black"/>
</svg>
