passenger_id,survived,passenger_class,passenger_name,sex,age,child,n_siblings,n_parents_children,ticket,cost,cabin,embarked_from
104,0,3,"Johansson, Mr. Gustaf Joel",male,33,0,0,0,7540,8.6542,NA,"Southampton, England"
551,1,1,"Thayer, Mr. John Borland Jr",male,17,1,0,2,17421,110.8833,C70,"Cherbourg, France"
540,1,1,"Frolicher, Miss. Hedwig Margaritha",female,22,0,0,2,13568,49.5,B39,"Cherbourg, France"
890,1,1,"Behr, Mr. Karl Howell",male,26,0,0,0,111369,30,C148,"Cherbourg, France"
762,0,3,"Nirva, Mr. Iisakki Antino Aijo",male,41,0,0,0,SOTON/O2 3101272,7.125,NA,"Southampton, England"
567,0,3,"Stoytcheff, Mr. Ilia",male,19,0,0,0,349205,7.8958,NA,"Southampton, England"
9,1,3,"Johnson, Mrs. Oscar W (Elisabeth Vilhelmina Berg)",female,27,0,0,2,347742,11.1333,NA,"Southampton, England"
205,1,3,"Cohen, Mr. Gurshon ""Gus""",male,18,0,0,0,A/5 3540,8.05,NA,"Southampton, England"
587,0,2,"Jarvis, Mr. John Denzil",male,47,0,0,0,237565,15,NA,"Southampton, England"
442,0,3,"Hampe, Mr. Leon",male,20,0,0,0,345769,9.5,NA,"Southampton, England"
610,1,1,"Shutes, Miss. Elizabeth W",female,40,0,0,0,PC 17582,153.4625,C125,"Southampton, England"
472,0,3,"Cacic, Mr. Luka",male,38,0,0,0,315089,8.6625,NA,"Southampton, England"
244,0,3,"Maenpaa, Mr. Matti Alexanteri",male,22,0,0,0,STON/O 2. 3101275,7.125,NA,"Southampton, England"
810,1,1,"Chambers, Mrs. Norman Campbell (Bertha Griggs)",female,33,0,1,0,113806,53.1,E8,"Southampton, England"
252,0,3,"Strom, Mrs. Wilhelm (Elna Matilda Persson)",female,29,0,1,1,347054,10.4625,G6,"Southampton, England"
730,0,3,"Ilmakangas, Miss. Pieta Sofia",female,25,0,1,0,STON/O2. 3101271,7.925,NA,"Southampton, England"
245,0,3,"Attalah, Mr. Sleiman",male,30,0,0,0,2694,7.225,NA,"Cherbourg, France"
230,0,3,"Lefebre, Miss. Mathilde",female,21.7742380952381,0,3,1,4133,25.4667,NA,"Southampton, England"
162,1,2,"Watt, Mrs. James (Elizabeth ""Bessie"" Inglis Milne)",female,40,0,0,0,C.A. 33595,15.75,NA,"Southampton, England"
201,0,3,"Vande Walle, Mr. Nestor Cyriel",male,28,0,0,0,345770,9.5,NA,"Southampton, England"
269,1,1,"Graham, Mrs. William Thompson (Edith Junkins)",female,58,0,0,1,PC 17582,153.4625,C125,"Southampton, England"
257,1,1,"Thorne, Mrs. Gertrude Maybelle",female,36.8045977011494,0,0,0,PC 17585,79.2,NA,"Cherbourg, France"
139,0,3,"Osen, Mr. Olaf Elon",male,16,1,0,0,7534,9.2167,NA,"Southampton, England"
34,0,2,"Wheadon, Mr. Edward H",male,66,0,0,0,C.A. 24579,10.5,NA,"Southampton, England"
188,1,1,"Romaine, Mr. Charles Hallace (""Mr C Rolmane"")",male,45,0,0,0,111428,26.55,NA,"Southampton, England"
699,0,1,"Thayer, Mr. John Borland",male,49,0,1,1,17421,110.8833,C68,"Cherbourg, France"
882,0,3,"Markun, Mr. Johann",male,33,0,0,0,349257,7.8958,NA,"Southampton, England"
788,0,3,"Rice, Master. George Hugh",male,8,1,4,1,382652,29.125,NA,"Queenstown, England"
713,1,1,"Taylor, Mr. Elmer Zebley",male,48,0,1,0,19996,52,C126,"Southampton, England"
39,0,3,"Vander Planke, Miss. Augusta Maria",female,18,0,2,0,345764,18,NA,"Southampton, England"
380,0,3,"Gustafsson, Mr. Karl Gideon",male,19,0,0,0,347069,7.775,NA,"Southampton, England"
225,1,1,"Hoyt, Mr. Frederick Maxfield",male,38,0,1,0,19943,90,C93,"Southampton, England"
255,0,3,"Rosblom, Mrs. Viktor (Helena Wilhelmina)",female,41,0,0,2,370129,20.2125,NA,"Southampton, England"
423,0,3,"Zimmerman, Mr. Leo",male,29,0,0,0,315082,7.875,NA,"Southampton, England"
153,0,3,"Meo, Mr. Alfonzo",male,55.5,0,0,0,A.5. 11206,8.05,NA,"Southampton, England"
648,1,1,"Simonius-Blumer, Col. Oberst Alfons",male,56,0,0,0,13213,35.5,A26,"Cherbourg, France"
171,0,1,"Van der hoef, Mr. Wyckoff",male,61,0,0,0,111240,33.5,B19,"Southampton, England"
218,0,2,"Jacobsohn, Mr. Sidney Samuel",male,42,0,1,0,243847,27,NA,"Southampton, England"
844,0,3,"Lemberopolous, Mr. Peter L",male,34.5,0,0,0,2683,6.4375,NA,"Cherbourg, France"
684,0,3,"Goodwin, Mr. Charles Edward",male,14,1,5,2,CA 2144,46.9,NA,"Southampton, England"
457,0,1,"Millet, Mr. Francis Davis",male,65,0,0,0,13509,26.55,E38,"Southampton, England"
543,0,3,"Andersson, Miss. Sigrid Elisabeth",female,11,1,4,2,347082,31.275,NA,"Southampton, England"
258,1,1,"Cherry, Miss. Gladys",female,30,0,0,0,110152,86.5,B77,"Southampton, England"
519,1,2,"Angle, Mrs. William A (Florence ""Mary"" Agnes Hughes)",female,36,0,1,0,226875,26,NA,"Southampton, England"
272,1,3,"Tornquist, Mr. William Henry",male,25,0,0,0,LINE,0,NA,"Southampton, England"
409,0,3,"Birkeland, Mr. Hans Martin Monsen",male,21,0,0,0,312992,7.775,NA,"Southampton, England"
886,0,3,"Rice, Mrs. William (Margaret Norton)",female,39,0,0,5,382652,29.125,NA,"Queenstown, England"
396,0,3,"Johansson, Mr. Erik",male,22,0,0,0,350052,7.7958,NA,"Southampton, England"
203,0,3,"Johanson, Mr. Jakob Alfred",male,34,0,0,0,3101264,6.4958,NA,"Southampton, England"
641,0,3,"Jensen, Mr. Hans Peder",male,20,0,0,0,350050,7.8542,NA,"Southampton, England"
63,0,1,"Harris, Mr. Henry Birkhardt",male,45,0,1,0,36973,83.475,C83,"Southampton, England"
253,0,1,"Stead, Mr. William Thomas",male,62,0,0,0,113514,26.55,C87,"Southampton, England"
596,0,3,"Van Impe, Mr. Jean Baptiste",male,36,0,1,1,345773,24.15,NA,"Southampton, England"
407,0,3,"Widegren, Mr. Carl/Charles Peter",male,51,0,0,0,347064,7.75,NA,"Southampton, England"
129,1,3,"Peter, Miss. Anna",female,21.7742380952381,0,1,1,2668,22.3583,F E69,"Cherbourg, France"
405,0,3,"Oreskovic, Miss. Marija",female,20,0,0,0,315096,8.6625,NA,"Southampton, England"
398,0,2,"McKane, Mr. Peter David",male,46,0,0,0,28403,26,NA,"Southampton, England"
621,0,3,"Yasbeck, Mr. Antoni",male,27,0,1,0,2659,14.4542,NA,"Cherbourg, France"
144,0,3,"Burke, Mr. Jeremiah",male,19,0,0,0,365222,6.75,NA,"Queenstown, England"
864,0,3,"Sage, Miss. Dorothy Edith ""Dolly""",female,21.7742380952381,0,8,2,CA. 2343,69.55,NA,"Southampton, England"
710,1,3,"Moubarek, Master. Halim Gonios (""William George"")",male,5.48264150943396,1,1,1,2661,15.2458,NA,"Cherbourg, France"
33,1,3,"Glynn, Miss. Mary Agatha",female,21.7742380952381,0,0,0,335677,7.75,NA,"Queenstown, England"
856,1,3,"Aks, Mrs. Sam (Leah Rosen)",female,18,0,0,1,392091,9.35,NA,"Southampton, England"
11,1,3,"Sandstrom, Miss. Marguerite Rut",female,4,1,1,1,PP 9549,16.7,G6,"Southampton, England"
194,1,2,"Navratil, Master. Michel M",male,3,1,1,1,230080,26,F2,"Southampton, England"
577,1,2,"Garside, Miss. Ethel",female,34,0,0,0,243880,13,NA,"Southampton, England"
247,0,3,"Lindahl, Miss. Agda Thorilda Viktoria",female,25,0,0,0,347071,7.775,NA,"Southampton, England"
403,0,3,"Jussila, Miss. Mari Aina",female,21,0,1,0,4137,9.825,NA,"Southampton, England"
41,0,3,"Ahlin, Mrs. Johan (Johanna Persdotter Larsson)",female,40,0,1,0,7546,9.475,NA,"Southampton, England"
447,1,2,"Mellinger, Miss. Madeleine Violet",female,13,1,0,1,250644,19.5,NA,"Southampton, England"
100,0,2,"Kantor, Mr. Sinai",male,34,0,1,0,244367,26,NA,"Southampton, England"
722,0,3,"Jensen, Mr. Svend Lauritz",male,17,1,1,0,350048,7.0542,NA,"Southampton, England"
12,1,1,"Bonnell, Miss. Elizabeth",female,58,0,0,0,113783,26.55,C103,"Southampton, England"
633,1,1,"Stahelin-Maeglin, Dr. Max",male,32,0,0,0,13214,30.5,B50,"Cherbourg, France"
74,0,3,"Chronopoulos, Mr. Apostolos",male,26,0,1,0,2680,14.4542,NA,"Cherbourg, France"
406,0,2,"Gale, Mr. Shadrach",male,34,0,1,0,28664,21,NA,"Southampton, England"
305,0,3,"Williams, Mr. Howard Hugh ""Harry""",male,35.1153846153846,0,0,0,A/5 2466,8.05,NA,"Southampton, England"
59,1,2,"West, Miss. Constance Mirium",female,5,1,1,2,C.A. 34651,27.75,NA,"Southampton, England"
835,0,3,"Allum, Mr. Owen George",male,18,0,0,0,2223,8.3,NA,"Southampton, England"
533,0,3,"Elias, Mr. Joseph Jr",male,17,1,1,1,2690,7.2292,NA,"Cherbourg, France"
738,1,1,"Lesurer, Mr. Gustave J",male,35,0,0,0,PC 17755,512.3292,B101,"Cherbourg, France"
368,1,3,"Moussa, Mrs. (Mantoura Boulos)",female,36.8045977011494,0,0,0,2626,7.2292,NA,"Cherbourg, France"
116,0,3,"Pekoniemi, Mr. Edvard",male,21,0,0,0,STON/O 2. 3101294,7.925,NA,"Southampton, England"
855,0,2,"Carter, Mrs. Ernest Courtenay (Lilian Hughes)",female,44,0,1,0,244252,26,NA,"Southampton, England"
154,0,3,"van Billiard, Mr. Austin Blyler",male,40.5,0,0,2,A/5. 851,14.5,NA,"Southampton, England"
711,1,1,"Mayne, Mlle. Berthe Antonine (""Mrs de Villiers"")",female,24,0,0,0,PC 17482,49.5042,C90,"Cherbourg, France"
805,1,3,"Hedman, Mr. Oskar Arvid",male,27,0,0,0,347089,6.975,NA,"Southampton, England"
242,1,3,"Murphy, Miss. Katherine ""Kate""",female,21.7742380952381,0,1,0,367230,15.5,NA,"Queenstown, England"
831,1,3,"Yasbeck, Mrs. Antoni (Selini Alexander)",female,15,1,1,0,2659,14.4542,NA,"Cherbourg, France"
706,0,2,"Morley, Mr. Henry Samuel (""Mr Henry Marshall"")",male,39,0,0,0,250655,26,NA,"Southampton, England"
133,0,3,"Robins, Mrs. Alexander A (Grace Charity Laury)",female,47,0,1,0,A/5. 3337,14.5,NA,"Southampton, England"
707,1,2,"Kelly, Mrs. Florence ""Fannie""",female,45,0,0,0,223596,13.5,NA,"Southampton, England"
107,1,3,"Salkjelsvik, Miss. Anna Kristine",female,21,0,0,0,343120,7.65,NA,"Southampton, England"
106,0,3,"Mionoff, Mr. Stoytcho",male,28,0,0,0,349207,7.8958,NA,"Southampton, England"
84,0,1,"Carrau, Mr. Francisco M",male,28,0,0,0,113059,47.1,NA,"Southampton, England"
390,1,2,"Lehmann, Miss. Bertha",female,17,1,0,0,SC 1748,12,NA,"Cherbourg, France"
232,0,3,"Larsson, Mr. Bengt Edvin",male,29,0,0,0,347067,7.775,NA,"Southampton, England"
20,1,3,"Masselmani, Mrs. Fatima",female,36.8045977011494,0,0,0,2649,7.225,NA,"Cherbourg, France"
238,1,2,"Collyer, Miss. Marjorie ""Lottie""",female,8,1,0,2,C.A. 31921,26.25,NA,"Southampton, England"
817,0,3,"Heininen, Miss. Wendla Maria",female,23,0,0,0,STON/O2. 3101290,7.925,NA,"Southampton, England"
26,1,3,"Asplund, Mrs. Carl Oscar (Selma Augusta Emilia Johansson)",female,38,0,1,5,347077,31.3875,NA,"Southampton, England"
428,1,2,"Phillips, Miss. Kate Florence (""Mrs Kate Louise Phillips Marshall"")",female,19,0,0,0,250655,26,NA,"Southampton, England"
216,1,1,"Newell, Miss. Madeleine",female,31,0,1,0,35273,113.275,D36,"Cherbourg, France"
157,1,3,"Gilnagh, Miss. Katherine ""Katie""",female,16,1,0,0,35851,7.7333,NA,"Queenstown, England"
786,0,3,"Harmer, Mr. Abraham (David Lishin)",male,25,0,0,0,374887,7.25,NA,"Southampton, England"
246,0,1,"Minahan, Dr. William Edward",male,44,0,2,0,19928,90,C78,"Queenstown, England"
121,0,2,"Hickman, Mr. Stanley George",male,21,0,2,0,S.O.C. 14879,73.5,NA,"Southampton, England"
103,0,1,"White, Mr. Richard Frasar",male,21,0,0,1,35281,77.2875,D26,"Southampton, England"
328,1,2,"Ball, Mrs. (Ada E Hall)",female,36,0,0,0,28551,13,D,"Southampton, England"
28,0,1,"Fortune, Mr. Charles Alexander",male,19,0,3,2,19950,263,C23 C25 C27,"Southampton, England"
846,0,3,"Abbing, Mr. Anthony",male,42,0,0,0,C.A. 5547,7.55,NA,"Southampton, England"
80,1,3,"Dowdell, Miss. Elizabeth",female,30,0,0,0,364516,12.475,NA,"Southampton, England"
723,0,2,"Gillespie, Mr. William Henry",male,34,0,0,0,12233,13,NA,"Southampton, England"
94,0,3,"Dean, Mr. Bertram Frank",male,26,0,1,2,C.A. 2315,20.575,NA,"Southampton, England"
166,1,3,"Goldsmith, Master. Frank John William ""Frankie""",male,9,1,0,2,363291,20.525,NA,"Southampton, England"
694,0,3,"Saad, Mr. Khalil",male,25,0,0,0,2672,7.225,NA,"Cherbourg, France"
716,0,3,"Soholt, Mr. Peter Andreas Lauritz Andersen",male,19,0,0,0,348124,7.65,F G73,"Southampton, England"
210,1,1,"Blank, Mr. Henry",male,40,0,0,0,112277,31,A31,"Cherbourg, France"
95,0,3,"Coxon, Mr. Daniel",male,59,0,0,0,364500,7.25,NA,"Southampton, England"
601,1,2,"Jacobsohn, Mrs. Sidney Samuel (Amy Frances Christy)",female,24,0,2,1,243847,27,NA,"Southampton, England"
559,1,1,"Taussig, Mrs. Emil (Tillie Mandelbaum)",female,39,0,1,1,110413,79.65,E67,"Southampton, England"
689,0,3,"Fischer, Mr. Eberhard Thelander",male,18,0,0,0,350036,7.7958,NA,"Southampton, England"
747,0,3,"Abbott, Mr. Rossmore Edward",male,16,1,1,1,C.A. 2673,20.25,NA,"Southampton, England"
790,0,1,"Guggenheim, Mr. Benjamin",male,46,0,0,0,PC 17593,79.2,B82 B84,"Cherbourg, France"
356,0,3,"Vanden Steen, Mr. Leo Peter",male,28,0,0,0,345783,9.5,NA,"Southampton, England"
755,1,2,"Herman, Mrs. Samuel (Jane Laver)",female,48,0,1,2,220845,65,NA,"Southampton, England"
187,1,3,"O'Brien, Mrs. Thomas (Johanna ""Hannah"" Godfrey)",female,36.8045977011494,0,1,0,370365,15.5,NA,"Queenstown, England"
367,1,1,"Warren, Mrs. Frank Manley (Anna Sophia Atkinson)",female,60,0,1,0,110813,75.25,D37,"Cherbourg, France"
361,0,3,"Skoog, Mr. Wilhelm",male,40,0,1,4,347088,27.9,NA,"Southampton, England"
234,1,3,"Asplund, Miss. Lillian Gertrud",female,5,1,4,2,347077,31.3875,NA,"Southampton, England"
861,0,3,"Hansen, Mr. Claus Peter",male,41,0,2,0,350026,14.1083,NA,"Southampton, England"
459,1,2,"Toomey, Miss. Ellen",female,50,0,0,0,F.C.C. 13531,10.5,NA,"Southampton, England"
97,0,1,"Goldschmidt, Mr. George B",male,71,0,0,0,PC 17754,34.6542,A5,"Cherbourg, France"
308,1,1,"Penasco y Castellana, Mrs. Victor de Satode (Maria Josefa Perez de Soto y Vallejo)",female,17,1,1,0,PC 17758,108.9,C65,"Cherbourg, France"
676,0,3,"Edvardsson, Mr. Gustaf Hjalmar",male,18,0,0,0,349912,7.775,NA,"Southampton, England"
338,1,1,"Burns, Miss. Elizabeth Margaret",female,41,0,0,0,16966,134.5,E40,"Cherbourg, France"
670,1,1,"Taylor, Mrs. Elmer Zebley (Juliet Cummins Wright)",female,36.8045977011494,0,1,0,19996,52,C126,"Southampton, England"
430,1,3,"Pickard, Mr. Berk (Berk Trembisky)",male,32,0,0,0,SOTON/O.Q. 392078,8.05,E10,"Southampton, England"
451,0,2,"West, Mr. Edwy Arthur",male,36,0,1,2,C.A. 34651,27.75,NA,"Southampton, England"
637,0,3,"Leinonen, Mr. Antti Gustaf",male,32,0,0,0,STON/O 2. 3101292,7.925,NA,"Southampton, England"
359,1,3,"McGovern, Miss. Mary",female,21.7742380952381,0,0,0,330931,7.8792,NA,"Queenstown, England"
756,1,2,"Hamalainen, Master. Viljo",male,0.67,1,1,1,250649,14.5,NA,"Southampton, England"
233,0,2,"Sjostedt, Mr. Ernst Adolf",male,59,0,0,0,237442,13.5,NA,"Southampton, England"
343,0,2,"Collander, Mr. Erik Gustaf",male,28,0,0,0,248740,13,NA,"Southampton, England"
254,0,3,"Lobb, Mr. William Arthur",male,30,0,1,0,A/5. 3336,16.1,NA,"Southampton, England"
444,1,2,"Reynaldo, Ms. Encarnacion",female,28,0,0,0,230434,13,NA,"Southampton, England"
534,1,3,"Peter, Mrs. Catherine (Catherine Rizk)",female,36.8045977011494,0,0,2,2668,22.3583,NA,"Cherbourg, France"
828,1,2,"Mallet, Master. Andre",male,1,1,0,2,S.C./PARIS 2079,37.0042,NA,"Cherbourg, France"
749,0,1,"Marvin, Mr. Daniel Warner",male,19,0,1,0,113773,53.1,D30,"Southampton, England"
404,0,3,"Hakkarainen, Mr. Pekka Pietari",male,28,0,1,0,STON/O2. 3101279,15.85,NA,"Southampton, England"
311,1,1,"Hays, Miss. Margaret Bechstein",female,24,0,0,0,11767,83.1583,C54,"Cherbourg, France"
164,0,3,"Calic, Mr. Jovo",male,17,1,0,0,315093,8.6625,NA,"Southampton, England"
61,0,3,"Sirayanian, Mr. Orsen",male,22,0,0,0,2669,7.2292,NA,"Cherbourg, France"
609,1,2,"Laroche, Mrs. Joseph (Juliette Marie Louise Lafargue)",female,22,0,1,2,SC/Paris 2123,41.5792,NA,"Cherbourg, France"
167,1,1,"Chibnall, Mrs. (Edith Martha Bowerman)",female,36.8045977011494,0,0,1,113505,55,E33,"Southampton, England"
704,0,3,"Gallagher, Mr. Martin",male,25,0,0,0,36864,7.7417,NA,"Queenstown, England"
418,1,2,"Silven, Miss. Lyyli Karoliina",female,18,0,0,2,250652,13,NA,"Southampton, England"
709,1,1,"Cleaver, Miss. Alice",female,22,0,0,0,113781,151.55,NA,"Southampton, England"
262,1,3,"Asplund, Master. Edvin Rojj Felix",male,3,1,4,2,347077,31.3875,NA,"Southampton, England"
383,0,3,"Tikkanen, Mr. Juho",male,32,0,0,0,STON/O 2. 3101293,7.925,NA,"Southampton, England"
298,0,1,"Allison, Miss. Helen Loraine",female,2,1,1,2,113781,151.55,C22 C26,"Southampton, England"
839,1,3,"Chip, Mr. Chang",male,32,0,0,0,1601,56.4958,NA,"Southampton, England"
300,1,1,"Baxter, Mrs. James (Helene DeLaudeniere Chaput)",female,50,0,0,1,PC 17558,247.5208,B58 B60,"Cherbourg, France"
158,0,3,"Corn, Mr. Harry",male,30,0,0,0,SOTON/OQ 392090,8.05,NA,"Southampton, England"
62,1,1,"Icard, Miss. Amelie",female,38,0,0,0,113572,80,B28,NA
438,1,2,"Richards, Mrs. Sidney (Emily Hocking)",female,24,0,2,3,29106,18.75,NA,"Southampton, England"
297,0,3,"Hanna, Mr. Mansour",male,23.5,0,0,0,2693,7.2292,NA,"Cherbourg, France"
53,1,1,"Harper, Mrs. Henry Sleeper (Myna Haxtun)",female,49,0,1,0,PC 17572,76.7292,D33,"Cherbourg, France"
752,1,3,"Moor, Master. Meier",male,6,1,0,1,392096,12.475,E121,"Southampton, England"
857,1,1,"Wick, Mrs. George Dennick (Mary Hitchcock)",female,45,0,1,1,36928,164.8667,NA,"Southampton, England"
522,0,3,"Vovk, Mr. Janko",male,22,0,0,0,349252,7.8958,NA,"Southampton, England"
705,0,3,"Hansen, Mr. Henrik Juul",male,26,0,1,0,350025,7.8542,NA,"Southampton, England"
485,1,1,"Bishop, Mr. Dickinson H",male,25,0,1,0,11967,91.0792,B49,"Cherbourg, France"
290,1,3,"Connolly, Miss. Kate",female,22,0,0,0,370373,7.75,NA,"Queenstown, England"
235,0,2,"Leyson, Mr. Robert William Norman",male,24,0,0,0,C.A. 29566,10.5,NA,"Southampton, England"
850,1,1,"Goldenberg, Mrs. Samuel L (Edwiga Grabowska)",female,36.8045977011494,0,1,0,17453,89.1042,C92,"Cherbourg, France"
287,1,3,"de Mulder, Mr. Theodore",male,30,0,0,0,345774,9.5,NA,"Southampton, England"
376,1,1,"Meyer, Mrs. Edgar Joseph (Leila Saks)",female,36.8045977011494,0,1,0,PC 17604,82.1708,NA,"Cherbourg, France"
82,1,3,"Sheerlinck, Mr. Jan Baptist",male,29,0,0,0,345779,9.5,NA,"Southampton, England"
207,0,3,"Backstrom, Mr. Karl Alfred",male,32,0,1,0,3101278,15.85,NA,"Southampton, England"
321,0,3,"Dennis, Mr. Samuel",male,22,0,0,0,A/5 21172,7.25,NA,"Southampton, England"
726,0,3,"Oreskovic, Mr. Luka",male,20,0,0,0,315094,8.6625,NA,"Southampton, England"
399,0,2,"Pain, Dr. Alfred",male,23,0,0,0,244278,10.5,NA,"Southampton, England"
54,1,2,"Faunthorpe, Mrs. Lizzie (Elizabeth Anne Wilkinson)",female,29,0,1,0,2926,26,NA,"Southampton, England"
653,0,3,"Kalvik, Mr. Johannes Halvorsen",male,21,0,0,0,8475,8.4333,NA,"Southampton, England"
15,0,3,"Vestrom, Miss. Hulda Amanda Adolfina",female,14,1,0,0,350406,7.8542,NA,"Southampton, England"
571,1,2,"Harris, Mr. George",male,62,0,0,0,S.W./PP 752,10.5,NA,"Southampton, England"
822,1,3,"Lulic, Mr. Nikola",male,27,0,0,0,315098,8.6625,NA,"Southampton, England"
208,1,3,"Albimona, Mr. Nassef Cassem",male,26,0,0,0,2699,18.7875,NA,"Cherbourg, France"
494,0,1,"Artagaveytia, Mr. Ramon",male,71,0,0,0,PC 17609,49.5042,NA,"Cherbourg, France"
420,0,3,"Van Impe, Miss. Catharina",female,10,1,0,2,345773,24.15,NA,"Southampton, England"
669,0,3,"Cook, Mr. Jacob",male,43,0,0,0,A/5 3536,8.05,NA,"Southampton, England"
89,1,1,"Fortune, Miss. Mabel Helen",female,23,0,3,2,19950,263,C23 C25 C27,"Southampton, England"
591,0,3,"Rintamaki, Mr. Matti",male,35,0,0,0,STON/O 2. 3101273,7.125,NA,"Southampton, England"
889,0,3,"Johnston, Miss. Catherine Helen ""Carrie""",female,21.7742380952381,0,1,2,W./C. 6607,23.45,NA,"Southampton, England"
546,0,1,"Nicholson, Mr. Arthur Ernest",male,64,0,0,0,693,26,NA,"Southampton, England"
554,1,3,"Leeni, Mr. Fahim (""Philip Zenni"")",male,22,0,0,0,2620,7.225,NA,"Cherbourg, France"
480,1,3,"Hirvonen, Miss. Hildur E",female,2,1,0,1,3101298,12.2875,NA,"Southampton, England"
656,0,2,"Hickman, Mr. Leonard Mark",male,24,0,2,0,S.O.C. 14879,73.5,NA,"Southampton, England"
413,1,1,"Minahan, Miss. Daisy E",female,33,0,1,0,19928,90,C78,"Queenstown, England"
775,1,2,"Hocking, Mrs. Elizabeth (Eliza Needs)",female,54,0,1,3,29105,23,NA,"Southampton, England"
342,1,1,"Fortune, Miss. Alice Elizabeth",female,24,0,3,2,19950,263,C23 C25 C27,"Southampton, England"
677,0,3,"Sawyer, Mr. Frederick Charles",male,24.5,0,0,0,342826,8.05,NA,"Southampton, England"
500,0,3,"Svensson, Mr. Olof",male,24,0,0,0,350035,7.7958,NA,"Southampton, England"
339,1,3,"Dahl, Mr. Karl Edwart",male,45,0,0,0,7598,8.05,NA,"Southampton, England"
473,1,2,"West, Mrs. Edwy Arthur (Ada Mary Worth)",female,33,0,1,2,C.A. 34651,27.75,NA,"Southampton, England"
200,0,2,"Yrois, Miss. Henriette (""Mrs Harbeck"")",female,24,0,0,0,248747,13,NA,"Southampton, England"
259,1,1,"Ward, Miss. Anna",female,35,0,0,0,PC 17755,512.3292,NA,"Cherbourg, France"
135,0,2,"Sobey, Mr. Samuel James Hayden",male,25,0,0,0,C.A. 29178,13,NA,"Southampton, England"
643,0,3,"Skoog, Miss. Margit Elizabeth",female,2,1,3,2,347088,27.9,NA,"Southampton, England"
360,1,3,"Mockler, Miss. Helen Mary ""Ellie""",female,21.7742380952381,0,0,0,330980,7.8792,NA,"Queenstown, England"
180,0,3,"Leonard, Mr. Lionel",male,36,0,0,0,LINE,0,NA,"Southampton, England"
768,0,3,"Mangan, Miss. Mary",female,30.5,0,0,0,364850,7.75,NA,"Queenstown, England"
484,1,3,"Turkula, Mrs. (Hedwig)",female,63,0,0,0,4134,9.5875,NA,"Southampton, England"
358,0,2,"Funk, Miss. Annie Clemmer",female,38,0,0,0,237671,13,NA,"Southampton, England"
600,1,1,"Duff Gordon, Sir. Cosmo Edmund (""Mr Morgan"")",male,49,0,1,0,PC 17485,56.9292,A20,"Cherbourg, France"
400,1,2,"Trout, Mrs. William H (Jessie L)",female,28,0,0,0,240929,12.65,NA,"Southampton, England"
440,0,2,"Kvillner, Mr. Johan Henrik Johannesson",male,31,0,0,0,C.A. 18723,10.5,NA,"Southampton, England"
303,0,3,"Johnson, Mr. William Cahoone Jr",male,19,0,0,0,LINE,0,NA,"Southampton, England"
542,0,3,"Andersson, Miss. Ingeborg Constanzia",female,9,1,4,2,347082,31.275,NA,"Southampton, England"
265,0,3,"Henry, Miss. Delia",female,21.7742380952381,0,0,0,382649,7.75,NA,"Queenstown, England"
19,0,3,"Vander Planke, Mrs. Julius (Emelia Maria Vandemoortele)",female,31,0,1,0,345763,18,NA,"Southampton, England"
727,1,2,"Renouf, Mrs. Peter Henry (Lillian Jefferys)",female,30,0,3,0,31027,21,NA,"Southampton, England"
211,0,3,"Ali, Mr. Ahmed",male,24,0,0,0,SOTON/O.Q. 3101311,7.05,NA,"Southampton, England"
86,1,3,"Backstrom, Mrs. Karl Alfred (Maria Mathilda Gustafsson)",female,33,0,3,0,3101278,15.85,NA,"Southampton, England"
717,1,1,"Endres, Miss. Caroline Louise",female,38,0,0,0,PC 17757,227.525,C45,"Cherbourg, France"
501,0,3,"Calic, Mr. Petar",male,17,1,0,0,315086,8.6625,NA,"Southampton, England"
636,1,2,"Davis, Miss. Mary",female,28,0,0,0,237668,13,NA,"Southampton, England"
315,0,2,"Hart, Mr. Benjamin",male,43,0,1,1,F.C.C. 13529,26.25,NA,"Southampton, England"
306,1,1,"Allison, Master. Hudson Trevor",male,0.92,1,1,2,113781,151.55,C22 C26,"Southampton, England"
493,0,1,"Molson, Mr. Harry Markland",male,55,0,0,0,113787,30.5,C30,"Southampton, England"
347,1,2,"Smith, Miss. Marion Elsie",female,40,0,0,0,31418,13,NA,"Southampton, England"
69,1,3,"Andersson, Miss. Erna Alexandra",female,17,1,4,2,3101281,7.925,NA,"Southampton, England"
499,0,1,"Allison, Mrs. Hudson J C (Bessie Waldo Daniels)",female,25,0,1,2,113781,151.55,C22 C26,"Southampton, England"
345,0,2,"Fox, Mr. Stanley Hubert",male,36,0,0,0,229236,13,NA,"Southampton, England"
134,1,2,"Weisz, Mrs. Leopold (Mathilde Francoise Pede)",female,29,0,1,0,228414,26,NA,"Southampton, England"
454,1,1,"Goldenberg, Mr. Samuel L",male,49,0,1,0,17453,89.1042,C92,"Cherbourg, France"
189,0,3,"Bourke, Mr. John",male,40,0,1,1,364849,15.5,NA,"Queenstown, England"
700,0,3,"Humblen, Mr. Adolf Mathias Nicolai Olsen",male,42,0,0,0,348121,7.65,F G63,"Southampton, England"
611,0,3,"Andersson, Mrs. Anders Johan (Alfrida Konstantia Brogren)",female,39,0,1,5,347082,31.275,NA,"Southampton, England"
256,1,3,"Touma, Mrs. Darwis (Hanne Youssef Razi)",female,29,0,0,2,2650,15.2458,NA,"Cherbourg, France"
150,0,2,"Byles, Rev. Thomas Roussel Davids",male,42,0,0,0,244310,13,NA,"Southampton, England"
655,0,3,"Hegarty, Miss. Hanora ""Nora""",female,18,0,0,0,365226,6.75,NA,"Queenstown, England"
842,0,2,"Mudd, Mr. Thomas Charles",male,16,1,0,0,S.O./P.P. 3,10.5,NA,"Southampton, England"
598,0,3,"Johnson, Mr. Alfred",male,49,0,0,0,LINE,0,NA,"Southampton, England"
286,0,3,"Stankovic, Mr. Ivan",male,33,0,0,0,349239,8.6625,NA,"Cherbourg, France"
461,1,1,"Anderson, Mr. Harry",male,48,0,0,0,19952,26.55,E12,"Southampton, England"
663,0,1,"Colley, Mr. Edward Pomeroy",male,47,0,0,0,5727,25.5875,E58,"Southampton, England"
584,0,1,"Ross, Mr. John Hugo",male,36,0,0,0,13049,40.125,A10,"Cherbourg, France"
475,0,3,"Strandberg, Miss. Ida Sofia",female,22,0,0,0,7553,9.8375,NA,"Southampton, England"
