{
  "site": { "title": "Chan Tai Man" },
  "contactFromEmail": {
    "from": "\"Chan Tai Man ✉️\" <do-not-reply@chantaiman.com>",
    "bcc": "findme@chantaiman.com",
    "replyTo": "findme@chantaiman.com",
    "subject": "Thank you for getting in touch with me!"
  }
}
