{
 "cells": [
  {
   "cell_type": "markdown",
   "metadata": {},
   "source": [
    "# Numpy - ćwiczenia\n",
    "## Tworzenie obiektów.\n",
    "Stwórz następujące obiekty:\n",
    "* zerowymiarową macierz złożoną z liczby 0\n",
    "* 8-elementowy, jednowymiarowy wektor jedynek\n",
    "* 12-elementową macierz 3x4 wypełnioną liczbami od 2, do 13.\n",
    "* j.w., ale upewnij się, że liczby w macierzy będą intami."
   ]
  },
  {
   "cell_type": "code",
   "execution_count": 13,
   "metadata": {},
   "outputs": [
    {
     "name": "stdout",
     "output_type": "stream",
     "text": [
      "0\n",
      "[1. 1. 1. 1. 1. 1. 1. 1.]\n",
      "[[ 2  3  4  5]\n",
      " [ 6  7  8  9]\n",
      " [10 11 12 13]]\n",
      "0\n",
      "[1 1 1 1 1 1 1 1]\n",
      "[[ 2  3  4  5]\n",
      " [ 6  7  8  9]\n",
      " [10 11 12 13]]\n"
     ]
    }
   ],
   "source": [
    "import numpy as np\n",
    "zeros = np.array(0)\n",
    "ones = np.ones(8)\n",
    "matrix = np.arange(2, 14).reshape(3, 4)\n",
    "\n",
    "print(zeros)\n",
    "print(ones)\n",
    "print(matrix)\n",
    "\n",
    "zeros = np.array(0, dtype = int)\n",
    "ones = np.ones(8, dtype = int)\n",
    "matrix = np.arange(2, 14, dtype = int).reshape(3, 4)\n",
    "\n",
    "print(zeros)\n",
    "print(ones)\n",
    "print(matrix)"
   ]
  },
  {
   "cell_type": "code",
   "execution_count": 14,
   "metadata": {},
   "outputs": [
    {
     "data": {
      "text/plain": [
       "2"
      ]
     },
     "execution_count": 14,
     "metadata": {},
     "output_type": "execute_result"
    }
   ],
   "source": [
    "np.ones((1,8)).ndim"
   ]
  },
  {
   "cell_type": "markdown",
   "metadata": {},
   "source": [
    "Stwórz następujące obiekty:\n",
    "* Macierz o wymiarach 4,5 wypełnioną liczbami losowymi z U~[0,1)\n",
    "* Macierz o wymiarach 3,6 wypełnioną liczbami losowymi z N~(0,1)\n",
    "* Macierz o wymiarach 100, 50 wypełnioną liczbami losowymi z rozkładu lognormalnego i na jego podstawie stwórz histogram o liczbie binów równej 20.\n",
    "* Macierz o wymiarach 4,5,6 wypełnioną liczbami losowymi z rozkładu beta (0.5, 0.5)"
   ]
  },
  {
   "cell_type": "code",
   "execution_count": 21,
   "metadata": {},
   "outputs": [
    {
     "name": "stdout",
     "output_type": "stream",
     "text": [
      "[[0.13428587 0.65729197 0.48123923 0.99679666 0.42529586]\n",
      " [0.32336985 0.37200248 0.84498473 0.45416752 0.98582977]\n",
      " [0.95526579 0.09117239 0.41001352 0.83421674 0.68405697]\n",
      " [0.31414917 0.48183797 0.32504046 0.63334907 0.96510558]]\n",
      "[[ 0.10133034  1.35253086  1.6205248  -1.21940311 -1.04396294  1.70633527]\n",
      " [ 0.29436634  0.36175339 -0.43071669  1.21276949  0.71728163 -1.00501934]\n",
      " [ 0.14149813 -2.17361654 -0.18712104 -1.20706753  1.44894242 -0.8167304 ]]\n",
      "[[[9.30164480e-01 7.58844633e-01 8.91390188e-03 9.97343050e-01\n",
      "   6.74476068e-01 6.45194187e-01]\n",
      "  [9.48527673e-01 9.67426760e-02 9.80492896e-01 9.54890675e-01\n",
      "   6.08281787e-02 9.40136843e-03]\n",
      "  [1.23833312e-01 5.40660178e-01 5.20416117e-02 9.60533236e-01\n",
      "   7.12926601e-03 9.99999974e-01]\n",
      "  [9.61423479e-01 1.17959495e-01 9.54852566e-01 2.10351109e-01\n",
      "   3.28238569e-01 2.05705744e-01]\n",
      "  [5.11505254e-02 7.23278525e-01 3.80889724e-02 9.67628526e-01\n",
      "   7.13567518e-01 7.20274305e-01]]\n",
      "\n",
      " [[6.96570318e-01 6.87379080e-01 6.99156597e-01 3.12231544e-01\n",
      "   4.31336364e-01 4.52731807e-02]\n",
      "  [5.14877704e-01 5.24886664e-01 5.82556378e-01 9.41390225e-01\n",
      "   7.13799297e-01 6.80523771e-01]\n",
      "  [9.26225864e-01 9.26152138e-01 6.68864859e-01 1.38500085e-03\n",
      "   9.35472078e-01 2.11560423e-02]\n",
      "  [4.35044172e-01 1.05725131e-01 4.04337221e-03 1.55125451e-01\n",
      "   2.25595700e-01 1.56020169e-01]\n",
      "  [9.92876322e-01 5.94849855e-01 5.43400689e-03 1.22599307e-01\n",
      "   7.84792803e-01 9.48147537e-01]]\n",
      "\n",
      " [[6.66026240e-05 9.19718178e-01 9.88462274e-01 3.87468141e-01\n",
      "   6.55717348e-02 9.87079136e-01]\n",
      "  [1.53855426e-01 7.40705369e-01 3.74060264e-01 8.67884113e-01\n",
      "   5.92755644e-02 1.28438293e-01]\n",
      "  [1.48640915e-02 7.23162487e-04 8.40955782e-01 7.72728124e-01\n",
      "   8.75743583e-01 9.73195696e-01]\n",
      "  [1.40289924e-01 8.45398175e-01 9.45955835e-02 9.59039966e-01\n",
      "   1.01125488e-01 4.94618249e-01]\n",
      "  [9.87006896e-01 9.36785668e-01 6.42255896e-02 1.45843619e-03\n",
      "   1.39541955e-02 4.90338277e-01]]\n",
      "\n",
      " [[2.52289071e-01 7.20038919e-01 5.95293275e-01 6.81199986e-01\n",
      "   3.26299838e-01 5.73082145e-01]\n",
      "  [5.59836115e-01 2.17729651e-01 9.47231457e-01 4.92488591e-01\n",
      "   9.87015659e-01 7.09013586e-01]\n",
      "  [2.00150931e-01 2.70598447e-02 9.58878122e-01 9.39501001e-01\n",
      "   2.76958791e-04 1.36033640e-02]\n",
      "  [4.08612468e-01 8.39005353e-01 8.58756121e-02 2.03536821e-01\n",
      "   7.73280903e-01 3.99954056e-01]\n",
      "  [2.01366585e-01 2.22225570e-01 4.20332050e-02 6.45996932e-01\n",
      "   9.93456755e-01 2.89997828e-01]]]\n",
      "\n",
      "Histogram\n",
      "[3261  985  375  166   96   33   28   22    5   12    7    3    0    2\n",
      "    1    1    1    0    1    1]\n",
      "[ 0.03314458  1.43515647  2.83716836  4.23918025  5.64119214  7.04320403\n",
      "  8.44521592  9.84722781 11.2492397  12.65125159 14.05326348 15.45527537\n",
      " 16.85728726 18.25929915 19.66131104 21.06332294 22.46533483 23.86734672\n",
      " 25.26935861 26.6713705  28.07338239]\n"
     ]
    }
   ],
   "source": [
    "u = np.random.random((4, 5))\n",
    "n = np.random.normal(size = (3, 6))\n",
    "beta = np.random.beta(0.5, 0.5, (4,5,6))\n",
    "lognormal = np.random.lognormal(size = (100, 50))\n",
    "hist = np.histogram(lognormal, 20)\n",
    "print(u)\n",
    "print(n)\n",
    "print(beta)\n",
    "print(\"\\nHistogram\")\n",
    "print(hist[0])\n",
    "print(hist[1])"
   ]
  },
  {
   "cell_type": "markdown",
   "metadata": {},
   "source": [
    "Ostatnią z macierzy z poprzedniego podpunktu (beta):\n",
    "* Zamień na macierz o wymiarach (x, 6), tak aby numpy sam uzupełnił x, a następnie podaj x.\n",
    "* Następnie uzyskaną macierz podziel na pół w pionie.\n",
    "* Następnie, uzyskaną połówkę podziel na pół w poziomie, dzieląc na dwie ćwiartki (A i B)\n",
    "* Ćwiartkę A zamień na wektor jedno i dwuwymiarowy. W każdym przypadku przekształć obiekt bez jego kopiowania oraz z uzyskaniem kopii obiektu.\n",
    "* Następnie przekształć ćwiartki A i B tak aby miały kształt (x,2), a następnie połącz je ze sobą w pionie (C) i w poziomie (D).\n",
    "* Dodaj 1 do każdego elementu C"
   ]
  },
  {
   "cell_type": "code",
   "execution_count": 22,
   "metadata": {},
   "outputs": [
    {
     "name": "stdout",
     "output_type": "stream",
     "text": [
      "20\n",
      "(10, 3) (10, 3)\n",
      "1 2\n",
      "1 2\n",
      "\n",
      "Połączone w pionie:\n",
      "\n",
      "[[9.30164480e-01 7.58844633e-01]\n",
      " [8.91390188e-03 9.48527673e-01]\n",
      " [9.67426760e-02 9.80492896e-01]\n",
      " [1.23833312e-01 5.40660178e-01]\n",
      " [5.20416117e-02 9.61423479e-01]\n",
      " [1.17959495e-01 9.54852566e-01]\n",
      " [5.11505254e-02 7.23278525e-01]\n",
      " [3.80889724e-02 6.96570318e-01]\n",
      " [6.87379080e-01 6.99156597e-01]\n",
      " [5.14877704e-01 5.24886664e-01]\n",
      " [5.82556378e-01 9.26225864e-01]\n",
      " [9.26152138e-01 6.68864859e-01]\n",
      " [4.35044172e-01 1.05725131e-01]\n",
      " [4.04337221e-03 9.92876322e-01]\n",
      " [5.94849855e-01 5.43400689e-03]\n",
      " [6.66026240e-05 9.19718178e-01]\n",
      " [9.88462274e-01 1.53855426e-01]\n",
      " [7.40705369e-01 3.74060264e-01]\n",
      " [1.48640915e-02 7.23162487e-04]\n",
      " [8.40955782e-01 1.40289924e-01]\n",
      " [8.45398175e-01 9.45955835e-02]\n",
      " [9.87006896e-01 9.36785668e-01]\n",
      " [6.42255896e-02 2.52289071e-01]\n",
      " [7.20038919e-01 5.95293275e-01]\n",
      " [5.59836115e-01 2.17729651e-01]\n",
      " [9.47231457e-01 2.00150931e-01]\n",
      " [2.70598447e-02 9.58878122e-01]\n",
      " [4.08612468e-01 8.39005353e-01]\n",
      " [8.58756121e-02 2.01366585e-01]\n",
      " [2.22225570e-01 4.20332050e-02]]\n",
      "\n",
      "Połączone w poziomie:\n",
      "\n",
      "[[9.30164480e-01 7.58844633e-01 6.66026240e-05 9.19718178e-01]\n",
      " [8.91390188e-03 9.48527673e-01 9.88462274e-01 1.53855426e-01]\n",
      " [9.67426760e-02 9.80492896e-01 7.40705369e-01 3.74060264e-01]\n",
      " [1.23833312e-01 5.40660178e-01 1.48640915e-02 7.23162487e-04]\n",
      " [5.20416117e-02 9.61423479e-01 8.40955782e-01 1.40289924e-01]\n",
      " [1.17959495e-01 9.54852566e-01 8.45398175e-01 9.45955835e-02]\n",
      " [5.11505254e-02 7.23278525e-01 9.87006896e-01 9.36785668e-01]\n",
      " [3.80889724e-02 6.96570318e-01 6.42255896e-02 2.52289071e-01]\n",
      " [6.87379080e-01 6.99156597e-01 7.20038919e-01 5.95293275e-01]\n",
      " [5.14877704e-01 5.24886664e-01 5.59836115e-01 2.17729651e-01]\n",
      " [5.82556378e-01 9.26225864e-01 9.47231457e-01 2.00150931e-01]\n",
      " [9.26152138e-01 6.68864859e-01 2.70598447e-02 9.58878122e-01]\n",
      " [4.35044172e-01 1.05725131e-01 4.08612468e-01 8.39005353e-01]\n",
      " [4.04337221e-03 9.92876322e-01 8.58756121e-02 2.01366585e-01]\n",
      " [5.94849855e-01 5.43400689e-03 2.22225570e-01 4.20332050e-02]]\n",
      "\n",
      "c po dodaniu 1:\n",
      "\n",
      "[[1.93016448 1.75884463]\n",
      " [1.0089139  1.94852767]\n",
      " [1.09674268 1.9804929 ]\n",
      " [1.12383331 1.54066018]\n",
      " [1.05204161 1.96142348]\n",
      " [1.1179595  1.95485257]\n",
      " [1.05115053 1.72327853]\n",
      " [1.03808897 1.69657032]\n",
      " [1.68737908 1.6991566 ]\n",
      " [1.5148777  1.52488666]\n",
      " [1.58255638 1.92622586]\n",
      " [1.92615214 1.66886486]\n",
      " [1.43504417 1.10572513]\n",
      " [1.00404337 1.99287632]\n",
      " [1.59484985 1.00543401]\n",
      " [1.0000666  1.91971818]\n",
      " [1.98846227 1.15385543]\n",
      " [1.74070537 1.37406026]\n",
      " [1.01486409 1.00072316]\n",
      " [1.84095578 1.14028992]\n",
      " [1.84539818 1.09459558]\n",
      " [1.9870069  1.93678567]\n",
      " [1.06422559 1.25228907]\n",
      " [1.72003892 1.59529327]\n",
      " [1.55983611 1.21772965]\n",
      " [1.94723146 1.20015093]\n",
      " [1.02705984 1.95887812]\n",
      " [1.40861247 1.83900535]\n",
      " [1.08587561 1.20136658]\n",
      " [1.22222557 1.0420332 ]]\n"
     ]
    }
   ],
   "source": [
    "beta = beta.reshape(-1, 6)\n",
    "print(beta.shape[0])\n",
    "splitted = np.split(beta, 2, 1)\n",
    "splitted = np.split(splitted[0], 2, 0)\n",
    "a = splitted[0]\n",
    "b = splitted[1]\n",
    "print(a.shape, b.shape)\n",
    "# Bez kopii\n",
    "one_dimensional_a = a.ravel()\n",
    "two_dimensional_a = a.reshape((1, -1))\n",
    "print(one_dimensional_a.ndim, two_dimensional_a.ndim)\n",
    "# Z kopią\n",
    "one_dimensional_a = a.flatten()\n",
    "two_dimensional_a = np.array(a.reshape((1, -1)))\n",
    "print(one_dimensional_a.ndim, two_dimensional_a.ndim)\n",
    "a = a.reshape(-1, 2)\n",
    "b = b.reshape(-1, 2)\n",
    "c = np.vstack((a, b))\n",
    "d = np.hstack((a, b))\n",
    "print(\"\\nPołączone w pionie:\\n\")\n",
    "print(c)\n",
    "print(\"\\nPołączone w poziomie:\\n\")\n",
    "print(d)\n",
    "c+=np.ones(c.shape)\n",
    "print(\"\\nc po dodaniu 1:\\n\")\n",
    "print(c)\n",
    "# Wersja z concatenate:\n",
    "# c = np.concatenate((a, b), axis = 0)\n",
    "# d = np.concatenate((a, b), axis = 1)"
   ]
  },
  {
   "cell_type": "markdown",
   "metadata": {},
   "source": [
    "Uzyskaną w poprzednim podpunkcie macierz D posortuj na cztery możliwe sposoby (wiersze/kolumny, rosnąco/malejąco)."
   ]
  },
  {
   "cell_type": "code",
   "execution_count": 23,
   "metadata": {},
   "outputs": [
    {
     "name": "stdout",
     "output_type": "stream",
     "text": [
      "Sortowanie w ramach kolumn rosnąco\n",
      "\n",
      " [[4.04337221e-03 5.43400689e-03 6.66026240e-05 7.23162487e-04]\n",
      " [8.91390188e-03 1.05725131e-01 1.48640915e-02 4.20332050e-02]\n",
      " [3.80889724e-02 5.24886664e-01 2.70598447e-02 9.45955835e-02]\n",
      " [5.11505254e-02 5.40660178e-01 6.42255896e-02 1.40289924e-01]\n",
      " [5.20416117e-02 6.68864859e-01 8.58756121e-02 1.53855426e-01]\n",
      " [9.67426760e-02 6.96570318e-01 2.22225570e-01 2.00150931e-01]\n",
      " [1.17959495e-01 6.99156597e-01 4.08612468e-01 2.01366585e-01]\n",
      " [1.23833312e-01 7.23278525e-01 5.59836115e-01 2.17729651e-01]\n",
      " [4.35044172e-01 7.58844633e-01 7.20038919e-01 2.52289071e-01]\n",
      " [5.14877704e-01 9.26225864e-01 7.40705369e-01 3.74060264e-01]\n",
      " [5.82556378e-01 9.48527673e-01 8.40955782e-01 5.95293275e-01]\n",
      " [5.94849855e-01 9.54852566e-01 8.45398175e-01 8.39005353e-01]\n",
      " [6.87379080e-01 9.61423479e-01 9.47231457e-01 9.19718178e-01]\n",
      " [9.26152138e-01 9.80492896e-01 9.87006896e-01 9.36785668e-01]\n",
      " [9.30164480e-01 9.92876322e-01 9.88462274e-01 9.58878122e-01]]\n",
      "Sortowanie w ramach kolumn malejąco\n",
      "\n",
      " [[9.30164480e-01 9.92876322e-01 9.88462274e-01 9.58878122e-01]\n",
      " [9.26152138e-01 9.80492896e-01 9.87006896e-01 9.36785668e-01]\n",
      " [6.87379080e-01 9.61423479e-01 9.47231457e-01 9.19718178e-01]\n",
      " [5.94849855e-01 9.54852566e-01 8.45398175e-01 8.39005353e-01]\n",
      " [5.82556378e-01 9.48527673e-01 8.40955782e-01 5.95293275e-01]\n",
      " [5.14877704e-01 9.26225864e-01 7.40705369e-01 3.74060264e-01]\n",
      " [4.35044172e-01 7.58844633e-01 7.20038919e-01 2.52289071e-01]\n",
      " [1.23833312e-01 7.23278525e-01 5.59836115e-01 2.17729651e-01]\n",
      " [1.17959495e-01 6.99156597e-01 4.08612468e-01 2.01366585e-01]\n",
      " [9.67426760e-02 6.96570318e-01 2.22225570e-01 2.00150931e-01]\n",
      " [5.20416117e-02 6.68864859e-01 8.58756121e-02 1.53855426e-01]\n",
      " [5.11505254e-02 5.40660178e-01 6.42255896e-02 1.40289924e-01]\n",
      " [3.80889724e-02 5.24886664e-01 2.70598447e-02 9.45955835e-02]\n",
      " [8.91390188e-03 1.05725131e-01 1.48640915e-02 4.20332050e-02]\n",
      " [4.04337221e-03 5.43400689e-03 6.66026240e-05 7.23162487e-04]]\n",
      "Sortowanie w ramach wierszy rosnąco\n",
      "\n",
      " [[6.66026240e-05 7.58844633e-01 9.19718178e-01 9.30164480e-01]\n",
      " [8.91390188e-03 1.53855426e-01 9.48527673e-01 9.88462274e-01]\n",
      " [9.67426760e-02 3.74060264e-01 7.40705369e-01 9.80492896e-01]\n",
      " [7.23162487e-04 1.48640915e-02 1.23833312e-01 5.40660178e-01]\n",
      " [5.20416117e-02 1.40289924e-01 8.40955782e-01 9.61423479e-01]\n",
      " [9.45955835e-02 1.17959495e-01 8.45398175e-01 9.54852566e-01]\n",
      " [5.11505254e-02 7.23278525e-01 9.36785668e-01 9.87006896e-01]\n",
      " [3.80889724e-02 6.42255896e-02 2.52289071e-01 6.96570318e-01]\n",
      " [5.95293275e-01 6.87379080e-01 6.99156597e-01 7.20038919e-01]\n",
      " [2.17729651e-01 5.14877704e-01 5.24886664e-01 5.59836115e-01]\n",
      " [2.00150931e-01 5.82556378e-01 9.26225864e-01 9.47231457e-01]\n",
      " [2.70598447e-02 6.68864859e-01 9.26152138e-01 9.58878122e-01]\n",
      " [1.05725131e-01 4.08612468e-01 4.35044172e-01 8.39005353e-01]\n",
      " [4.04337221e-03 8.58756121e-02 2.01366585e-01 9.92876322e-01]\n",
      " [5.43400689e-03 4.20332050e-02 2.22225570e-01 5.94849855e-01]]\n",
      "Sortowanie w ramach wierszy malejąco\n",
      "\n",
      " [[9.30164480e-01 9.19718178e-01 7.58844633e-01 6.66026240e-05]\n",
      " [9.88462274e-01 9.48527673e-01 1.53855426e-01 8.91390188e-03]\n",
      " [9.80492896e-01 7.40705369e-01 3.74060264e-01 9.67426760e-02]\n",
      " [5.40660178e-01 1.23833312e-01 1.48640915e-02 7.23162487e-04]\n",
      " [9.61423479e-01 8.40955782e-01 1.40289924e-01 5.20416117e-02]\n",
      " [9.54852566e-01 8.45398175e-01 1.17959495e-01 9.45955835e-02]\n",
      " [9.87006896e-01 9.36785668e-01 7.23278525e-01 5.11505254e-02]\n",
      " [6.96570318e-01 2.52289071e-01 6.42255896e-02 3.80889724e-02]\n",
      " [7.20038919e-01 6.99156597e-01 6.87379080e-01 5.95293275e-01]\n",
      " [5.59836115e-01 5.24886664e-01 5.14877704e-01 2.17729651e-01]\n",
      " [9.47231457e-01 9.26225864e-01 5.82556378e-01 2.00150931e-01]\n",
      " [9.58878122e-01 9.26152138e-01 6.68864859e-01 2.70598447e-02]\n",
      " [8.39005353e-01 4.35044172e-01 4.08612468e-01 1.05725131e-01]\n",
      " [9.92876322e-01 2.01366585e-01 8.58756121e-02 4.04337221e-03]\n",
      " [5.94849855e-01 2.22225570e-01 4.20332050e-02 5.43400689e-03]]\n"
     ]
    }
   ],
   "source": [
    "print(\"Sortowanie w ramach kolumn rosnąco\")\n",
    "row_asc = np.sort(d, axis = 0)\n",
    "print(\"\\n\", row_asc)\n",
    "print(\"Sortowanie w ramach kolumn malejąco\")\n",
    "row_desc = np.flipud(np.sort(d, axis = 0))\n",
    "print(\"\\n\", row_desc)\n",
    "print(\"Sortowanie w ramach wierszy rosnąco\")\n",
    "col_asc = np.sort(d, axis = 1)\n",
    "print(\"\\n\", col_asc)\n",
    "print(\"Sortowanie w ramach wierszy malejąco\")\n",
    "col_desc = np.fliplr(np.sort(d, axis = 1))\n",
    "print(\"\\n\", col_desc)"
   ]
  },
  {
   "cell_type": "markdown",
   "metadata": {},
   "source": [
    "* Podaj ile elementów ma macierz C.\n",
    "* Oblicz maximum w drugiej kolumnie tej macierzy, a następnie podaj, który to element z kolei."
   ]
  },
  {
   "cell_type": "code",
   "execution_count": 24,
   "metadata": {},
   "outputs": [
    {
     "name": "stdout",
     "output_type": "stream",
     "text": [
      "60 60\n",
      "1.99287632169607 1.99287632169607\n",
      "13 13\n"
     ]
    }
   ],
   "source": [
    "print(c.size, c.shape[0]*c.shape[1])\n",
    "print(np.amax(c, axis = 0)[1], np.max(c[:,1]))\n",
    "print(np.argsort(c, axis = 0)[-1][1], np.argsort(c[:, 1], axis = 0)[-1])"
   ]
  },
  {
   "cell_type": "markdown",
   "metadata": {},
   "source": [
    "Stwórz dwie macierze o wymiarach (6,4) oraz (4, 4) złożone z liczb całkowitych z przedziału [0, 10) a następnie stwórz:\n",
    "* obiekt, który będzie przechowywał iloczyn tych macierzy,\n",
    "* obiekt, który będzie odwrotnością drugiej macierzy."
   ]
  },
  {
   "cell_type": "code",
   "execution_count": 25,
   "metadata": {},
   "outputs": [
    {
     "name": "stdout",
     "output_type": "stream",
     "text": [
      "[[5 5 6 2]\n",
      " [9 5 6 8]\n",
      " [1 0 8 5]\n",
      " [3 6 9 2]\n",
      " [4 7 3 0]\n",
      " [3 7 0 1]]\n",
      "[[0 3 7 6]\n",
      " [0 8 2 1]\n",
      " [2 0 2 8]\n",
      " [9 6 5 9]]\n",
      "Iloczyn:\n",
      "[[ 30  67  67 101]\n",
      " [ 84 115 125 179]\n",
      " [ 61  33  48 115]\n",
      " [ 36  69  61 114]\n",
      " [  6  68  48  55]\n",
      " [  9  71  40  34]]\n",
      "Odwrotność:\n",
      "[[-0.04035088 -0.08684211 -0.11184211  0.13596491]\n",
      " [-0.04385965  0.14473684  0.01973684 -0.00438596]\n",
      " [ 0.19473684 -0.10263158 -0.17763158  0.03947368]\n",
      " [-0.03859649  0.04736842  0.19736842 -0.04385965]]\n"
     ]
    }
   ],
   "source": [
    "first = np.random.choice(10, size = (6, 4))\n",
    "second = np.random.choice(10, size = (4, 4))\n",
    "print(first)\n",
    "print(second)\n",
    "product = np.dot(first, second)\n",
    "print(\"Iloczyn:\")\n",
    "print(product)\n",
    "second_inv = np.linalg.inv(second)\n",
    "print(\"Odwrotność:\")\n",
    "print(second_inv)"
   ]
  },
  {
   "cell_type": "markdown",
   "metadata": {},
   "source": [
    "Przygotuj implementację dwuwymiarowej funkcji rosenbrocka (https://en.wikipedia.org/wiki/Rosenbrock_function) na dwa sposoby: z wykorzystaniem np.apply_along_axis jak i pętli for. \n",
    "Porównaj szybkość implementacji."
   ]
  },
  {
   "cell_type": "code",
   "execution_count": 26,
   "metadata": {},
   "outputs": [
    {
     "name": "stdout",
     "output_type": "stream",
     "text": [
      "247 ms ± 44.2 ms per loop (mean ± std. dev. of 7 runs, 1 loop each)\n",
      "103 ms ± 15.3 ms per loop (mean ± std. dev. of 7 runs, 10 loops each)\n"
     ]
    }
   ],
   "source": [
    "x = np.random.normal(size=(10000, 2))\n",
    "\n",
    "def rosenbrock(vec, a = 1, b = 100):\n",
    "    return np.apply_along_axis(lambda x: (a-x[0])**2+b*(x[1]-x[0]**2)**2, 1, vec)\n",
    "    \n",
    "def rosenbrock2(vec, a = 1, b = 100):\n",
    "    ret = np.empty(vec.shape[0])\n",
    "    for i in range(vec.shape[0]):\n",
    "        x = vec[i][0]\n",
    "        y = vec[i][1]\n",
    "        ret[i] = (a-x)**2+b*(y-x**2)**2\n",
    "    return ret\n",
    "\n",
    "%timeit rosenbrock(x)\n",
    "%timeit rosenbrock2(x)"
   ]
  },
  {
   "cell_type": "markdown",
   "metadata": {},
   "source": [
    "Wygeneruj wektor 1000 liczb losowych całkowitych z przedziału [0, 100], a następnie stwórz funkcję za pomocą vectorize podnieś każdą liczbę do kwadratu. Porównaj szybkość tego rozwiązania z pętlą for."
   ]
  },
  {
   "cell_type": "code",
   "execution_count": 27,
   "metadata": {},
   "outputs": [
    {
     "name": "stdout",
     "output_type": "stream",
     "text": [
      "8.94 µs ± 1.11 µs per loop (mean ± std. dev. of 7 runs, 100000 loops each)\n"
     ]
    }
   ],
   "source": [
    "x = np.random.randint(0, 100, size = (1000, 1))\n",
    "\n",
    "def square(x):\n",
    "    return x**2\n",
    "\n",
    "squareV = np.vectorize(square)\n",
    "%timeit y = square(x)"
   ]
  },
  {
   "cell_type": "code",
   "execution_count": 28,
   "metadata": {},
   "outputs": [
    {
     "name": "stdout",
     "output_type": "stream",
     "text": [
      "4.04 ms ± 509 µs per loop (mean ± std. dev. of 7 runs, 100 loops each)\n"
     ]
    }
   ],
   "source": [
    "%%timeit\n",
    "for i in range(x.shape[0]):\n",
    "    x[i]**2"
   ]
  }
 ],
 "metadata": {
  "kernelspec": {
   "display_name": "Python 3",
   "language": "python",
   "name": "python3"
  },
  "language_info": {
   "codemirror_mode": {
    "name": "ipython",
    "version": 3
   },
   "file_extension": ".py",
   "mimetype": "text/x-python",
   "name": "python",
   "nbconvert_exporter": "python",
   "pygments_lexer": "ipython3",
   "version": "3.6.2"
  }
 },
 "nbformat": 4,
 "nbformat_minor": 2
}
