%!PS-Adobe-3.0 EPSF-3.0
%%Title: imgNets/dropRate.eps
%%Creator: matplotlib version 2.0.2, http://matplotlib.org/
%%CreationDate: Fri Apr 20 15:05:46 2018
%%Orientation: portrait
%%BoundingBox: -270 108 882 684
%%EndComments
%%BeginProlog
/mpldict 8 dict def
mpldict begin
/m { moveto } bind def
/l { lineto } bind def
/r { rlineto } bind def
/c { curveto } bind def
/cl { closepath } bind def
/box {
m
1 index 0 r
0 exch r
neg 0 r
cl
} bind def
/clipbox {
box
clip
newpath
} bind def
%!PS-Adobe-3.0 Resource-Font
%%Title: DejaVu Sans
%%Copyright: Copyright (c) 2003 by Bitstream, Inc. All Rights Reserved. Copyright (c) 2006 by Tavmjong Bah. All Rights Reserved. DejaVu changes are in public domain 
%%Creator: Converted from TrueType to type 3 by PPR
25 dict begin
/_d{bind def}bind def
/_m{moveto}_d
/_l{lineto}_d
/_cl{closepath eofill}_d
/_c{curveto}_d
/_sc{7 -1 roll{setcachedevice}{pop pop pop pop pop pop}ifelse}_d
/_e{exec}_d
/FontName /DejaVuSans def
/PaintType 0 def
/FontMatrix[.001 0 0 .001 0 0]def
/FontBBox[-1021 -463 1793 1232]def
/FontType 3 def
/Encoding [ /space /hyphen /period /zero /one /two /three /four /five /six /seven /eight /nine /A /a /c /l /u /v ] def
/FontInfo 10 dict dup begin
/FamilyName (DejaVu Sans) def
/FullName (DejaVu Sans) def
/Notice (Copyright (c) 2003 by Bitstream, Inc. All Rights Reserved. Copyright (c) 2006 by Tavmjong Bah. All Rights Reserved. DejaVu changes are in public domain ) def
/Weight (Book) def
/Version (Version 2.35) def
/ItalicAngle 0.0 def
/isFixedPitch false def
/UnderlinePosition -130 def
/UnderlineThickness 90 def
end readonly def
/CharStrings 19 dict dup begin
/space{318 0 0 0 0 0 _sc
}_d
/hyphen{361 0 49 234 312 314 _sc
49 314 _m
312 314 _l
312 234 _l
49 234 _l
49 314 _l
_cl}_d
/period{318 0 107 0 210 124 _sc
107 124 _m
210 124 _l
210 0 _l
107 0 _l
107 124 _l
_cl}_d
/zero{636 0 66 -13 570 742 _sc
318 664 _m
267 664 229 639 203 589 _c
177 539 165 464 165 364 _c
165 264 177 189 203 139 _c
229 89 267 64 318 64 _c
369 64 407 89 433 139 _c
458 189 471 264 471 364 _c
471 464 458 539 433 589 _c
407 639 369 664 318 664 _c
318 742 _m
399 742 461 709 505 645 _c
548 580 570 486 570 364 _c
570 241 548 147 505 83 _c
461 19 399 -13 318 -13 _c
236 -13 173 19 130 83 _c
87 147 66 241 66 364 _c
66 486 87 580 130 645 _c
173 709 236 742 318 742 _c
_cl}_d
/one{636 0 110 0 544 729 _sc
124 83 _m
285 83 _l
285 639 _l
110 604 _l
110 694 _l
284 729 _l
383 729 _l
383 83 _l
544 83 _l
544 0 _l
124 0 _l
124 83 _l
_cl}_d
/two{{636 0 73 0 536 742 _sc
192 83 _m
536 83 _l
536 0 _l
73 0 _l
73 83 _l
110 121 161 173 226 239 _c
290 304 331 346 348 365 _c
380 400 402 430 414 455 _c
426 479 433 504 433 528 _c
433 566 419 598 392 622 _c
365 646 330 659 286 659 _c
255 659 222 653 188 643 _c
154 632 117 616 78 594 _c
78 694 _l
118 710 155 722 189 730 _c
223 738 255 742 284 742 _c
}_e{359 742 419 723 464 685 _c
509 647 532 597 532 534 _c
532 504 526 475 515 449 _c
504 422 484 390 454 354 _c
446 344 420 317 376 272 _c
332 227 271 164 192 83 _c
_cl}_e}_d
/three{{636 0 76 -13 556 742 _sc
406 393 _m
453 383 490 362 516 330 _c
542 298 556 258 556 212 _c
556 140 531 84 482 45 _c
432 6 362 -13 271 -13 _c
240 -13 208 -10 176 -4 _c
144 1 110 10 76 22 _c
76 117 _l
103 101 133 89 166 81 _c
198 73 232 69 268 69 _c
330 69 377 81 409 105 _c
441 129 458 165 458 212 _c
458 254 443 288 413 312 _c
383 336 341 349 287 349 _c
}_e{202 349 _l
202 430 _l
291 430 _l
339 430 376 439 402 459 _c
428 478 441 506 441 543 _c
441 580 427 609 401 629 _c
374 649 336 659 287 659 _c
260 659 231 656 200 650 _c
169 644 135 635 98 623 _c
98 711 _l
135 721 170 729 203 734 _c
235 739 266 742 296 742 _c
370 742 429 725 473 691 _c
517 657 539 611 539 553 _c
539 513 527 479 504 451 _c
481 423 448 403 406 393 _c
_cl}_e}_d
/four{636 0 49 0 580 729 _sc
378 643 _m
129 254 _l
378 254 _l
378 643 _l
352 729 _m
476 729 _l
476 254 _l
580 254 _l
580 172 _l
476 172 _l
476 0 _l
378 0 _l
378 172 _l
49 172 _l
49 267 _l
352 729 _l
_cl}_d
/five{{636 0 77 -13 549 729 _sc
108 729 _m
495 729 _l
495 646 _l
198 646 _l
198 467 _l
212 472 227 476 241 478 _c
255 480 270 482 284 482 _c
365 482 429 459 477 415 _c
525 370 549 310 549 234 _c
549 155 524 94 475 51 _c
426 8 357 -13 269 -13 _c
238 -13 207 -10 175 -6 _c
143 -1 111 6 77 17 _c
77 116 _l
106 100 136 88 168 80 _c
199 72 232 69 267 69 _c
}_e{323 69 368 83 401 113 _c
433 143 450 183 450 234 _c
450 284 433 324 401 354 _c
368 384 323 399 267 399 _c
241 399 214 396 188 390 _c
162 384 135 375 108 363 _c
108 729 _l
_cl}_e}_d
/six{{636 0 70 -13 573 742 _sc
330 404 _m
286 404 251 388 225 358 _c
199 328 186 286 186 234 _c
186 181 199 139 225 109 _c
251 79 286 64 330 64 _c
374 64 409 79 435 109 _c
461 139 474 181 474 234 _c
474 286 461 328 435 358 _c
409 388 374 404 330 404 _c
526 713 _m
526 623 _l
501 635 476 644 451 650 _c
425 656 400 659 376 659 _c
310 659 260 637 226 593 _c
}_e{192 549 172 482 168 394 _c
187 422 211 444 240 459 _c
269 474 301 482 336 482 _c
409 482 467 459 509 415 _c
551 371 573 310 573 234 _c
573 159 550 99 506 54 _c
462 9 403 -13 330 -13 _c
246 -13 181 19 137 83 _c
92 147 70 241 70 364 _c
70 479 97 571 152 639 _c
206 707 280 742 372 742 _c
396 742 421 739 447 735 _c
472 730 498 723 526 713 _c
_cl}_e}_d
/seven{636 0 82 0 551 729 _sc
82 729 _m
551 729 _l
551 687 _l
286 0 _l
183 0 _l
432 646 _l
82 646 _l
82 729 _l
_cl}_d
/eight{{636 0 68 -13 568 742 _sc
318 346 _m
271 346 234 333 207 308 _c
180 283 167 249 167 205 _c
167 161 180 126 207 101 _c
234 76 271 64 318 64 _c
364 64 401 76 428 102 _c
455 127 469 161 469 205 _c
469 249 455 283 429 308 _c
402 333 365 346 318 346 _c
219 388 _m
177 398 144 418 120 447 _c
96 476 85 511 85 553 _c
85 611 105 657 147 691 _c
188 725 245 742 318 742 _c
}_e{390 742 447 725 489 691 _c
530 657 551 611 551 553 _c
551 511 539 476 515 447 _c
491 418 459 398 417 388 _c
464 377 501 355 528 323 _c
554 291 568 251 568 205 _c
568 134 546 80 503 43 _c
459 5 398 -13 318 -13 _c
237 -13 175 5 132 43 _c
89 80 68 134 68 205 _c
68 251 81 291 108 323 _c
134 355 171 377 219 388 _c
183 544 _m
183 506 194 476 218 455 _c
}_e{242 434 275 424 318 424 _c
360 424 393 434 417 455 _c
441 476 453 506 453 544 _c
453 582 441 611 417 632 _c
393 653 360 664 318 664 _c
275 664 242 653 218 632 _c
194 611 183 582 183 544 _c
_cl}_e}_d
/nine{{636 0 63 -13 566 742 _sc
110 15 _m
110 105 _l
134 93 159 84 185 78 _c
210 72 235 69 260 69 _c
324 69 374 90 408 134 _c
442 178 462 244 468 334 _c
448 306 424 284 396 269 _c
367 254 335 247 300 247 _c
226 247 168 269 126 313 _c
84 357 63 417 63 494 _c
63 568 85 628 129 674 _c
173 719 232 742 306 742 _c
390 742 455 709 499 645 _c
543 580 566 486 566 364 _c
}_e{566 248 538 157 484 89 _c
429 21 356 -13 264 -13 _c
239 -13 214 -10 189 -6 _c
163 -2 137 5 110 15 _c
306 324 _m
350 324 385 339 411 369 _c
437 399 450 441 450 494 _c
450 546 437 588 411 618 _c
385 648 350 664 306 664 _c
262 664 227 648 201 618 _c
175 588 162 546 162 494 _c
162 441 175 399 201 369 _c
227 339 262 324 306 324 _c
_cl}_e}_d
/A{684 0 8 0 676 729 _sc
342 632 _m
208 269 _l
476 269 _l
342 632 _l
286 729 _m
398 729 _l
676 0 _l
573 0 _l
507 187 _l
178 187 _l
112 0 _l
8 0 _l
286 729 _l
_cl}_d
/a{{613 0 60 -13 522 560 _sc
343 275 _m
270 275 220 266 192 250 _c
164 233 150 205 150 165 _c
150 133 160 107 181 89 _c
202 70 231 61 267 61 _c
317 61 357 78 387 114 _c
417 149 432 196 432 255 _c
432 275 _l
343 275 _l
522 312 _m
522 0 _l
432 0 _l
432 83 _l
411 49 385 25 355 10 _c
325 -5 287 -13 243 -13 _c
187 -13 142 2 109 33 _c
76 64 60 106 60 159 _c
}_e{60 220 80 266 122 298 _c
163 329 224 345 306 345 _c
432 345 _l
432 354 _l
432 395 418 427 391 450 _c
364 472 326 484 277 484 _c
245 484 215 480 185 472 _c
155 464 127 453 100 439 _c
100 522 _l
132 534 164 544 195 550 _c
226 556 256 560 286 560 _c
365 560 424 539 463 498 _c
502 457 522 395 522 312 _c
_cl}_e}_d
/c{{550 0 55 -13 488 560 _sc
488 526 _m
488 442 _l
462 456 437 466 411 473 _c
385 480 360 484 334 484 _c
276 484 230 465 198 428 _c
166 391 150 339 150 273 _c
150 206 166 154 198 117 _c
230 80 276 62 334 62 _c
360 62 385 65 411 72 _c
437 79 462 90 488 104 _c
488 21 _l
462 9 436 0 410 -5 _c
383 -10 354 -13 324 -13 _c
242 -13 176 12 128 64 _c
}_e{79 115 55 185 55 273 _c
55 362 79 432 128 483 _c
177 534 244 560 330 560 _c
358 560 385 557 411 551 _c
437 545 463 537 488 526 _c
_cl}_e}_d
/l{278 0 94 0 184 760 _sc
94 760 _m
184 760 _l
184 0 _l
94 0 _l
94 760 _l
_cl}_d
/u{634 0 85 -13 543 560 _sc
85 216 _m
85 547 _l
175 547 _l
175 219 _l
175 167 185 129 205 103 _c
225 77 255 64 296 64 _c
344 64 383 79 411 110 _c
439 141 453 183 453 237 _c
453 547 _l
543 547 _l
543 0 _l
453 0 _l
453 84 _l
431 50 405 26 377 10 _c
348 -5 315 -13 277 -13 _c
214 -13 166 6 134 45 _c
101 83 85 140 85 216 _c
311 560 _m
311 560 _l
_cl}_d
/v{592 0 30 0 562 547 _sc
30 547 _m
125 547 _l
296 88 _l
467 547 _l
562 547 _l
357 0 _l
235 0 _l
30 547 _l
_cl}_d
end readonly def

/BuildGlyph
 {exch begin
 CharStrings exch
 2 copy known not{pop /.notdef}if
 true 3 1 roll get exec
 end}_d

/BuildChar {
 1 index /Encoding get exch get
 1 index /BuildGlyph get exec
}_d

FontName currentdict end definefont pop
end
%%EndProlog
mpldict begin
-270 108 translate
1152 576 0 0 clipbox
gsave
0 0 m
1152 0 l
1152 576 l
0 576 l
cl
1.000 setgray
fill
grestore
gsave
46.3 310.4 m
376.9 310.4 l
376.9 549.2 l
46.3 549.2 l
cl
1.000 setgray
fill
grestore
0.800 setlinewidth
1 setlinejoin
0 setlinecap
[] 0 setdash
0.000 setgray
gsave
/o {
gsave
newpath
translate
0.8 setlinewidth
1 setlinejoin
0 setlinecap
0 0 m
0 -3.5 l

gsave
0.000 setgray
fill
grestore
stroke
grestore
} bind def
50.7818 310.4 o
grestore
/DejaVuSans findfont
10.000 scalefont
setfont
gsave
47.602131 295.806250 translate
0.000000 rotate
0.000000 0.000000 m /zero glyphshow
grestore
gsave
/o {
gsave
newpath
translate
0.8 setlinewidth
1 setlinejoin
0 setlinecap
0 0 m
0 -3.5 l

gsave
0.000 setgray
fill
grestore
stroke
grestore
} bind def
103.509 310.4 o
grestore
gsave
97.149716 295.806250 translate
0.000000 rotate
0.000000 0.000000 m /one glyphshow
6.362305 0.000000 m /zero glyphshow
grestore
gsave
/o {
gsave
newpath
translate
0.8 setlinewidth
1 setlinejoin
0 setlinecap
0 0 m
0 -3.5 l

gsave
0.000 setgray
fill
grestore
stroke
grestore
} bind def
156.236 310.4 o
grestore
gsave
149.876989 295.806250 translate
0.000000 rotate
0.000000 0.000000 m /two glyphshow
6.362305 0.000000 m /zero glyphshow
grestore
gsave
/o {
gsave
newpath
translate
0.8 setlinewidth
1 setlinejoin
0 setlinecap
0 0 m
0 -3.5 l

gsave
0.000 setgray
fill
grestore
stroke
grestore
} bind def
208.964 310.4 o
grestore
gsave
202.604261 295.806250 translate
0.000000 rotate
0.000000 0.000000 m /three glyphshow
6.362305 0.000000 m /zero glyphshow
grestore
gsave
/o {
gsave
newpath
translate
0.8 setlinewidth
1 setlinejoin
0 setlinecap
0 0 m
0 -3.5 l

gsave
0.000 setgray
fill
grestore
stroke
grestore
} bind def
261.691 310.4 o
grestore
gsave
255.331534 295.806250 translate
0.000000 rotate
0.000000 0.000000 m /four glyphshow
6.362305 0.000000 m /zero glyphshow
grestore
gsave
/o {
gsave
newpath
translate
0.8 setlinewidth
1 setlinejoin
0 setlinecap
0 0 m
0 -3.5 l

gsave
0.000 setgray
fill
grestore
stroke
grestore
} bind def
314.418 310.4 o
grestore
gsave
308.058807 295.806250 translate
0.000000 rotate
0.000000 0.000000 m /five glyphshow
6.362305 0.000000 m /zero glyphshow
grestore
gsave
/o {
gsave
newpath
translate
0.8 setlinewidth
1 setlinejoin
0 setlinecap
0 0 m
0 -3.5 l

gsave
0.000 setgray
fill
grestore
stroke
grestore
} bind def
367.145 310.4 o
grestore
gsave
360.786080 295.806250 translate
0.000000 rotate
0.000000 0.000000 m /six glyphshow
6.362305 0.000000 m /zero glyphshow
grestore
gsave
/o {
gsave
newpath
translate
0.8 setlinewidth
1 setlinejoin
0 setlinecap
0 0 m
-3.5 0 l

gsave
0.000 setgray
fill
grestore
stroke
grestore
} bind def
46.3 337.88 o
grestore
gsave
17.034375 334.083569 translate
0.000000 rotate
0.000000 0.000000 m /zero glyphshow
6.362305 0.000000 m /period glyphshow
9.541016 0.000000 m /eight glyphshow
15.903320 0.000000 m /four glyphshow
grestore
gsave
/o {
gsave
newpath
translate
0.8 setlinewidth
1 setlinejoin
0 setlinecap
0 0 m
-3.5 0 l

gsave
0.000 setgray
fill
grestore
stroke
grestore
} bind def
46.3 379.239 o
grestore
gsave
17.034375 375.442442 translate
0.000000 rotate
0.000000 0.000000 m /zero glyphshow
6.362305 0.000000 m /period glyphshow
9.541016 0.000000 m /eight glyphshow
15.903320 0.000000 m /five glyphshow
grestore
gsave
/o {
gsave
newpath
translate
0.8 setlinewidth
1 setlinejoin
0 setlinecap
0 0 m
-3.5 0 l

gsave
0.000 setgray
fill
grestore
stroke
grestore
} bind def
46.3 420.598 o
grestore
gsave
17.034375 416.801315 translate
0.000000 rotate
0.000000 0.000000 m /zero glyphshow
6.362305 0.000000 m /period glyphshow
9.541016 0.000000 m /eight glyphshow
15.903320 0.000000 m /six glyphshow
grestore
gsave
/o {
gsave
newpath
translate
0.8 setlinewidth
1 setlinejoin
0 setlinecap
0 0 m
-3.5 0 l

gsave
0.000 setgray
fill
grestore
stroke
grestore
} bind def
46.3 461.957 o
grestore
gsave
17.034375 458.160189 translate
0.000000 rotate
0.000000 0.000000 m /zero glyphshow
6.362305 0.000000 m /period glyphshow
9.541016 0.000000 m /eight glyphshow
15.903320 0.000000 m /seven glyphshow
grestore
gsave
/o {
gsave
newpath
translate
0.8 setlinewidth
1 setlinejoin
0 setlinecap
0 0 m
-3.5 0 l

gsave
0.000 setgray
fill
grestore
stroke
grestore
} bind def
46.3 503.316 o
grestore
gsave
17.034375 499.519062 translate
0.000000 rotate
0.000000 0.000000 m /zero glyphshow
6.362305 0.000000 m /period glyphshow
9.541016 0.000000 m /eight glyphshow
15.903320 0.000000 m /eight glyphshow
grestore
gsave
/o {
gsave
newpath
translate
0.8 setlinewidth
1 setlinejoin
0 setlinecap
0 0 m
-3.5 0 l

gsave
0.000 setgray
fill
grestore
stroke
grestore
} bind def
46.3 544.675 o
grestore
gsave
17.034375 540.877935 translate
0.000000 rotate
0.000000 0.000000 m /zero glyphshow
6.362305 0.000000 m /period glyphshow
9.541016 0.000000 m /eight glyphshow
15.903320 0.000000 m /nine glyphshow
grestore
1.500 setlinewidth
2 setlinecap
0.122 0.467 0.706 setrgbcolor
gsave
330.6 238.8 46.3 310.4 clipbox
61.327273 387.785256 m
66.6 393.216677 l
71.872727 403.29399 l
77.145455 408.790214 l
82.418182 414.437813 l
87.690909 422.01783 l
92.963636 426.220565 l
98.236364 430.036923 l
103.509091 434.948776 l
108.781818 437.55544 l
114.054545 436.684507 l
119.327273 443.036199 l
124.6 448.051366 l
129.872727 449.412685 l
135.145455 451.10699 l
140.418182 456.565093 l
145.690909 459.226536 l
150.963636 462.342743 l
156.236364 464.696578 l
161.509091 467.533941 l
166.781818 471.008094 l
172.054545 472.315299 l
177.327273 474.704784 l
182.6 476.036644 l
187.872727 477.905674 l
193.145455 482.390586 l
198.418182 483.519955 l
203.690909 486.974895 l
208.963636 488.353318 l
214.236364 490.324439 l
219.509091 491.069236 l
224.781818 492.676997 l
230.054545 496.233141 l
235.327273 498.540053 l
240.6 500.198624 l
245.872727 501.260164 l
251.145455 503.378218 l
256.418182 506.662348 l
261.690909 507.719001 l
266.963636 507.629709 l
272.236364 510.928832 l
277.509091 511.067796 l
282.781818 513.448313 l
288.054545 515.77641 l
293.327273 517.254147 l
298.6 519.576386 l
303.872727 519.937608 l
309.145455 523.019303 l
314.418182 525.106677 l
319.690909 525.737138 l
324.963636 527.627908 l
330.236364 527.286453 l
335.509091 531.062718 l
340.781818 531.30805 l
346.054545 533.061355 l
351.327273 534.788006 l
356.6 536.835343 l
361.872727 538.345455 l
stroke
grestore
1.000 0.498 0.055 setrgbcolor
gsave
330.6 238.8 46.3 310.4 clipbox
61.327273 343.196477 m
66.6 344.596261 l
71.872727 350.942289 l
77.145455 352.070791 l
82.418182 352.845342 l
87.690909 353.136724 l
92.963636 354.976452 l
98.236364 352.872545 l
103.509091 353.461809 l
108.781818 351.047477 l
114.054545 349.999377 l
119.327273 350.351514 l
124.6 353.52211 l
129.872727 351.654422 l
135.145455 351.363342 l
140.418182 352.953552 l
145.690909 350.666624 l
150.963636 350.087638 l
156.236364 348.513902 l
161.509091 348.771279 l
166.781818 347.977081 l
172.054545 348.64055 l
177.327273 348.018945 l
182.6 347.249381 l
187.872727 346.059218 l
193.145455 346.184355 l
198.418182 345.729448 l
203.690909 342.988822 l
208.963636 346.303749 l
214.236364 342.272155 l
219.509091 344.566488 l
224.781818 341.573926 l
230.054545 340.979373 l
235.327273 338.00419 l
240.6 339.556919 l
245.872727 341.09922 l
251.145455 338.839647 l
256.418182 336.533677 l
261.690909 337.702229 l
266.963636 335.292431 l
272.236364 337.472357 l
277.509091 334.192946 l
282.781818 335.714542 l
288.054545 333.123084 l
293.327273 332.682534 l
298.6 332.372261 l
303.872727 329.519646 l
309.145455 330.02352 l
314.418182 330.13838 l
319.690909 327.441583 l
324.963636 328.312102 l
330.236364 326.781439 l
335.509091 323.633059 l
340.781818 329.28116 l
346.054545 324.045951 l
351.327273 325.071381 l
356.6 323.681875 l
361.872727 321.254545 l
stroke
grestore
0.800 setlinewidth
0 setlinejoin
[] 0 setdash
0.000 setgray
gsave
46.3 310.4 m
46.3 549.2 l
stroke
grestore
gsave
376.9 310.4 m
376.9 549.2 l
stroke
grestore
gsave
46.3 310.4 m
376.9 310.4 l
stroke
grestore
gsave
46.3 549.2 m
376.9 549.2 l
stroke
grestore
/DejaVuSans findfont
12.000 scalefont
setfont
gsave
184.615625 555.200000 translate
0.000000 rotate
0.000000 0.000000 m /zero glyphshow
7.634766 0.000000 m /space glyphshow
11.449219 0.000000 m /hyphen glyphshow
15.779297 0.000000 m /space glyphshow
19.593750 0.000000 m /zero glyphshow
27.228516 0.000000 m /period glyphshow
31.042969 0.000000 m /eight glyphshow
38.677734 0.000000 m /four glyphshow
46.312500 0.000000 m /four glyphshow
grestore
1.000 setlinewidth
0 setlinecap
0.800 setgray
gsave
53.3 511.85625 m
118.815625 511.85625 l
120.148958 511.85625 120.815625 512.522917 120.815625 513.85625 c
120.815625 542.2 l
120.815625 543.533333 120.148958 544.2 118.815625 544.2 c
53.3 544.2 l
51.966667 544.2 51.3 543.533333 51.3 542.2 c
51.3 513.85625 l
51.3 512.522917 51.966667 511.85625 53.3 511.85625 c
cl
gsave
1.000 setgray
fill
grestore
stroke
grestore
1.500 setlinewidth
1 setlinejoin
2 setlinecap
[] 0 setdash
0.122 0.467 0.706 setrgbcolor
gsave
55.3 536.10625 m
75.3 536.10625 l
stroke
grestore
0.000 setgray
/DejaVuSans findfont
10.000 scalefont
setfont
gsave
83.300000 532.606250 translate
0.000000 rotate
0.000000 0.000000 m /a glyphshow
6.127930 0.000000 m /u glyphshow
12.465820 0.000000 m /c glyphshow
grestore
1.000 0.498 0.055 setrgbcolor
gsave
55.3 521.434375 m
75.3 521.434375 l
stroke
grestore
0.000 setgray
gsave
83.300000 517.934375 translate
0.000000 rotate
0.000000 0.000000 m /v glyphshow
5.917969 0.000000 m /a glyphshow
12.045898 0.000000 m /l glyphshow
14.824219 0.000000 m /A glyphshow
21.665039 0.000000 m /u glyphshow
28.002930 0.000000 m /c glyphshow
grestore
gsave
426.7 310.4 m
757.3 310.4 l
757.3 549.2 l
426.7 549.2 l
cl
1.000 setgray
fill
grestore
0.800 setlinewidth
0 setlinecap
gsave
/o {
gsave
newpath
translate
0.8 setlinewidth
1 setlinejoin
0 setlinecap
0 0 m
0 -3.5 l

gsave
0.000 setgray
fill
grestore
stroke
grestore
} bind def
431.182 310.4 o
grestore
gsave
428.002131 295.806250 translate
0.000000 rotate
0.000000 0.000000 m /zero glyphshow
grestore
gsave
/o {
gsave
newpath
translate
0.8 setlinewidth
1 setlinejoin
0 setlinecap
0 0 m
0 -3.5 l

gsave
0.000 setgray
fill
grestore
stroke
grestore
} bind def
483.909 310.4 o
grestore
gsave
477.549716 295.806250 translate
0.000000 rotate
0.000000 0.000000 m /one glyphshow
6.362305 0.000000 m /zero glyphshow
grestore
gsave
/o {
gsave
newpath
translate
0.8 setlinewidth
1 setlinejoin
0 setlinecap
0 0 m
0 -3.5 l

gsave
0.000 setgray
fill
grestore
stroke
grestore
} bind def
536.636 310.4 o
grestore
gsave
530.276989 295.806250 translate
0.000000 rotate
0.000000 0.000000 m /two glyphshow
6.362305 0.000000 m /zero glyphshow
grestore
gsave
/o {
gsave
newpath
translate
0.8 setlinewidth
1 setlinejoin
0 setlinecap
0 0 m
0 -3.5 l

gsave
0.000 setgray
fill
grestore
stroke
grestore
} bind def
589.364 310.4 o
grestore
gsave
583.004261 295.806250 translate
0.000000 rotate
0.000000 0.000000 m /three glyphshow
6.362305 0.000000 m /zero glyphshow
grestore
gsave
/o {
gsave
newpath
translate
0.8 setlinewidth
1 setlinejoin
0 setlinecap
0 0 m
0 -3.5 l

gsave
0.000 setgray
fill
grestore
stroke
grestore
} bind def
642.091 310.4 o
grestore
gsave
635.731534 295.806250 translate
0.000000 rotate
0.000000 0.000000 m /four glyphshow
6.362305 0.000000 m /zero glyphshow
grestore
gsave
/o {
gsave
newpath
translate
0.8 setlinewidth
1 setlinejoin
0 setlinecap
0 0 m
0 -3.5 l

gsave
0.000 setgray
fill
grestore
stroke
grestore
} bind def
694.818 310.4 o
grestore
gsave
688.458807 295.806250 translate
0.000000 rotate
0.000000 0.000000 m /five glyphshow
6.362305 0.000000 m /zero glyphshow
grestore
gsave
/o {
gsave
newpath
translate
0.8 setlinewidth
1 setlinejoin
0 setlinecap
0 0 m
0 -3.5 l

gsave
0.000 setgray
fill
grestore
stroke
grestore
} bind def
747.545 310.4 o
grestore
gsave
741.186080 295.806250 translate
0.000000 rotate
0.000000 0.000000 m /six glyphshow
6.362305 0.000000 m /zero glyphshow
grestore
gsave
/o {
gsave
newpath
translate
0.8 setlinewidth
1 setlinejoin
0 setlinecap
0 0 m
-3.5 0 l

gsave
0.000 setgray
fill
grestore
stroke
grestore
} bind def
426.7 329.798 o
grestore
gsave
397.434375 326.000935 translate
0.000000 rotate
0.000000 0.000000 m /zero glyphshow
6.362305 0.000000 m /period glyphshow
9.541016 0.000000 m /eight glyphshow
15.903320 0.000000 m /four glyphshow
grestore
gsave
/o {
gsave
newpath
translate
0.8 setlinewidth
1 setlinejoin
0 setlinecap
0 0 m
-3.5 0 l

gsave
0.000 setgray
fill
grestore
stroke
grestore
} bind def
426.7 378.598 o
grestore
gsave
397.434375 374.800676 translate
0.000000 rotate
0.000000 0.000000 m /zero glyphshow
6.362305 0.000000 m /period glyphshow
9.541016 0.000000 m /eight glyphshow
15.903320 0.000000 m /five glyphshow
grestore
gsave
/o {
gsave
newpath
translate
0.8 setlinewidth
1 setlinejoin
0 setlinecap
0 0 m
-3.5 0 l

gsave
0.000 setgray
fill
grestore
stroke
grestore
} bind def
426.7 427.397 o
grestore
gsave
397.434375 423.600417 translate
0.000000 rotate
0.000000 0.000000 m /zero glyphshow
6.362305 0.000000 m /period glyphshow
9.541016 0.000000 m /eight glyphshow
15.903320 0.000000 m /six glyphshow
grestore
gsave
/o {
gsave
newpath
translate
0.8 setlinewidth
1 setlinejoin
0 setlinecap
0 0 m
-3.5 0 l

gsave
0.000 setgray
fill
grestore
stroke
grestore
} bind def
426.7 476.197 o
grestore
gsave
397.434375 472.400158 translate
0.000000 rotate
0.000000 0.000000 m /zero glyphshow
6.362305 0.000000 m /period glyphshow
9.541016 0.000000 m /eight glyphshow
15.903320 0.000000 m /seven glyphshow
grestore
gsave
/o {
gsave
newpath
translate
0.8 setlinewidth
1 setlinejoin
0 setlinecap
0 0 m
-3.5 0 l

gsave
0.000 setgray
fill
grestore
stroke
grestore
} bind def
426.7 524.997 o
grestore
gsave
397.434375 521.199899 translate
0.000000 rotate
0.000000 0.000000 m /zero glyphshow
6.362305 0.000000 m /period glyphshow
9.541016 0.000000 m /eight glyphshow
15.903320 0.000000 m /eight glyphshow
grestore
1.500 setlinewidth
2 setlinecap
0.122 0.467 0.706 setrgbcolor
gsave
330.6 238.8 426.7 310.4 clipbox
441.727273 369.134113 m
447 384.75199 l
452.272727 395.872315 l
457.545455 402.271434 l
462.818182 407.826879 l
468.090909 414.229241 l
473.363636 417.459006 l
478.636364 423.746281 l
483.909091 427.404025 l
489.181818 430.645059 l
494.454545 435.852197 l
499.727273 437.633075 l
505 442.744718 l
510.272727 444.880094 l
515.545455 449.852342 l
520.818182 452.457205 l
526.090909 452.916339 l
531.363636 457.546669 l
536.636364 462.935888 l
541.909091 463.460412 l
547.181818 465.156704 l
552.454545 468.693628 l
557.727273 472.787345 l
563 475.43745 l
568.272727 477.657544 l
573.545455 480.655333 l
578.818182 482.491249 l
584.090909 484.445461 l
589.363636 485.305679 l
594.636364 489.395432 l
599.909091 491.928747 l
605.181818 494.623995 l
610.454545 495.43979 l
615.727273 498.500741 l
621 501.588425 l
626.272727 501.662364 l
631.545455 503.869158 l
636.818182 505.810201 l
642.090909 507.172338 l
647.363636 510.66746 l
652.636364 512.901773 l
657.909091 513.133486 l
663.181818 515.19335 l
668.454545 516.414389 l
673.727273 518.96523 l
679 518.328863 l
684.272727 521.569635 l
689.545455 522.995687 l
694.818182 523.252822 l
700.090909 526.544733 l
705.363636 528.077387 l
710.636364 527.634403 l
715.909091 531.168641 l
721.181818 531.646318 l
726.454545 533.815699 l
731.727273 535.410336 l
737 536.608508 l
742.272727 538.345455 l
stroke
grestore
1.000 0.498 0.055 setrgbcolor
gsave
330.6 238.8 426.7 310.4 clipbox
441.727273 321.254545 m
447 329.556326 l
452.272727 336.418513 l
457.545455 338.308548 l
462.818182 341.190232 l
468.090909 342.248929 l
473.363636 342.644983 l
478.636364 344.83442 l
483.909091 346.557011 l
489.181818 345.407547 l
494.454545 347.951132 l
499.727273 346.338031 l
505 345.096553 l
510.272727 346.752095 l
515.545455 349.136617 l
520.818182 348.464699 l
526.090909 346.835193 l
531.363636 350.125234 l
536.636364 349.81531 l
541.909091 348.088975 l
547.181818 347.728408 l
552.454545 348.838819 l
557.727273 348.611815 l
563 348.935469 l
568.272727 348.220933 l
573.545455 348.479322 l
578.818182 345.358508 l
584.090909 345.285931 l
589.363636 346.170409 l
594.636364 347.048109 l
599.909091 346.9322 l
605.181818 344.763091 l
610.454545 345.244561 l
615.727273 346.302902 l
621 343.09899 l
626.272727 342.876623 l
631.545455 344.478489 l
636.818182 341.376757 l
642.090909 344.131118 l
647.363636 340.862833 l
652.636364 340.192877 l
657.909091 342.224499 l
663.181818 340.389209 l
668.454545 340.680409 l
673.727273 338.566758 l
679 340.956452 l
684.272727 339.371882 l
689.545455 336.70472 l
694.818182 337.696904 l
700.090909 333.659694 l
705.363636 331.854005 l
710.636364 335.04793 l
715.909091 332.073341 l
721.181818 332.865448 l
726.454545 331.400889 l
731.727273 329.97146 l
737 331.230591 l
742.272727 328.517066 l
stroke
grestore
0.800 setlinewidth
0 setlinejoin
[] 0 setdash
0.000 setgray
gsave
426.7 310.4 m
426.7 549.2 l
stroke
grestore
gsave
757.3 310.4 m
757.3 549.2 l
stroke
grestore
gsave
426.7 310.4 m
757.3 310.4 l
stroke
grestore
gsave
426.7 549.2 m
757.3 549.2 l
stroke
grestore
/DejaVuSans findfont
12.000 scalefont
setfont
gsave
559.289062 555.200000 translate
0.000000 rotate
0.000000 0.000000 m /zero glyphshow
7.634766 0.000000 m /period glyphshow
11.449219 0.000000 m /two glyphshow
19.083984 0.000000 m /space glyphshow
22.898438 0.000000 m /hyphen glyphshow
27.228516 0.000000 m /space glyphshow
31.042969 0.000000 m /zero glyphshow
38.677734 0.000000 m /period glyphshow
42.492188 0.000000 m /eight glyphshow
50.126953 0.000000 m /four glyphshow
57.761719 0.000000 m /four glyphshow
grestore
1.000 setlinewidth
0 setlinecap
0.800 setgray
gsave
433.7 511.85625 m
499.215625 511.85625 l
500.548958 511.85625 501.215625 512.522917 501.215625 513.85625 c
501.215625 542.2 l
501.215625 543.533333 500.548958 544.2 499.215625 544.2 c
433.7 544.2 l
432.366667 544.2 431.7 543.533333 431.7 542.2 c
431.7 513.85625 l
431.7 512.522917 432.366667 511.85625 433.7 511.85625 c
cl
gsave
1.000 setgray
fill
grestore
stroke
grestore
1.500 setlinewidth
1 setlinejoin
2 setlinecap
[] 0 setdash
0.122 0.467 0.706 setrgbcolor
gsave
435.7 536.10625 m
455.7 536.10625 l
stroke
grestore
0.000 setgray
/DejaVuSans findfont
10.000 scalefont
setfont
gsave
463.700000 532.606250 translate
0.000000 rotate
0.000000 0.000000 m /a glyphshow
6.127930 0.000000 m /u glyphshow
12.465820 0.000000 m /c glyphshow
grestore
1.000 0.498 0.055 setrgbcolor
gsave
435.7 521.434375 m
455.7 521.434375 l
stroke
grestore
0.000 setgray
gsave
463.700000 517.934375 translate
0.000000 rotate
0.000000 0.000000 m /v glyphshow
5.917969 0.000000 m /a glyphshow
12.045898 0.000000 m /l glyphshow
14.824219 0.000000 m /A glyphshow
21.665039 0.000000 m /u glyphshow
28.002930 0.000000 m /c glyphshow
grestore
gsave
807.1 310.4 m
1137.7 310.4 l
1137.7 549.2 l
807.1 549.2 l
cl
1.000 setgray
fill
grestore
0.800 setlinewidth
0 setlinecap
gsave
/o {
gsave
newpath
translate
0.8 setlinewidth
1 setlinejoin
0 setlinecap
0 0 m
0 -3.5 l

gsave
0.000 setgray
fill
grestore
stroke
grestore
} bind def
811.582 310.4 o
grestore
gsave
808.402131 295.806250 translate
0.000000 rotate
0.000000 0.000000 m /zero glyphshow
grestore
gsave
/o {
gsave
newpath
translate
0.8 setlinewidth
1 setlinejoin
0 setlinecap
0 0 m
0 -3.5 l

gsave
0.000 setgray
fill
grestore
stroke
grestore
} bind def
864.309 310.4 o
grestore
gsave
857.949716 295.806250 translate
0.000000 rotate
0.000000 0.000000 m /one glyphshow
6.362305 0.000000 m /zero glyphshow
grestore
gsave
/o {
gsave
newpath
translate
0.8 setlinewidth
1 setlinejoin
0 setlinecap
0 0 m
0 -3.5 l

gsave
0.000 setgray
fill
grestore
stroke
grestore
} bind def
917.036 310.4 o
grestore
gsave
910.676989 295.806250 translate
0.000000 rotate
0.000000 0.000000 m /two glyphshow
6.362305 0.000000 m /zero glyphshow
grestore
gsave
/o {
gsave
newpath
translate
0.8 setlinewidth
1 setlinejoin
0 setlinecap
0 0 m
0 -3.5 l

gsave
0.000 setgray
fill
grestore
stroke
grestore
} bind def
969.764 310.4 o
grestore
gsave
963.404261 295.806250 translate
0.000000 rotate
0.000000 0.000000 m /three glyphshow
6.362305 0.000000 m /zero glyphshow
grestore
gsave
/o {
gsave
newpath
translate
0.8 setlinewidth
1 setlinejoin
0 setlinecap
0 0 m
0 -3.5 l

gsave
0.000 setgray
fill
grestore
stroke
grestore
} bind def
1022.49 310.4 o
grestore
gsave
1016.131534 295.806250 translate
0.000000 rotate
0.000000 0.000000 m /four glyphshow
6.362305 0.000000 m /zero glyphshow
grestore
gsave
/o {
gsave
newpath
translate
0.8 setlinewidth
1 setlinejoin
0 setlinecap
0 0 m
0 -3.5 l

gsave
0.000 setgray
fill
grestore
stroke
grestore
} bind def
1075.22 310.4 o
grestore
gsave
1068.858807 295.806250 translate
0.000000 rotate
0.000000 0.000000 m /five glyphshow
6.362305 0.000000 m /zero glyphshow
grestore
gsave
/o {
gsave
newpath
translate
0.8 setlinewidth
1 setlinejoin
0 setlinecap
0 0 m
0 -3.5 l

gsave
0.000 setgray
fill
grestore
stroke
grestore
} bind def
1127.95 310.4 o
grestore
gsave
1121.586080 295.806250 translate
0.000000 rotate
0.000000 0.000000 m /six glyphshow
6.362305 0.000000 m /zero glyphshow
grestore
gsave
/o {
gsave
newpath
translate
0.8 setlinewidth
1 setlinejoin
0 setlinecap
0 0 m
-3.5 0 l

gsave
0.000 setgray
fill
grestore
stroke
grestore
} bind def
807.1 328.295 o
grestore
gsave
771.475000 324.497915 translate
0.000000 rotate
0.000000 0.000000 m /zero glyphshow
6.362305 0.000000 m /period glyphshow
9.541016 0.000000 m /eight glyphshow
15.903320 0.000000 m /four glyphshow
22.265625 0.000000 m /zero glyphshow
grestore
gsave
/o {
gsave
newpath
translate
0.8 setlinewidth
1 setlinejoin
0 setlinecap
0 0 m
-3.5 0 l

gsave
0.000 setgray
fill
grestore
stroke
grestore
} bind def
807.1 357.248 o
grestore
gsave
771.475000 353.451468 translate
0.000000 rotate
0.000000 0.000000 m /zero glyphshow
6.362305 0.000000 m /period glyphshow
9.541016 0.000000 m /eight glyphshow
15.903320 0.000000 m /four glyphshow
22.265625 0.000000 m /five glyphshow
grestore
gsave
/o {
gsave
newpath
translate
0.8 setlinewidth
1 setlinejoin
0 setlinecap
0 0 m
-3.5 0 l

gsave
0.000 setgray
fill
grestore
stroke
grestore
} bind def
807.1 386.202 o
grestore
gsave
771.475000 382.405022 translate
0.000000 rotate
0.000000 0.000000 m /zero glyphshow
6.362305 0.000000 m /period glyphshow
9.541016 0.000000 m /eight glyphshow
15.903320 0.000000 m /five glyphshow
22.265625 0.000000 m /zero glyphshow
grestore
gsave
/o {
gsave
newpath
translate
0.8 setlinewidth
1 setlinejoin
0 setlinecap
0 0 m
-3.5 0 l

gsave
0.000 setgray
fill
grestore
stroke
grestore
} bind def
807.1 415.155 o
grestore
gsave
771.475000 411.358575 translate
0.000000 rotate
0.000000 0.000000 m /zero glyphshow
6.362305 0.000000 m /period glyphshow
9.541016 0.000000 m /eight glyphshow
15.903320 0.000000 m /five glyphshow
22.265625 0.000000 m /five glyphshow
grestore
gsave
/o {
gsave
newpath
translate
0.8 setlinewidth
1 setlinejoin
0 setlinecap
0 0 m
-3.5 0 l

gsave
0.000 setgray
fill
grestore
stroke
grestore
} bind def
807.1 444.109 o
grestore
gsave
771.475000 440.312129 translate
0.000000 rotate
0.000000 0.000000 m /zero glyphshow
6.362305 0.000000 m /period glyphshow
9.541016 0.000000 m /eight glyphshow
15.903320 0.000000 m /six glyphshow
22.265625 0.000000 m /zero glyphshow
grestore
gsave
/o {
gsave
newpath
translate
0.8 setlinewidth
1 setlinejoin
0 setlinecap
0 0 m
-3.5 0 l

gsave
0.000 setgray
fill
grestore
stroke
grestore
} bind def
807.1 473.063 o
grestore
gsave
771.475000 469.265682 translate
0.000000 rotate
0.000000 0.000000 m /zero glyphshow
6.362305 0.000000 m /period glyphshow
9.541016 0.000000 m /eight glyphshow
15.903320 0.000000 m /six glyphshow
22.265625 0.000000 m /five glyphshow
grestore
gsave
/o {
gsave
newpath
translate
0.8 setlinewidth
1 setlinejoin
0 setlinecap
0 0 m
-3.5 0 l

gsave
0.000 setgray
fill
grestore
stroke
grestore
} bind def
807.1 502.016 o
grestore
gsave
771.475000 498.219235 translate
0.000000 rotate
0.000000 0.000000 m /zero glyphshow
6.362305 0.000000 m /period glyphshow
9.541016 0.000000 m /eight glyphshow
15.903320 0.000000 m /seven glyphshow
22.265625 0.000000 m /zero glyphshow
grestore
gsave
/o {
gsave
newpath
translate
0.8 setlinewidth
1 setlinejoin
0 setlinecap
0 0 m
-3.5 0 l

gsave
0.000 setgray
fill
grestore
stroke
grestore
} bind def
807.1 530.97 o
grestore
gsave
771.475000 527.172789 translate
0.000000 rotate
0.000000 0.000000 m /zero glyphshow
6.362305 0.000000 m /period glyphshow
9.541016 0.000000 m /eight glyphshow
15.903320 0.000000 m /seven glyphshow
22.265625 0.000000 m /five glyphshow
grestore
1.500 setlinewidth
2 setlinecap
0.122 0.467 0.706 setrgbcolor
gsave
330.6 238.8 807.1 310.4 clipbox
822.127273 371.33685 m
827.4 383.940672 l
832.672727 397.214335 l
837.945455 404.736487 l
843.218182 409.665187 l
848.490909 415.191423 l
853.763636 417.645821 l
859.036364 423.530671 l
864.309091 429.566547 l
869.581818 433.491594 l
874.854545 437.702599 l
880.127273 441.733734 l
885.4 443.96103 l
890.672727 446.914301 l
895.945455 450.664725 l
901.218182 455.155119 l
906.490909 456.95616 l
911.763636 461.985389 l
917.036364 462.292689 l
922.309091 465.682167 l
927.581818 467.9261 l
932.854545 470.706537 l
938.127273 474.275224 l
943.4 477.764103 l
948.672727 479.430484 l
953.945455 480.257337 l
959.218182 483.382626 l
964.490909 486.656375 l
969.763636 488.537341 l
975.036364 490.66473 l
980.309091 491.789787 l
985.581818 494.701346 l
990.854545 494.833946 l
996.127273 498.958534 l
1001.4 499.572202 l
1006.672727 502.411182 l
1011.945455 503.357885 l
1017.218182 505.574607 l
1022.490909 507.880739 l
1027.763636 509.499654 l
1033.036364 511.199738 l
1038.309091 512.837585 l
1043.581818 514.577048 l
1048.854545 515.494246 l
1054.127273 518.237751 l
1059.4 519.997585 l
1064.672727 521.646083 l
1069.945455 522.46901 l
1075.218182 523.844612 l
1080.490909 527.067164 l
1085.763636 527.702057 l
1091.036364 528.776772 l
1096.309091 529.848844 l
1101.581818 531.921148 l
1106.854545 534.465307 l
1112.127273 534.58399 l
1117.4 538.345455 l
1122.672727 538.101286 l
stroke
grestore
1.000 0.498 0.055 setrgbcolor
gsave
330.6 238.8 807.1 310.4 clipbox
822.127273 321.254545 m
827.4 330.533283 l
832.672727 337.470012 l
837.945455 341.936925 l
843.218182 341.255567 l
848.490909 342.313153 l
853.763636 343.541924 l
859.036364 344.22434 l
864.309091 347.709844 l
869.581818 350.119565 l
874.854545 351.881784 l
880.127273 349.992392 l
885.4 350.824622 l
890.672727 347.975616 l
895.945455 349.640922 l
901.218182 352.45988 l
906.490909 351.6249 l
911.763636 352.354502 l
917.036364 349.987102 l
922.309091 351.370554 l
927.581818 353.394948 l
932.854545 351.235764 l
938.127273 352.579224 l
943.4 351.098011 l
948.672727 352.117085 l
953.945455 350.885986 l
959.218182 349.544008 l
964.490909 350.132684 l
969.763636 348.667553 l
975.036364 350.007416 l
980.309091 349.265963 l
985.581818 347.264211 l
990.854545 348.662898 l
996.127273 348.886773 l
1001.4 347.499089 l
1006.672727 348.48219 l
1011.945455 346.429442 l
1017.218182 345.728617 l
1022.490909 347.028063 l
1027.763636 343.66825 l
1033.036364 346.328931 l
1038.309091 346.070565 l
1043.581818 344.946325 l
1048.854545 343.945449 l
1054.127273 344.188367 l
1059.4 343.426178 l
1064.672727 344.546821 l
1069.945455 343.146017 l
1075.218182 341.009263 l
1080.490909 341.900529 l
1085.763636 343.167812 l
1091.036364 342.976101 l
1096.309091 341.56112 l
1101.581818 341.668614 l
1106.854545 338.41566 l
1112.127273 339.566773 l
1117.4 338.182051 l
1122.672727 341.715801 l
stroke
grestore
0.800 setlinewidth
0 setlinejoin
[] 0 setdash
0.000 setgray
gsave
807.1 310.4 m
807.1 549.2 l
stroke
grestore
gsave
1137.7 310.4 m
1137.7 549.2 l
stroke
grestore
gsave
807.1 310.4 m
1137.7 310.4 l
stroke
grestore
gsave
807.1 549.2 m
1137.7 549.2 l
stroke
grestore
/DejaVuSans findfont
12.000 scalefont
setfont
gsave
939.689063 555.200000 translate
0.000000 rotate
0.000000 0.000000 m /zero glyphshow
7.634766 0.000000 m /period glyphshow
11.449219 0.000000 m /four glyphshow
19.083984 0.000000 m /space glyphshow
22.898438 0.000000 m /hyphen glyphshow
27.228516 0.000000 m /space glyphshow
31.042969 0.000000 m /zero glyphshow
38.677734 0.000000 m /period glyphshow
42.492188 0.000000 m /eight glyphshow
50.126953 0.000000 m /four glyphshow
57.761719 0.000000 m /four glyphshow
grestore
1.000 setlinewidth
0 setlinecap
0.800 setgray
gsave
814.1 511.85625 m
879.615625 511.85625 l
880.948958 511.85625 881.615625 512.522917 881.615625 513.85625 c
881.615625 542.2 l
881.615625 543.533333 880.948958 544.2 879.615625 544.2 c
814.1 544.2 l
812.766667 544.2 812.1 543.533333 812.1 542.2 c
812.1 513.85625 l
812.1 512.522917 812.766667 511.85625 814.1 511.85625 c
cl
gsave
1.000 setgray
fill
grestore
stroke
grestore
1.500 setlinewidth
1 setlinejoin
2 setlinecap
[] 0 setdash
0.122 0.467 0.706 setrgbcolor
gsave
816.1 536.10625 m
836.1 536.10625 l
stroke
grestore
0.000 setgray
/DejaVuSans findfont
10.000 scalefont
setfont
gsave
844.100000 532.606250 translate
0.000000 rotate
0.000000 0.000000 m /a glyphshow
6.127930 0.000000 m /u glyphshow
12.465820 0.000000 m /c glyphshow
grestore
1.000 0.498 0.055 setrgbcolor
gsave
816.1 521.434375 m
836.1 521.434375 l
stroke
grestore
0.000 setgray
gsave
844.100000 517.934375 translate
0.000000 rotate
0.000000 0.000000 m /v glyphshow
5.917969 0.000000 m /a glyphshow
12.045898 0.000000 m /l glyphshow
14.824219 0.000000 m /A glyphshow
21.665039 0.000000 m /u glyphshow
28.002930 0.000000 m /c glyphshow
grestore
gsave
46.3 27.8 m
376.9 27.8 l
376.9 266.6 l
46.3 266.6 l
cl
1.000 setgray
fill
grestore
0.800 setlinewidth
0 setlinecap
gsave
/o {
gsave
newpath
translate
0.8 setlinewidth
1 setlinejoin
0 setlinecap
0 0 m
0 -3.5 l

gsave
0.000 setgray
fill
grestore
stroke
grestore
} bind def
50.7818 27.8 o
grestore
gsave
47.602131 13.206250 translate
0.000000 rotate
0.000000 0.000000 m /zero glyphshow
grestore
gsave
/o {
gsave
newpath
translate
0.8 setlinewidth
1 setlinejoin
0 setlinecap
0 0 m
0 -3.5 l

gsave
0.000 setgray
fill
grestore
stroke
grestore
} bind def
103.509 27.8 o
grestore
gsave
97.149716 13.206250 translate
0.000000 rotate
0.000000 0.000000 m /one glyphshow
6.362305 0.000000 m /zero glyphshow
grestore
gsave
/o {
gsave
newpath
translate
0.8 setlinewidth
1 setlinejoin
0 setlinecap
0 0 m
0 -3.5 l

gsave
0.000 setgray
fill
grestore
stroke
grestore
} bind def
156.236 27.8 o
grestore
gsave
149.876989 13.206250 translate
0.000000 rotate
0.000000 0.000000 m /two glyphshow
6.362305 0.000000 m /zero glyphshow
grestore
gsave
/o {
gsave
newpath
translate
0.8 setlinewidth
1 setlinejoin
0 setlinecap
0 0 m
0 -3.5 l

gsave
0.000 setgray
fill
grestore
stroke
grestore
} bind def
208.964 27.8 o
grestore
gsave
202.604261 13.206250 translate
0.000000 rotate
0.000000 0.000000 m /three glyphshow
6.362305 0.000000 m /zero glyphshow
grestore
gsave
/o {
gsave
newpath
translate
0.8 setlinewidth
1 setlinejoin
0 setlinecap
0 0 m
0 -3.5 l

gsave
0.000 setgray
fill
grestore
stroke
grestore
} bind def
261.691 27.8 o
grestore
gsave
255.331534 13.206250 translate
0.000000 rotate
0.000000 0.000000 m /four glyphshow
6.362305 0.000000 m /zero glyphshow
grestore
gsave
/o {
gsave
newpath
translate
0.8 setlinewidth
1 setlinejoin
0 setlinecap
0 0 m
0 -3.5 l

gsave
0.000 setgray
fill
grestore
stroke
grestore
} bind def
314.418 27.8 o
grestore
gsave
308.058807 13.206250 translate
0.000000 rotate
0.000000 0.000000 m /five glyphshow
6.362305 0.000000 m /zero glyphshow
grestore
gsave
/o {
gsave
newpath
translate
0.8 setlinewidth
1 setlinejoin
0 setlinecap
0 0 m
0 -3.5 l

gsave
0.000 setgray
fill
grestore
stroke
grestore
} bind def
367.145 27.8 o
grestore
gsave
360.786080 13.206250 translate
0.000000 rotate
0.000000 0.000000 m /six glyphshow
6.362305 0.000000 m /zero glyphshow
grestore
gsave
/o {
gsave
newpath
translate
0.8 setlinewidth
1 setlinejoin
0 setlinecap
0 0 m
-3.5 0 l

gsave
0.000 setgray
fill
grestore
stroke
grestore
} bind def
46.3 40.9301 o
grestore
gsave
10.675000 37.133225 translate
0.000000 rotate
0.000000 0.000000 m /zero glyphshow
6.362305 0.000000 m /period glyphshow
9.541016 0.000000 m /eight glyphshow
15.903320 0.000000 m /four glyphshow
22.265625 0.000000 m /zero glyphshow
grestore
gsave
/o {
gsave
newpath
translate
0.8 setlinewidth
1 setlinejoin
0 setlinecap
0 0 m
-3.5 0 l

gsave
0.000 setgray
fill
grestore
stroke
grestore
} bind def
46.3 70.7281 o
grestore
gsave
10.675000 66.931202 translate
0.000000 rotate
0.000000 0.000000 m /zero glyphshow
6.362305 0.000000 m /period glyphshow
9.541016 0.000000 m /eight glyphshow
15.903320 0.000000 m /four glyphshow
22.265625 0.000000 m /five glyphshow
grestore
gsave
/o {
gsave
newpath
translate
0.8 setlinewidth
1 setlinejoin
0 setlinecap
0 0 m
-3.5 0 l

gsave
0.000 setgray
fill
grestore
stroke
grestore
} bind def
46.3 100.526 o
grestore
gsave
10.675000 96.729179 translate
0.000000 rotate
0.000000 0.000000 m /zero glyphshow
6.362305 0.000000 m /period glyphshow
9.541016 0.000000 m /eight glyphshow
15.903320 0.000000 m /five glyphshow
22.265625 0.000000 m /zero glyphshow
grestore
gsave
/o {
gsave
newpath
translate
0.8 setlinewidth
1 setlinejoin
0 setlinecap
0 0 m
-3.5 0 l

gsave
0.000 setgray
fill
grestore
stroke
grestore
} bind def
46.3 130.324 o
grestore
gsave
10.675000 126.527157 translate
0.000000 rotate
0.000000 0.000000 m /zero glyphshow
6.362305 0.000000 m /period glyphshow
9.541016 0.000000 m /eight glyphshow
15.903320 0.000000 m /five glyphshow
22.265625 0.000000 m /five glyphshow
grestore
gsave
/o {
gsave
newpath
translate
0.8 setlinewidth
1 setlinejoin
0 setlinecap
0 0 m
-3.5 0 l

gsave
0.000 setgray
fill
grestore
stroke
grestore
} bind def
46.3 160.122 o
grestore
gsave
10.675000 156.325134 translate
0.000000 rotate
0.000000 0.000000 m /zero glyphshow
6.362305 0.000000 m /period glyphshow
9.541016 0.000000 m /eight glyphshow
15.903320 0.000000 m /six glyphshow
22.265625 0.000000 m /zero glyphshow
grestore
gsave
/o {
gsave
newpath
translate
0.8 setlinewidth
1 setlinejoin
0 setlinecap
0 0 m
-3.5 0 l

gsave
0.000 setgray
fill
grestore
stroke
grestore
} bind def
46.3 189.92 o
grestore
gsave
10.675000 186.123111 translate
0.000000 rotate
0.000000 0.000000 m /zero glyphshow
6.362305 0.000000 m /period glyphshow
9.541016 0.000000 m /eight glyphshow
15.903320 0.000000 m /six glyphshow
22.265625 0.000000 m /five glyphshow
grestore
gsave
/o {
gsave
newpath
translate
0.8 setlinewidth
1 setlinejoin
0 setlinecap
0 0 m
-3.5 0 l

gsave
0.000 setgray
fill
grestore
stroke
grestore
} bind def
46.3 219.718 o
grestore
gsave
10.675000 215.921088 translate
0.000000 rotate
0.000000 0.000000 m /zero glyphshow
6.362305 0.000000 m /period glyphshow
9.541016 0.000000 m /eight glyphshow
15.903320 0.000000 m /seven glyphshow
22.265625 0.000000 m /zero glyphshow
grestore
gsave
/o {
gsave
newpath
translate
0.8 setlinewidth
1 setlinejoin
0 setlinecap
0 0 m
-3.5 0 l

gsave
0.000 setgray
fill
grestore
stroke
grestore
} bind def
46.3 249.516 o
grestore
gsave
10.675000 245.719065 translate
0.000000 rotate
0.000000 0.000000 m /zero glyphshow
6.362305 0.000000 m /period glyphshow
9.541016 0.000000 m /eight glyphshow
15.903320 0.000000 m /seven glyphshow
22.265625 0.000000 m /five glyphshow
grestore
1.500 setlinewidth
2 setlinecap
0.122 0.467 0.706 setrgbcolor
gsave
330.6 238.8 46.3 27.8 clipbox
61.327273 86.465837 m
66.6 94.190287 l
71.872727 105.372663 l
77.145455 114.115875 l
82.418182 120.642688 l
87.690909 123.22792 l
92.963636 129.097683 l
98.236364 135.499431 l
103.509091 139.488342 l
108.781818 143.034004 l
114.054545 147.871642 l
119.327273 150.73401 l
124.6 156.281509 l
129.872727 156.588329 l
135.145455 161.968515 l
140.418182 165.551025 l
145.690909 167.023157 l
150.963636 169.156419 l
156.236364 173.464753 l
161.509091 176.733841 l
166.781818 179.819532 l
172.054545 182.23257 l
177.327273 183.69838 l
182.6 186.52158 l
187.872727 189.838837 l
193.145455 193.253234 l
198.418182 196.0137 l
203.690909 198.664866 l
208.963636 201.086265 l
214.236364 201.76372 l
219.509091 202.715348 l
224.781818 206.398758 l
230.054545 210.316774 l
235.327273 212.307889 l
240.6 214.271078 l
245.872727 213.557176 l
251.145455 219.187972 l
256.418182 221.230696 l
261.690909 222.690546 l
266.963636 225.214766 l
272.236364 226.016405 l
277.509091 230.144462 l
282.781818 229.367028 l
288.054545 230.665286 l
293.327273 232.558221 l
298.6 236.319566 l
303.872727 239.451866 l
309.145455 239.635303 l
314.418182 241.759364 l
319.690909 243.474903 l
324.963636 243.81213 l
330.236364 247.357593 l
335.509091 250.146025 l
340.781818 250.515418 l
346.054545 252.096092 l
351.327273 254.060561 l
356.6 255.745455 l
361.872727 254.883804 l
stroke
grestore
1.000 0.498 0.055 setrgbcolor
gsave
330.6 238.8 46.3 27.8 clipbox
61.327273 38.654545 m
66.6 40.628876 l
71.872727 49.326733 l
77.145455 53.12426 l
82.418182 54.198534 l
87.690909 52.727477 l
92.963636 56.486894 l
98.236364 60.852155 l
103.509091 60.71278 l
108.781818 60.455808 l
114.054545 61.7533 l
119.327273 65.732668 l
124.6 66.096349 l
129.872727 65.26598 l
135.145455 65.612239 l
140.418182 66.762516 l
145.690909 64.343058 l
150.963636 67.402987 l
156.236364 67.460697 l
161.509091 67.621631 l
166.781818 68.361624 l
172.054545 69.347918 l
177.327273 67.037782 l
182.6 66.211115 l
187.872727 68.503394 l
193.145455 67.055857 l
198.418182 67.406471 l
203.690909 68.597037 l
208.963636 67.855084 l
214.236364 68.29651 l
219.509091 68.01972 l
224.781818 69.051747 l
230.054545 66.89122 l
235.327273 65.868994 l
240.6 62.214544 l
245.872727 64.539489 l
251.145455 64.967849 l
256.418182 64.66558 l
261.690909 63.733293 l
266.963636 63.317346 l
272.236364 65.39795 l
277.509091 62.390286 l
282.781818 62.26572 l
288.054545 63.189296 l
293.327273 60.764175 l
298.6 60.295963 l
303.872727 60.722145 l
309.145455 60.562081 l
314.418182 58.842981 l
319.690909 58.739103 l
324.963636 61.025067 l
330.236364 59.048776 l
335.509091 55.502342 l
340.781818 57.876939 l
346.054545 57.155893 l
351.327273 55.100768 l
356.6 54.531509 l
361.872727 56.265854 l
stroke
grestore
0.800 setlinewidth
0 setlinejoin
[] 0 setdash
0.000 setgray
gsave
46.3 27.8 m
46.3 266.6 l
stroke
grestore
gsave
376.9 27.8 m
376.9 266.6 l
stroke
grestore
gsave
46.3 27.8 m
376.9 27.8 l
stroke
grestore
gsave
46.3 266.6 m
376.9 266.6 l
stroke
grestore
/DejaVuSans findfont
12.000 scalefont
setfont
gsave
178.889062 272.600000 translate
0.000000 rotate
0.000000 0.000000 m /zero glyphshow
7.634766 0.000000 m /period glyphshow
11.449219 0.000000 m /five glyphshow
19.083984 0.000000 m /space glyphshow
22.898438 0.000000 m /hyphen glyphshow
27.228516 0.000000 m /space glyphshow
31.042969 0.000000 m /zero glyphshow
38.677734 0.000000 m /period glyphshow
42.492188 0.000000 m /eight glyphshow
50.126953 0.000000 m /four glyphshow
57.761719 0.000000 m /five glyphshow
grestore
1.000 setlinewidth
0 setlinecap
0.800 setgray
gsave
53.3 229.25625 m
118.815625 229.25625 l
120.148958 229.25625 120.815625 229.922917 120.815625 231.25625 c
120.815625 259.6 l
120.815625 260.933333 120.148958 261.6 118.815625 261.6 c
53.3 261.6 l
51.966667 261.6 51.3 260.933333 51.3 259.6 c
51.3 231.25625 l
51.3 229.922917 51.966667 229.25625 53.3 229.25625 c
cl
gsave
1.000 setgray
fill
grestore
stroke
grestore
1.500 setlinewidth
1 setlinejoin
2 setlinecap
[] 0 setdash
0.122 0.467 0.706 setrgbcolor
gsave
55.3 253.50625 m
75.3 253.50625 l
stroke
grestore
0.000 setgray
/DejaVuSans findfont
10.000 scalefont
setfont
gsave
83.300000 250.006250 translate
0.000000 rotate
0.000000 0.000000 m /a glyphshow
6.127930 0.000000 m /u glyphshow
12.465820 0.000000 m /c glyphshow
grestore
1.000 0.498 0.055 setrgbcolor
gsave
55.3 238.834375 m
75.3 238.834375 l
stroke
grestore
0.000 setgray
gsave
83.300000 235.334375 translate
0.000000 rotate
0.000000 0.000000 m /v glyphshow
5.917969 0.000000 m /a glyphshow
12.045898 0.000000 m /l glyphshow
14.824219 0.000000 m /A glyphshow
21.665039 0.000000 m /u glyphshow
28.002930 0.000000 m /c glyphshow
grestore
gsave
426.7 27.8 m
757.3 27.8 l
757.3 266.6 l
426.7 266.6 l
cl
1.000 setgray
fill
grestore
0.800 setlinewidth
0 setlinecap
gsave
/o {
gsave
newpath
translate
0.8 setlinewidth
1 setlinejoin
0 setlinecap
0 0 m
0 -3.5 l

gsave
0.000 setgray
fill
grestore
stroke
grestore
} bind def
431.182 27.8 o
grestore
gsave
428.002131 13.206250 translate
0.000000 rotate
0.000000 0.000000 m /zero glyphshow
grestore
gsave
/o {
gsave
newpath
translate
0.8 setlinewidth
1 setlinejoin
0 setlinecap
0 0 m
0 -3.5 l

gsave
0.000 setgray
fill
grestore
stroke
grestore
} bind def
483.909 27.8 o
grestore
gsave
477.549716 13.206250 translate
0.000000 rotate
0.000000 0.000000 m /one glyphshow
6.362305 0.000000 m /zero glyphshow
grestore
gsave
/o {
gsave
newpath
translate
0.8 setlinewidth
1 setlinejoin
0 setlinecap
0 0 m
0 -3.5 l

gsave
0.000 setgray
fill
grestore
stroke
grestore
} bind def
536.636 27.8 o
grestore
gsave
530.276989 13.206250 translate
0.000000 rotate
0.000000 0.000000 m /two glyphshow
6.362305 0.000000 m /zero glyphshow
grestore
gsave
/o {
gsave
newpath
translate
0.8 setlinewidth
1 setlinejoin
0 setlinecap
0 0 m
0 -3.5 l

gsave
0.000 setgray
fill
grestore
stroke
grestore
} bind def
589.364 27.8 o
grestore
gsave
583.004261 13.206250 translate
0.000000 rotate
0.000000 0.000000 m /three glyphshow
6.362305 0.000000 m /zero glyphshow
grestore
gsave
/o {
gsave
newpath
translate
0.8 setlinewidth
1 setlinejoin
0 setlinecap
0 0 m
0 -3.5 l

gsave
0.000 setgray
fill
grestore
stroke
grestore
} bind def
642.091 27.8 o
grestore
gsave
635.731534 13.206250 translate
0.000000 rotate
0.000000 0.000000 m /four glyphshow
6.362305 0.000000 m /zero glyphshow
grestore
gsave
/o {
gsave
newpath
translate
0.8 setlinewidth
1 setlinejoin
0 setlinecap
0 0 m
0 -3.5 l

gsave
0.000 setgray
fill
grestore
stroke
grestore
} bind def
694.818 27.8 o
grestore
gsave
688.458807 13.206250 translate
0.000000 rotate
0.000000 0.000000 m /five glyphshow
6.362305 0.000000 m /zero glyphshow
grestore
gsave
/o {
gsave
newpath
translate
0.8 setlinewidth
1 setlinejoin
0 setlinecap
0 0 m
0 -3.5 l

gsave
0.000 setgray
fill
grestore
stroke
grestore
} bind def
747.545 27.8 o
grestore
gsave
741.186080 13.206250 translate
0.000000 rotate
0.000000 0.000000 m /six glyphshow
6.362305 0.000000 m /zero glyphshow
grestore
gsave
/o {
gsave
newpath
translate
0.8 setlinewidth
1 setlinejoin
0 setlinecap
0 0 m
-3.5 0 l

gsave
0.000 setgray
fill
grestore
stroke
grestore
} bind def
426.7 56.8149 o
grestore
gsave
391.075000 53.018022 translate
0.000000 rotate
0.000000 0.000000 m /zero glyphshow
6.362305 0.000000 m /period glyphshow
9.541016 0.000000 m /eight glyphshow
15.903320 0.000000 m /four glyphshow
22.265625 0.000000 m /zero glyphshow
grestore
gsave
/o {
gsave
newpath
translate
0.8 setlinewidth
1 setlinejoin
0 setlinecap
0 0 m
-3.5 0 l

gsave
0.000 setgray
fill
grestore
stroke
grestore
} bind def
426.7 87.3706 o
grestore
gsave
391.075000 83.573733 translate
0.000000 rotate
0.000000 0.000000 m /zero glyphshow
6.362305 0.000000 m /period glyphshow
9.541016 0.000000 m /eight glyphshow
15.903320 0.000000 m /four glyphshow
22.265625 0.000000 m /five glyphshow
grestore
gsave
/o {
gsave
newpath
translate
0.8 setlinewidth
1 setlinejoin
0 setlinecap
0 0 m
-3.5 0 l

gsave
0.000 setgray
fill
grestore
stroke
grestore
} bind def
426.7 117.926 o
grestore
gsave
391.075000 114.129445 translate
0.000000 rotate
0.000000 0.000000 m /zero glyphshow
6.362305 0.000000 m /period glyphshow
9.541016 0.000000 m /eight glyphshow
15.903320 0.000000 m /five glyphshow
22.265625 0.000000 m /zero glyphshow
grestore
gsave
/o {
gsave
newpath
translate
0.8 setlinewidth
1 setlinejoin
0 setlinecap
0 0 m
-3.5 0 l

gsave
0.000 setgray
fill
grestore
stroke
grestore
} bind def
426.7 148.482 o
grestore
gsave
391.075000 144.685156 translate
0.000000 rotate
0.000000 0.000000 m /zero glyphshow
6.362305 0.000000 m /period glyphshow
9.541016 0.000000 m /eight glyphshow
15.903320 0.000000 m /five glyphshow
22.265625 0.000000 m /five glyphshow
grestore
gsave
/o {
gsave
newpath
translate
0.8 setlinewidth
1 setlinejoin
0 setlinecap
0 0 m
-3.5 0 l

gsave
0.000 setgray
fill
grestore
stroke
grestore
} bind def
426.7 179.038 o
grestore
gsave
391.075000 175.240867 translate
0.000000 rotate
0.000000 0.000000 m /zero glyphshow
6.362305 0.000000 m /period glyphshow
9.541016 0.000000 m /eight glyphshow
15.903320 0.000000 m /six glyphshow
22.265625 0.000000 m /zero glyphshow
grestore
gsave
/o {
gsave
newpath
translate
0.8 setlinewidth
1 setlinejoin
0 setlinecap
0 0 m
-3.5 0 l

gsave
0.000 setgray
fill
grestore
stroke
grestore
} bind def
426.7 209.593 o
grestore
gsave
391.075000 205.796578 translate
0.000000 rotate
0.000000 0.000000 m /zero glyphshow
6.362305 0.000000 m /period glyphshow
9.541016 0.000000 m /eight glyphshow
15.903320 0.000000 m /six glyphshow
22.265625 0.000000 m /five glyphshow
grestore
gsave
/o {
gsave
newpath
translate
0.8 setlinewidth
1 setlinejoin
0 setlinecap
0 0 m
-3.5 0 l

gsave
0.000 setgray
fill
grestore
stroke
grestore
} bind def
426.7 240.149 o
grestore
gsave
391.075000 236.352289 translate
0.000000 rotate
0.000000 0.000000 m /zero glyphshow
6.362305 0.000000 m /period glyphshow
9.541016 0.000000 m /eight glyphshow
15.903320 0.000000 m /seven glyphshow
22.265625 0.000000 m /zero glyphshow
grestore
1.500 setlinewidth
2 setlinecap
0.122 0.467 0.706 setrgbcolor
gsave
330.6 238.8 426.7 27.8 clipbox
441.727273 85.335633 m
447 103.256464 l
452.272727 112.18689 l
457.545455 122.489612 l
462.818182 129.375173 l
468.090909 136.038788 l
473.363636 141.657694 l
478.636364 146.897362 l
483.909091 152.722542 l
489.181818 157.426625 l
494.454545 160.212653 l
499.727273 163.070556 l
505 167.851151 l
510.272727 170.411745 l
515.545455 174.501228 l
520.818182 176.827895 l
526.090909 181.270523 l
531.363636 182.690081 l
536.636364 185.719962 l
541.909091 186.865511 l
547.181818 188.248105 l
552.454545 191.516425 l
557.727273 195.093708 l
563 195.977803 l
568.272727 200.407959 l
573.545455 202.48466 l
578.818182 204.480335 l
584.090909 206.071952 l
589.363636 206.970201 l
594.636364 209.715449 l
599.909091 211.809421 l
605.181818 213.684276 l
610.454545 214.347655 l
615.727273 216.277608 l
621 219.3287 l
626.272727 221.14653 l
631.545455 223.279025 l
636.818182 223.84062 l
642.090909 224.578501 l
647.363636 226.760062 l
652.636364 229.529925 l
657.909091 231.873987 l
663.181818 233.386959 l
668.454545 234.858085 l
673.727273 236.779012 l
679 238.395613 l
684.272727 240.09045 l
689.545455 241.078955 l
694.818182 240.780044 l
700.090909 242.536378 l
705.363636 243.409683 l
710.636364 247.676026 l
715.909091 247.787041 l
721.181818 250.092293 l
726.454545 251.018234 l
731.727273 252.599225 l
737 255.000394 l
742.272727 255.745455 l
stroke
grestore
1.000 0.498 0.055 setrgbcolor
gsave
330.6 238.8 426.7 27.8 clipbox
441.727273 38.654545 m
447 53.588011 l
452.272727 58.903032 l
457.545455 63.839095 l
462.818182 69.176224 l
468.090909 73.513814 l
473.363636 78.091686 l
478.636364 80.066424 l
483.909091 84.862024 l
489.181818 88.137101 l
494.454545 86.418054 l
499.727273 86.427433 l
505 88.629278 l
510.272727 89.884731 l
515.545455 87.829825 l
520.818182 89.748512 l
526.090909 91.22415 l
531.363636 91.114727 l
536.636364 93.245336 l
541.909091 91.84339 l
547.181818 92.985625 l
552.454545 92.024496 l
557.727273 93.595041 l
563 93.289998 l
568.272727 94.338889 l
573.545455 92.145977 l
578.818182 93.825497 l
584.090909 95.468842 l
589.363636 93.712725 l
594.636364 97.2062 l
599.909091 93.557301 l
605.181818 94.609542 l
610.454545 93.114699 l
615.727273 94.828163 l
621 92.54146 l
626.272727 93.564447 l
631.545455 94.471536 l
636.818182 94.890913 l
642.090909 91.402798 l
647.363636 93.061551 l
652.636364 93.055522 l
657.909091 96.530238 l
663.181818 95.631189 l
668.454545 95.35674 l
673.727273 94.490294 l
679 93.366594 l
684.272727 93.918618 l
689.545455 93.364584 l
694.818182 94.088111 l
700.090909 92.791792 l
705.363636 91.932492 l
710.636364 95.414801 l
715.909091 91.909714 l
721.181818 95.15308 l
726.454545 92.334898 l
731.727273 93.96663 l
737 94.601949 l
742.272727 94.813648 l
stroke
grestore
0.800 setlinewidth
0 setlinejoin
[] 0 setdash
0.000 setgray
gsave
426.7 27.8 m
426.7 266.6 l
stroke
grestore
gsave
757.3 27.8 m
757.3 266.6 l
stroke
grestore
gsave
426.7 27.8 m
757.3 27.8 l
stroke
grestore
gsave
426.7 266.6 m
757.3 266.6 l
stroke
grestore
/DejaVuSans findfont
12.000 scalefont
setfont
gsave
559.289062 272.600000 translate
0.000000 rotate
0.000000 0.000000 m /zero glyphshow
7.634766 0.000000 m /period glyphshow
11.449219 0.000000 m /six glyphshow
19.083984 0.000000 m /space glyphshow
22.898438 0.000000 m /hyphen glyphshow
27.228516 0.000000 m /space glyphshow
31.042969 0.000000 m /zero glyphshow
38.677734 0.000000 m /period glyphshow
42.492188 0.000000 m /eight glyphshow
50.126953 0.000000 m /four glyphshow
57.761719 0.000000 m /seven glyphshow
grestore
1.000 setlinewidth
0 setlinecap
0.800 setgray
gsave
433.7 229.25625 m
499.215625 229.25625 l
500.548958 229.25625 501.215625 229.922917 501.215625 231.25625 c
501.215625 259.6 l
501.215625 260.933333 500.548958 261.6 499.215625 261.6 c
433.7 261.6 l
432.366667 261.6 431.7 260.933333 431.7 259.6 c
431.7 231.25625 l
431.7 229.922917 432.366667 229.25625 433.7 229.25625 c
cl
gsave
1.000 setgray
fill
grestore
stroke
grestore
1.500 setlinewidth
1 setlinejoin
2 setlinecap
[] 0 setdash
0.122 0.467 0.706 setrgbcolor
gsave
435.7 253.50625 m
455.7 253.50625 l
stroke
grestore
0.000 setgray
/DejaVuSans findfont
10.000 scalefont
setfont
gsave
463.700000 250.006250 translate
0.000000 rotate
0.000000 0.000000 m /a glyphshow
6.127930 0.000000 m /u glyphshow
12.465820 0.000000 m /c glyphshow
grestore
1.000 0.498 0.055 setrgbcolor
gsave
435.7 238.834375 m
455.7 238.834375 l
stroke
grestore
0.000 setgray
gsave
463.700000 235.334375 translate
0.000000 rotate
0.000000 0.000000 m /v glyphshow
5.917969 0.000000 m /a glyphshow
12.045898 0.000000 m /l glyphshow
14.824219 0.000000 m /A glyphshow
21.665039 0.000000 m /u glyphshow
28.002930 0.000000 m /c glyphshow
grestore
gsave
807.1 27.8 m
1137.7 27.8 l
1137.7 266.6 l
807.1 266.6 l
cl
1.000 setgray
fill
grestore
0.800 setlinewidth
0 setlinecap
gsave
/o {
gsave
newpath
translate
0.8 setlinewidth
1 setlinejoin
0 setlinecap
0 0 m
0 -3.5 l

gsave
0.000 setgray
fill
grestore
stroke
grestore
} bind def
811.582 27.8 o
grestore
gsave
808.402131 13.206250 translate
0.000000 rotate
0.000000 0.000000 m /zero glyphshow
grestore
gsave
/o {
gsave
newpath
translate
0.8 setlinewidth
1 setlinejoin
0 setlinecap
0 0 m
0 -3.5 l

gsave
0.000 setgray
fill
grestore
stroke
grestore
} bind def
864.309 27.8 o
grestore
gsave
857.949716 13.206250 translate
0.000000 rotate
0.000000 0.000000 m /one glyphshow
6.362305 0.000000 m /zero glyphshow
grestore
gsave
/o {
gsave
newpath
translate
0.8 setlinewidth
1 setlinejoin
0 setlinecap
0 0 m
0 -3.5 l

gsave
0.000 setgray
fill
grestore
stroke
grestore
} bind def
917.036 27.8 o
grestore
gsave
910.676989 13.206250 translate
0.000000 rotate
0.000000 0.000000 m /two glyphshow
6.362305 0.000000 m /zero glyphshow
grestore
gsave
/o {
gsave
newpath
translate
0.8 setlinewidth
1 setlinejoin
0 setlinecap
0 0 m
0 -3.5 l

gsave
0.000 setgray
fill
grestore
stroke
grestore
} bind def
969.764 27.8 o
grestore
gsave
963.404261 13.206250 translate
0.000000 rotate
0.000000 0.000000 m /three glyphshow
6.362305 0.000000 m /zero glyphshow
grestore
gsave
/o {
gsave
newpath
translate
0.8 setlinewidth
1 setlinejoin
0 setlinecap
0 0 m
0 -3.5 l

gsave
0.000 setgray
fill
grestore
stroke
grestore
} bind def
1022.49 27.8 o
grestore
gsave
1016.131534 13.206250 translate
0.000000 rotate
0.000000 0.000000 m /four glyphshow
6.362305 0.000000 m /zero glyphshow
grestore
gsave
/o {
gsave
newpath
translate
0.8 setlinewidth
1 setlinejoin
0 setlinecap
0 0 m
0 -3.5 l

gsave
0.000 setgray
fill
grestore
stroke
grestore
} bind def
1075.22 27.8 o
grestore
gsave
1068.858807 13.206250 translate
0.000000 rotate
0.000000 0.000000 m /five glyphshow
6.362305 0.000000 m /zero glyphshow
grestore
gsave
/o {
gsave
newpath
translate
0.8 setlinewidth
1 setlinejoin
0 setlinecap
0 0 m
0 -3.5 l

gsave
0.000 setgray
fill
grestore
stroke
grestore
} bind def
1127.95 27.8 o
grestore
gsave
1121.586080 13.206250 translate
0.000000 rotate
0.000000 0.000000 m /six glyphshow
6.362305 0.000000 m /zero glyphshow
grestore
gsave
/o {
gsave
newpath
translate
0.8 setlinewidth
1 setlinejoin
0 setlinecap
0 0 m
-3.5 0 l

gsave
0.000 setgray
fill
grestore
stroke
grestore
} bind def
807.1 44.8435 o
grestore
gsave
771.475000 41.046583 translate
0.000000 rotate
0.000000 0.000000 m /zero glyphshow
6.362305 0.000000 m /period glyphshow
9.541016 0.000000 m /eight glyphshow
15.903320 0.000000 m /three glyphshow
22.265625 0.000000 m /five glyphshow
grestore
gsave
/o {
gsave
newpath
translate
0.8 setlinewidth
1 setlinejoin
0 setlinecap
0 0 m
-3.5 0 l

gsave
0.000 setgray
fill
grestore
stroke
grestore
} bind def
807.1 74.9318 o
grestore
gsave
771.475000 71.134962 translate
0.000000 rotate
0.000000 0.000000 m /zero glyphshow
6.362305 0.000000 m /period glyphshow
9.541016 0.000000 m /eight glyphshow
15.903320 0.000000 m /four glyphshow
22.265625 0.000000 m /zero glyphshow
grestore
gsave
/o {
gsave
newpath
translate
0.8 setlinewidth
1 setlinejoin
0 setlinecap
0 0 m
-3.5 0 l

gsave
0.000 setgray
fill
grestore
stroke
grestore
} bind def
807.1 105.02 o
grestore
gsave
771.475000 101.223341 translate
0.000000 rotate
0.000000 0.000000 m /zero glyphshow
6.362305 0.000000 m /period glyphshow
9.541016 0.000000 m /eight glyphshow
15.903320 0.000000 m /four glyphshow
22.265625 0.000000 m /five glyphshow
grestore
gsave
/o {
gsave
newpath
translate
0.8 setlinewidth
1 setlinejoin
0 setlinecap
0 0 m
-3.5 0 l

gsave
0.000 setgray
fill
grestore
stroke
grestore
} bind def
807.1 135.109 o
grestore
gsave
771.475000 131.311720 translate
0.000000 rotate
0.000000 0.000000 m /zero glyphshow
6.362305 0.000000 m /period glyphshow
9.541016 0.000000 m /eight glyphshow
15.903320 0.000000 m /five glyphshow
22.265625 0.000000 m /zero glyphshow
grestore
gsave
/o {
gsave
newpath
translate
0.8 setlinewidth
1 setlinejoin
0 setlinecap
0 0 m
-3.5 0 l

gsave
0.000 setgray
fill
grestore
stroke
grestore
} bind def
807.1 165.197 o
grestore
gsave
771.475000 161.400099 translate
0.000000 rotate
0.000000 0.000000 m /zero glyphshow
6.362305 0.000000 m /period glyphshow
9.541016 0.000000 m /eight glyphshow
15.903320 0.000000 m /five glyphshow
22.265625 0.000000 m /five glyphshow
grestore
gsave
/o {
gsave
newpath
translate
0.8 setlinewidth
1 setlinejoin
0 setlinecap
0 0 m
-3.5 0 l

gsave
0.000 setgray
fill
grestore
stroke
grestore
} bind def
807.1 195.285 o
grestore
gsave
771.475000 191.488478 translate
0.000000 rotate
0.000000 0.000000 m /zero glyphshow
6.362305 0.000000 m /period glyphshow
9.541016 0.000000 m /eight glyphshow
15.903320 0.000000 m /six glyphshow
22.265625 0.000000 m /zero glyphshow
grestore
gsave
/o {
gsave
newpath
translate
0.8 setlinewidth
1 setlinejoin
0 setlinecap
0 0 m
-3.5 0 l

gsave
0.000 setgray
fill
grestore
stroke
grestore
} bind def
807.1 225.374 o
grestore
gsave
771.475000 221.576857 translate
0.000000 rotate
0.000000 0.000000 m /zero glyphshow
6.362305 0.000000 m /period glyphshow
9.541016 0.000000 m /eight glyphshow
15.903320 0.000000 m /six glyphshow
22.265625 0.000000 m /five glyphshow
grestore
gsave
/o {
gsave
newpath
translate
0.8 setlinewidth
1 setlinejoin
0 setlinecap
0 0 m
-3.5 0 l

gsave
0.000 setgray
fill
grestore
stroke
grestore
} bind def
807.1 255.462 o
grestore
gsave
771.475000 251.665236 translate
0.000000 rotate
0.000000 0.000000 m /zero glyphshow
6.362305 0.000000 m /period glyphshow
9.541016 0.000000 m /eight glyphshow
15.903320 0.000000 m /seven glyphshow
22.265625 0.000000 m /zero glyphshow
grestore
1.500 setlinewidth
2 setlinecap
0.122 0.467 0.706 setrgbcolor
gsave
330.6 238.8 807.1 27.8 clipbox
822.127273 85.250893 m
827.4 101.446787 l
832.672727 112.841076 l
837.945455 124.520412 l
843.218182 131.549837 l
848.490909 138.257048 l
853.763636 142.383242 l
859.036364 147.129382 l
864.309091 151.252223 l
869.581818 157.042605 l
874.854545 159.265052 l
880.127273 162.551658 l
885.4 166.179383 l
890.672727 170.134371 l
895.945455 173.749573 l
901.218182 176.447502 l
906.490909 176.730408 l
911.763636 182.227502 l
917.036364 185.558909 l
922.309091 187.937089 l
927.581818 188.61246 l
932.854545 191.896804 l
938.127273 192.99611 l
943.4 196.837176 l
948.672727 199.337438 l
953.945455 201.286674 l
959.218182 202.566558 l
964.490909 204.880343 l
969.763636 207.954336 l
975.036364 210.304156 l
980.309091 212.445605 l
985.581818 214.630441 l
990.854545 216.139785 l
996.127273 217.755415 l
1001.4 220.462191 l
1006.672727 220.739764 l
1011.945455 222.763736 l
1017.218182 226.289861 l
1022.490909 227.509794 l
1027.763636 229.682996 l
1033.036364 231.441029 l
1038.309091 233.211868 l
1043.581818 232.935223 l
1048.854545 236.890373 l
1054.127273 238.617986 l
1059.4 239.169942 l
1064.672727 241.552323 l
1069.945455 243.431186 l
1075.218182 244.279904 l
1080.490909 245.592187 l
1085.763636 246.548808 l
1091.036364 248.576617 l
1096.309091 250.043624 l
1101.581818 251.372066 l
1106.854545 252.703336 l
1112.127273 254.826929 l
1117.4 253.394058 l
1122.672727 255.745455 l
stroke
grestore
1.000 0.498 0.055 setrgbcolor
gsave
330.6 238.8 807.1 27.8 clipbox
822.127273 38.654545 m
827.4 53.580827 l
832.672727 61.742685 l
837.945455 73.712913 l
843.218182 75.645794 l
848.490909 82.198457 l
853.763636 82.889589 l
859.036364 86.111496 l
864.309091 86.79691 l
869.581818 88.425236 l
874.854545 91.141824 l
880.127273 91.232861 l
885.4 92.797637 l
890.672727 95.235837 l
895.945455 97.361126 l
901.218182 97.770352 l
906.490909 95.260465 l
911.763636 98.913808 l
917.036364 100.264406 l
922.309091 102.277768 l
927.581818 100.796992 l
932.854545 102.072826 l
938.127273 101.195003 l
943.4 103.144156 l
948.672727 105.300231 l
953.945455 105.892849 l
959.218182 105.336074 l
964.490909 103.150753 l
969.763636 104.317078 l
975.036364 103.210565 l
980.309091 104.401078 l
985.581818 105.781142 l
990.854545 105.966514 l
996.127273 103.911591 l
1001.4 106.891834 l
1006.672727 105.644807 l
1011.945455 105.801812 l
1017.218182 105.478126 l
1022.490909 104.474524 l
1027.763636 105.024262 l
1033.036364 105.00799 l
1038.309091 105.510231 l
1043.581818 103.861015 l
1048.854545 105.80709 l
1054.127273 106.384975 l
1059.4 105.248995 l
1064.672727 105.410179 l
1069.945455 105.277582 l
1075.218182 105.732545 l
1080.490909 105.34465 l
1085.763636 105.419194 l
1091.036364 106.378158 l
1096.309091 103.078188 l
1101.581818 104.614377 l
1106.854545 105.654922 l
1112.127273 104.520702 l
1117.4 103.422544 l
1122.672727 104.222084 l
stroke
grestore
0.800 setlinewidth
0 setlinejoin
[] 0 setdash
0.000 setgray
gsave
807.1 27.8 m
807.1 266.6 l
stroke
grestore
gsave
1137.7 27.8 m
1137.7 266.6 l
stroke
grestore
gsave
807.1 27.8 m
1137.7 27.8 l
stroke
grestore
gsave
807.1 266.6 m
1137.7 266.6 l
stroke
grestore
/DejaVuSans findfont
12.000 scalefont
setfont
gsave
939.689063 272.600000 translate
0.000000 rotate
0.000000 0.000000 m /zero glyphshow
7.634766 0.000000 m /period glyphshow
11.449219 0.000000 m /eight glyphshow
19.083984 0.000000 m /space glyphshow
22.898438 0.000000 m /hyphen glyphshow
27.228516 0.000000 m /space glyphshow
31.042969 0.000000 m /zero glyphshow
38.677734 0.000000 m /period glyphshow
42.492188 0.000000 m /eight glyphshow
50.126953 0.000000 m /four glyphshow
57.761719 0.000000 m /five glyphshow
grestore
1.000 setlinewidth
0 setlinecap
0.800 setgray
gsave
814.1 229.25625 m
879.615625 229.25625 l
880.948958 229.25625 881.615625 229.922917 881.615625 231.25625 c
881.615625 259.6 l
881.615625 260.933333 880.948958 261.6 879.615625 261.6 c
814.1 261.6 l
812.766667 261.6 812.1 260.933333 812.1 259.6 c
812.1 231.25625 l
812.1 229.922917 812.766667 229.25625 814.1 229.25625 c
cl
gsave
1.000 setgray
fill
grestore
stroke
grestore
1.500 setlinewidth
1 setlinejoin
2 setlinecap
[] 0 setdash
0.122 0.467 0.706 setrgbcolor
gsave
816.1 253.50625 m
836.1 253.50625 l
stroke
grestore
0.000 setgray
/DejaVuSans findfont
10.000 scalefont
setfont
gsave
844.100000 250.006250 translate
0.000000 rotate
0.000000 0.000000 m /a glyphshow
6.127930 0.000000 m /u glyphshow
12.465820 0.000000 m /c glyphshow
grestore
1.000 0.498 0.055 setrgbcolor
gsave
816.1 238.834375 m
836.1 238.834375 l
stroke
grestore
0.000 setgray
gsave
844.100000 235.334375 translate
0.000000 rotate
0.000000 0.000000 m /v glyphshow
5.917969 0.000000 m /a glyphshow
12.045898 0.000000 m /l glyphshow
14.824219 0.000000 m /A glyphshow
21.665039 0.000000 m /u glyphshow
28.002930 0.000000 m /c glyphshow
grestore

end
showpage
