%!PS-Adobe-3.0 EPSF-3.0
%%Title: imgNets/reguRate.eps
%%Creator: matplotlib version 2.0.2, http://matplotlib.org/
%%CreationDate: Fri Apr 20 15:43:59 2018
%%Orientation: portrait
%%BoundingBox: -270 108 882 684
%%EndComments
%%BeginProlog
/mpldict 8 dict def
mpldict begin
/m { moveto } bind def
/l { lineto } bind def
/r { rlineto } bind def
/c { curveto } bind def
/cl { closepath } bind def
/box {
m
1 index 0 r
0 exch r
neg 0 r
cl
} bind def
/clipbox {
box
clip
newpath
} bind def
%!PS-Adobe-3.0 Resource-Font
%%Title: DejaVu Sans
%%Copyright: Copyright (c) 2003 by Bitstream, Inc. All Rights Reserved. Copyright (c) 2006 by Tavmjong Bah. All Rights Reserved. DejaVu changes are in public domain 
%%Creator: Converted from TrueType to type 3 by PPR
25 dict begin
/_d{bind def}bind def
/_m{moveto}_d
/_l{lineto}_d
/_cl{closepath eofill}_d
/_c{curveto}_d
/_sc{7 -1 roll{setcachedevice}{pop pop pop pop pop pop}ifelse}_d
/_e{exec}_d
/FontName /DejaVuSans def
/PaintType 0 def
/FontMatrix[.001 0 0 .001 0 0]def
/FontBBox[-1021 -463 1793 1232]def
/FontType 3 def
/Encoding [ /space /hyphen /period /zero /one /two /three /four /five /six /seven /eight /A /a /c /l /u /v ] def
/FontInfo 10 dict dup begin
/FamilyName (DejaVu Sans) def
/FullName (DejaVu Sans) def
/Notice (Copyright (c) 2003 by Bitstream, Inc. All Rights Reserved. Copyright (c) 2006 by Tavmjong Bah. All Rights Reserved. DejaVu changes are in public domain ) def
/Weight (Book) def
/Version (Version 2.35) def
/ItalicAngle 0.0 def
/isFixedPitch false def
/UnderlinePosition -130 def
/UnderlineThickness 90 def
end readonly def
/CharStrings 18 dict dup begin
/space{318 0 0 0 0 0 _sc
}_d
/hyphen{361 0 49 234 312 314 _sc
49 314 _m
312 314 _l
312 234 _l
49 234 _l
49 314 _l
_cl}_d
/period{318 0 107 0 210 124 _sc
107 124 _m
210 124 _l
210 0 _l
107 0 _l
107 124 _l
_cl}_d
/zero{636 0 66 -13 570 742 _sc
318 664 _m
267 664 229 639 203 589 _c
177 539 165 464 165 364 _c
165 264 177 189 203 139 _c
229 89 267 64 318 64 _c
369 64 407 89 433 139 _c
458 189 471 264 471 364 _c
471 464 458 539 433 589 _c
407 639 369 664 318 664 _c
318 742 _m
399 742 461 709 505 645 _c
548 580 570 486 570 364 _c
570 241 548 147 505 83 _c
461 19 399 -13 318 -13 _c
236 -13 173 19 130 83 _c
87 147 66 241 66 364 _c
66 486 87 580 130 645 _c
173 709 236 742 318 742 _c
_cl}_d
/one{636 0 110 0 544 729 _sc
124 83 _m
285 83 _l
285 639 _l
110 604 _l
110 694 _l
284 729 _l
383 729 _l
383 83 _l
544 83 _l
544 0 _l
124 0 _l
124 83 _l
_cl}_d
/two{{636 0 73 0 536 742 _sc
192 83 _m
536 83 _l
536 0 _l
73 0 _l
73 83 _l
110 121 161 173 226 239 _c
290 304 331 346 348 365 _c
380 400 402 430 414 455 _c
426 479 433 504 433 528 _c
433 566 419 598 392 622 _c
365 646 330 659 286 659 _c
255 659 222 653 188 643 _c
154 632 117 616 78 594 _c
78 694 _l
118 710 155 722 189 730 _c
223 738 255 742 284 742 _c
}_e{359 742 419 723 464 685 _c
509 647 532 597 532 534 _c
532 504 526 475 515 449 _c
504 422 484 390 454 354 _c
446 344 420 317 376 272 _c
332 227 271 164 192 83 _c
_cl}_e}_d
/three{{636 0 76 -13 556 742 _sc
406 393 _m
453 383 490 362 516 330 _c
542 298 556 258 556 212 _c
556 140 531 84 482 45 _c
432 6 362 -13 271 -13 _c
240 -13 208 -10 176 -4 _c
144 1 110 10 76 22 _c
76 117 _l
103 101 133 89 166 81 _c
198 73 232 69 268 69 _c
330 69 377 81 409 105 _c
441 129 458 165 458 212 _c
458 254 443 288 413 312 _c
383 336 341 349 287 349 _c
}_e{202 349 _l
202 430 _l
291 430 _l
339 430 376 439 402 459 _c
428 478 441 506 441 543 _c
441 580 427 609 401 629 _c
374 649 336 659 287 659 _c
260 659 231 656 200 650 _c
169 644 135 635 98 623 _c
98 711 _l
135 721 170 729 203 734 _c
235 739 266 742 296 742 _c
370 742 429 725 473 691 _c
517 657 539 611 539 553 _c
539 513 527 479 504 451 _c
481 423 448 403 406 393 _c
_cl}_e}_d
/four{636 0 49 0 580 729 _sc
378 643 _m
129 254 _l
378 254 _l
378 643 _l
352 729 _m
476 729 _l
476 254 _l
580 254 _l
580 172 _l
476 172 _l
476 0 _l
378 0 _l
378 172 _l
49 172 _l
49 267 _l
352 729 _l
_cl}_d
/five{{636 0 77 -13 549 729 _sc
108 729 _m
495 729 _l
495 646 _l
198 646 _l
198 467 _l
212 472 227 476 241 478 _c
255 480 270 482 284 482 _c
365 482 429 459 477 415 _c
525 370 549 310 549 234 _c
549 155 524 94 475 51 _c
426 8 357 -13 269 -13 _c
238 -13 207 -10 175 -6 _c
143 -1 111 6 77 17 _c
77 116 _l
106 100 136 88 168 80 _c
199 72 232 69 267 69 _c
}_e{323 69 368 83 401 113 _c
433 143 450 183 450 234 _c
450 284 433 324 401 354 _c
368 384 323 399 267 399 _c
241 399 214 396 188 390 _c
162 384 135 375 108 363 _c
108 729 _l
_cl}_e}_d
/six{{636 0 70 -13 573 742 _sc
330 404 _m
286 404 251 388 225 358 _c
199 328 186 286 186 234 _c
186 181 199 139 225 109 _c
251 79 286 64 330 64 _c
374 64 409 79 435 109 _c
461 139 474 181 474 234 _c
474 286 461 328 435 358 _c
409 388 374 404 330 404 _c
526 713 _m
526 623 _l
501 635 476 644 451 650 _c
425 656 400 659 376 659 _c
310 659 260 637 226 593 _c
}_e{192 549 172 482 168 394 _c
187 422 211 444 240 459 _c
269 474 301 482 336 482 _c
409 482 467 459 509 415 _c
551 371 573 310 573 234 _c
573 159 550 99 506 54 _c
462 9 403 -13 330 -13 _c
246 -13 181 19 137 83 _c
92 147 70 241 70 364 _c
70 479 97 571 152 639 _c
206 707 280 742 372 742 _c
396 742 421 739 447 735 _c
472 730 498 723 526 713 _c
_cl}_e}_d
/seven{636 0 82 0 551 729 _sc
82 729 _m
551 729 _l
551 687 _l
286 0 _l
183 0 _l
432 646 _l
82 646 _l
82 729 _l
_cl}_d
/eight{{636 0 68 -13 568 742 _sc
318 346 _m
271 346 234 333 207 308 _c
180 283 167 249 167 205 _c
167 161 180 126 207 101 _c
234 76 271 64 318 64 _c
364 64 401 76 428 102 _c
455 127 469 161 469 205 _c
469 249 455 283 429 308 _c
402 333 365 346 318 346 _c
219 388 _m
177 398 144 418 120 447 _c
96 476 85 511 85 553 _c
85 611 105 657 147 691 _c
188 725 245 742 318 742 _c
}_e{390 742 447 725 489 691 _c
530 657 551 611 551 553 _c
551 511 539 476 515 447 _c
491 418 459 398 417 388 _c
464 377 501 355 528 323 _c
554 291 568 251 568 205 _c
568 134 546 80 503 43 _c
459 5 398 -13 318 -13 _c
237 -13 175 5 132 43 _c
89 80 68 134 68 205 _c
68 251 81 291 108 323 _c
134 355 171 377 219 388 _c
183 544 _m
183 506 194 476 218 455 _c
}_e{242 434 275 424 318 424 _c
360 424 393 434 417 455 _c
441 476 453 506 453 544 _c
453 582 441 611 417 632 _c
393 653 360 664 318 664 _c
275 664 242 653 218 632 _c
194 611 183 582 183 544 _c
_cl}_e}_d
/A{684 0 8 0 676 729 _sc
342 632 _m
208 269 _l
476 269 _l
342 632 _l
286 729 _m
398 729 _l
676 0 _l
573 0 _l
507 187 _l
178 187 _l
112 0 _l
8 0 _l
286 729 _l
_cl}_d
/a{{613 0 60 -13 522 560 _sc
343 275 _m
270 275 220 266 192 250 _c
164 233 150 205 150 165 _c
150 133 160 107 181 89 _c
202 70 231 61 267 61 _c
317 61 357 78 387 114 _c
417 149 432 196 432 255 _c
432 275 _l
343 275 _l
522 312 _m
522 0 _l
432 0 _l
432 83 _l
411 49 385 25 355 10 _c
325 -5 287 -13 243 -13 _c
187 -13 142 2 109 33 _c
76 64 60 106 60 159 _c
}_e{60 220 80 266 122 298 _c
163 329 224 345 306 345 _c
432 345 _l
432 354 _l
432 395 418 427 391 450 _c
364 472 326 484 277 484 _c
245 484 215 480 185 472 _c
155 464 127 453 100 439 _c
100 522 _l
132 534 164 544 195 550 _c
226 556 256 560 286 560 _c
365 560 424 539 463 498 _c
502 457 522 395 522 312 _c
_cl}_e}_d
/c{{550 0 55 -13 488 560 _sc
488 526 _m
488 442 _l
462 456 437 466 411 473 _c
385 480 360 484 334 484 _c
276 484 230 465 198 428 _c
166 391 150 339 150 273 _c
150 206 166 154 198 117 _c
230 80 276 62 334 62 _c
360 62 385 65 411 72 _c
437 79 462 90 488 104 _c
488 21 _l
462 9 436 0 410 -5 _c
383 -10 354 -13 324 -13 _c
242 -13 176 12 128 64 _c
}_e{79 115 55 185 55 273 _c
55 362 79 432 128 483 _c
177 534 244 560 330 560 _c
358 560 385 557 411 551 _c
437 545 463 537 488 526 _c
_cl}_e}_d
/l{278 0 94 0 184 760 _sc
94 760 _m
184 760 _l
184 0 _l
94 0 _l
94 760 _l
_cl}_d
/u{634 0 85 -13 543 560 _sc
85 216 _m
85 547 _l
175 547 _l
175 219 _l
175 167 185 129 205 103 _c
225 77 255 64 296 64 _c
344 64 383 79 411 110 _c
439 141 453 183 453 237 _c
453 547 _l
543 547 _l
543 0 _l
453 0 _l
453 84 _l
431 50 405 26 377 10 _c
348 -5 315 -13 277 -13 _c
214 -13 166 6 134 45 _c
101 83 85 140 85 216 _c
311 560 _m
311 560 _l
_cl}_d
/v{592 0 30 0 562 547 _sc
30 547 _m
125 547 _l
296 88 _l
467 547 _l
562 547 _l
357 0 _l
235 0 _l
30 547 _l
_cl}_d
end readonly def

/BuildGlyph
 {exch begin
 CharStrings exch
 2 copy known not{pop /.notdef}if
 true 3 1 roll get exec
 end}_d

/BuildChar {
 1 index /Encoding get exch get
 1 index /BuildGlyph get exec
}_d

FontName currentdict end definefont pop
end
%%EndProlog
mpldict begin
-270 108 translate
1152 576 0 0 clipbox
gsave
0 0 m
1152 0 l
1152 576 l
0 576 l
cl
1.000 setgray
fill
grestore
gsave
46.3 310.4 m
376.9 310.4 l
376.9 549.2 l
46.3 549.2 l
cl
1.000 setgray
fill
grestore
0.800 setlinewidth
1 setlinejoin
0 setlinecap
[] 0 setdash
0.000 setgray
gsave
/o {
gsave
newpath
translate
0.8 setlinewidth
1 setlinejoin
0 setlinecap
0 0 m
0 -3.5 l

gsave
0.000 setgray
fill
grestore
stroke
grestore
} bind def
50.7818 310.4 o
grestore
/DejaVuSans findfont
10.000 scalefont
setfont
gsave
47.602131 295.806250 translate
0.000000 rotate
0.000000 0.000000 m /zero glyphshow
grestore
gsave
/o {
gsave
newpath
translate
0.8 setlinewidth
1 setlinejoin
0 setlinecap
0 0 m
0 -3.5 l

gsave
0.000 setgray
fill
grestore
stroke
grestore
} bind def
103.509 310.4 o
grestore
gsave
97.149716 295.806250 translate
0.000000 rotate
0.000000 0.000000 m /one glyphshow
6.362305 0.000000 m /zero glyphshow
grestore
gsave
/o {
gsave
newpath
translate
0.8 setlinewidth
1 setlinejoin
0 setlinecap
0 0 m
0 -3.5 l

gsave
0.000 setgray
fill
grestore
stroke
grestore
} bind def
156.236 310.4 o
grestore
gsave
149.876989 295.806250 translate
0.000000 rotate
0.000000 0.000000 m /two glyphshow
6.362305 0.000000 m /zero glyphshow
grestore
gsave
/o {
gsave
newpath
translate
0.8 setlinewidth
1 setlinejoin
0 setlinecap
0 0 m
0 -3.5 l

gsave
0.000 setgray
fill
grestore
stroke
grestore
} bind def
208.964 310.4 o
grestore
gsave
202.604261 295.806250 translate
0.000000 rotate
0.000000 0.000000 m /three glyphshow
6.362305 0.000000 m /zero glyphshow
grestore
gsave
/o {
gsave
newpath
translate
0.8 setlinewidth
1 setlinejoin
0 setlinecap
0 0 m
0 -3.5 l

gsave
0.000 setgray
fill
grestore
stroke
grestore
} bind def
261.691 310.4 o
grestore
gsave
255.331534 295.806250 translate
0.000000 rotate
0.000000 0.000000 m /four glyphshow
6.362305 0.000000 m /zero glyphshow
grestore
gsave
/o {
gsave
newpath
translate
0.8 setlinewidth
1 setlinejoin
0 setlinecap
0 0 m
0 -3.5 l

gsave
0.000 setgray
fill
grestore
stroke
grestore
} bind def
314.418 310.4 o
grestore
gsave
308.058807 295.806250 translate
0.000000 rotate
0.000000 0.000000 m /five glyphshow
6.362305 0.000000 m /zero glyphshow
grestore
gsave
/o {
gsave
newpath
translate
0.8 setlinewidth
1 setlinejoin
0 setlinecap
0 0 m
0 -3.5 l

gsave
0.000 setgray
fill
grestore
stroke
grestore
} bind def
367.145 310.4 o
grestore
gsave
360.786080 295.806250 translate
0.000000 rotate
0.000000 0.000000 m /six glyphshow
6.362305 0.000000 m /zero glyphshow
grestore
gsave
/o {
gsave
newpath
translate
0.8 setlinewidth
1 setlinejoin
0 setlinecap
0 0 m
-3.5 0 l

gsave
0.000 setgray
fill
grestore
stroke
grestore
} bind def
46.3 333.157 o
grestore
gsave
17.034375 329.360497 translate
0.000000 rotate
0.000000 0.000000 m /zero glyphshow
6.362305 0.000000 m /period glyphshow
9.541016 0.000000 m /eight glyphshow
15.903320 0.000000 m /four glyphshow
grestore
gsave
/o {
gsave
newpath
translate
0.8 setlinewidth
1 setlinejoin
0 setlinecap
0 0 m
-3.5 0 l

gsave
0.000 setgray
fill
grestore
stroke
grestore
} bind def
46.3 378.887 o
grestore
gsave
17.034375 375.090215 translate
0.000000 rotate
0.000000 0.000000 m /zero glyphshow
6.362305 0.000000 m /period glyphshow
9.541016 0.000000 m /eight glyphshow
15.903320 0.000000 m /five glyphshow
grestore
gsave
/o {
gsave
newpath
translate
0.8 setlinewidth
1 setlinejoin
0 setlinecap
0 0 m
-3.5 0 l

gsave
0.000 setgray
fill
grestore
stroke
grestore
} bind def
46.3 424.617 o
grestore
gsave
17.034375 420.819933 translate
0.000000 rotate
0.000000 0.000000 m /zero glyphshow
6.362305 0.000000 m /period glyphshow
9.541016 0.000000 m /eight glyphshow
15.903320 0.000000 m /six glyphshow
grestore
gsave
/o {
gsave
newpath
translate
0.8 setlinewidth
1 setlinejoin
0 setlinecap
0 0 m
-3.5 0 l

gsave
0.000 setgray
fill
grestore
stroke
grestore
} bind def
46.3 470.347 o
grestore
gsave
17.034375 466.549650 translate
0.000000 rotate
0.000000 0.000000 m /zero glyphshow
6.362305 0.000000 m /period glyphshow
9.541016 0.000000 m /eight glyphshow
15.903320 0.000000 m /seven glyphshow
grestore
gsave
/o {
gsave
newpath
translate
0.8 setlinewidth
1 setlinejoin
0 setlinecap
0 0 m
-3.5 0 l

gsave
0.000 setgray
fill
grestore
stroke
grestore
} bind def
46.3 516.076 o
grestore
gsave
17.034375 512.279368 translate
0.000000 rotate
0.000000 0.000000 m /zero glyphshow
6.362305 0.000000 m /period glyphshow
9.541016 0.000000 m /eight glyphshow
15.903320 0.000000 m /eight glyphshow
grestore
1.500 setlinewidth
2 setlinecap
0.122 0.467 0.706 setrgbcolor
gsave
330.6 238.8 46.3 310.4 clipbox
61.327273 380.638058 m
66.6 388.897385 l
71.872727 398.189035 l
77.145455 407.039936 l
82.418182 410.042354 l
87.690909 416.384052 l
92.963636 420.240308 l
98.236364 427.342702 l
103.509091 428.231752 l
108.781818 435.274805 l
114.054545 435.406505 l
119.327273 441.613034 l
124.6 446.518161 l
129.872727 444.800384 l
135.145455 450.091584 l
140.418182 454.946272 l
145.690909 457.321043 l
150.963636 458.948871 l
156.236364 460.817534 l
161.509091 464.848592 l
166.781818 466.263489 l
172.054545 468.694686 l
177.327273 472.441898 l
182.6 474.540714 l
187.872727 475.021832 l
193.145455 480.832986 l
198.418182 483.211226 l
203.690909 482.639698 l
208.963636 486.278726 l
214.236364 489.251979 l
219.509091 490.3465 l
224.781818 493.427599 l
230.054545 495.251994 l
235.327273 495.803875 l
240.6 497.813233 l
245.872727 501.460488 l
251.145455 503.618983 l
256.418182 506.902913 l
261.690909 507.010452 l
266.963636 509.129775 l
272.236364 511.130108 l
277.509091 509.655623 l
282.781818 513.767941 l
288.054545 515.169392 l
293.327273 516.88195 l
298.6 520.739495 l
303.872727 521.791927 l
309.145455 522.983365 l
314.418182 524.863203 l
319.690909 522.322901 l
324.963636 527.256731 l
330.236364 531.076516 l
335.509091 530.150842 l
340.781818 530.489946 l
346.054545 533.502341 l
351.327273 535.075647 l
356.6 535.839751 l
361.872727 538.345455 l
stroke
grestore
1.000 0.498 0.055 setrgbcolor
gsave
330.6 238.8 46.3 310.4 clipbox
61.327273 331.530584 m
66.6 332.511483 l
71.872727 340.184548 l
77.145455 343.42285 l
82.418182 342.735886 l
87.690909 345.140341 l
92.963636 344.522559 l
98.236364 344.723083 l
103.509091 346.764087 l
108.781818 345.066982 l
114.054545 346.27581 l
119.327273 347.801466 l
124.6 348.352574 l
129.872727 342.15871 l
135.145455 345.061969 l
140.418182 347.923452 l
145.690909 346.199277 l
150.963636 348.928581 l
156.236364 347.653747 l
161.509091 347.028779 l
166.781818 345.090711 l
172.054545 340.996003 l
177.327273 342.221207 l
182.6 343.191244 l
187.872727 341.240977 l
193.145455 341.460551 l
198.418182 341.855584 l
203.690909 338.506493 l
208.963636 336.525814 l
214.236364 337.798976 l
219.509091 334.11033 l
224.781818 336.202468 l
230.054545 338.939124 l
235.327273 339.765285 l
240.6 334.018256 l
245.872727 335.572153 l
251.145455 335.745607 l
256.418182 334.338093 l
261.690909 334.157287 l
266.963636 334.143751 l
272.236364 334.725773 l
277.509091 333.010454 l
282.781818 333.988011 l
288.054545 328.030431 l
293.327273 330.811704 l
298.6 330.778284 l
303.872727 328.391041 l
309.145455 327.250726 l
314.418182 329.194475 l
319.690909 323.473013 l
324.963636 328.707535 l
330.236364 323.790343 l
335.509091 325.52655 l
340.781818 328.285766 l
346.054545 322.729569 l
351.327273 324.09514 l
356.6 321.254545 l
361.872727 322.270201 l
stroke
grestore
0.800 setlinewidth
0 setlinejoin
[] 0 setdash
0.000 setgray
gsave
46.3 310.4 m
46.3 549.2 l
stroke
grestore
gsave
376.9 310.4 m
376.9 549.2 l
stroke
grestore
gsave
46.3 310.4 m
376.9 310.4 l
stroke
grestore
gsave
46.3 549.2 m
376.9 549.2 l
stroke
grestore
/DejaVuSans findfont
12.000 scalefont
setfont
gsave
184.615625 555.200000 translate
0.000000 rotate
0.000000 0.000000 m /zero glyphshow
7.634766 0.000000 m /space glyphshow
11.449219 0.000000 m /hyphen glyphshow
15.779297 0.000000 m /space glyphshow
19.593750 0.000000 m /zero glyphshow
27.228516 0.000000 m /period glyphshow
31.042969 0.000000 m /eight glyphshow
38.677734 0.000000 m /four glyphshow
46.312500 0.000000 m /three glyphshow
grestore
1.000 setlinewidth
0 setlinecap
0.800 setgray
gsave
53.3 511.85625 m
118.815625 511.85625 l
120.148958 511.85625 120.815625 512.522917 120.815625 513.85625 c
120.815625 542.2 l
120.815625 543.533333 120.148958 544.2 118.815625 544.2 c
53.3 544.2 l
51.966667 544.2 51.3 543.533333 51.3 542.2 c
51.3 513.85625 l
51.3 512.522917 51.966667 511.85625 53.3 511.85625 c
cl
gsave
1.000 setgray
fill
grestore
stroke
grestore
1.500 setlinewidth
1 setlinejoin
2 setlinecap
[] 0 setdash
0.122 0.467 0.706 setrgbcolor
gsave
55.3 536.10625 m
75.3 536.10625 l
stroke
grestore
0.000 setgray
/DejaVuSans findfont
10.000 scalefont
setfont
gsave
83.300000 532.606250 translate
0.000000 rotate
0.000000 0.000000 m /a glyphshow
6.127930 0.000000 m /u glyphshow
12.465820 0.000000 m /c glyphshow
grestore
1.000 0.498 0.055 setrgbcolor
gsave
55.3 521.434375 m
75.3 521.434375 l
stroke
grestore
0.000 setgray
gsave
83.300000 517.934375 translate
0.000000 rotate
0.000000 0.000000 m /v glyphshow
5.917969 0.000000 m /a glyphshow
12.045898 0.000000 m /l glyphshow
14.824219 0.000000 m /A glyphshow
21.665039 0.000000 m /u glyphshow
28.002930 0.000000 m /c glyphshow
grestore
gsave
426.7 310.4 m
757.3 310.4 l
757.3 549.2 l
426.7 549.2 l
cl
1.000 setgray
fill
grestore
0.800 setlinewidth
0 setlinecap
gsave
/o {
gsave
newpath
translate
0.8 setlinewidth
1 setlinejoin
0 setlinecap
0 0 m
0 -3.5 l

gsave
0.000 setgray
fill
grestore
stroke
grestore
} bind def
431.182 310.4 o
grestore
gsave
428.002131 295.806250 translate
0.000000 rotate
0.000000 0.000000 m /zero glyphshow
grestore
gsave
/o {
gsave
newpath
translate
0.8 setlinewidth
1 setlinejoin
0 setlinecap
0 0 m
0 -3.5 l

gsave
0.000 setgray
fill
grestore
stroke
grestore
} bind def
483.909 310.4 o
grestore
gsave
477.549716 295.806250 translate
0.000000 rotate
0.000000 0.000000 m /one glyphshow
6.362305 0.000000 m /zero glyphshow
grestore
gsave
/o {
gsave
newpath
translate
0.8 setlinewidth
1 setlinejoin
0 setlinecap
0 0 m
0 -3.5 l

gsave
0.000 setgray
fill
grestore
stroke
grestore
} bind def
536.636 310.4 o
grestore
gsave
530.276989 295.806250 translate
0.000000 rotate
0.000000 0.000000 m /two glyphshow
6.362305 0.000000 m /zero glyphshow
grestore
gsave
/o {
gsave
newpath
translate
0.8 setlinewidth
1 setlinejoin
0 setlinecap
0 0 m
0 -3.5 l

gsave
0.000 setgray
fill
grestore
stroke
grestore
} bind def
589.364 310.4 o
grestore
gsave
583.004261 295.806250 translate
0.000000 rotate
0.000000 0.000000 m /three glyphshow
6.362305 0.000000 m /zero glyphshow
grestore
gsave
/o {
gsave
newpath
translate
0.8 setlinewidth
1 setlinejoin
0 setlinecap
0 0 m
0 -3.5 l

gsave
0.000 setgray
fill
grestore
stroke
grestore
} bind def
642.091 310.4 o
grestore
gsave
635.731534 295.806250 translate
0.000000 rotate
0.000000 0.000000 m /four glyphshow
6.362305 0.000000 m /zero glyphshow
grestore
gsave
/o {
gsave
newpath
translate
0.8 setlinewidth
1 setlinejoin
0 setlinecap
0 0 m
0 -3.5 l

gsave
0.000 setgray
fill
grestore
stroke
grestore
} bind def
694.818 310.4 o
grestore
gsave
688.458807 295.806250 translate
0.000000 rotate
0.000000 0.000000 m /five glyphshow
6.362305 0.000000 m /zero glyphshow
grestore
gsave
/o {
gsave
newpath
translate
0.8 setlinewidth
1 setlinejoin
0 setlinecap
0 0 m
0 -3.5 l

gsave
0.000 setgray
fill
grestore
stroke
grestore
} bind def
747.545 310.4 o
grestore
gsave
741.186080 295.806250 translate
0.000000 rotate
0.000000 0.000000 m /six glyphshow
6.362305 0.000000 m /zero glyphshow
grestore
gsave
/o {
gsave
newpath
translate
0.8 setlinewidth
1 setlinejoin
0 setlinecap
0 0 m
-3.5 0 l

gsave
0.000 setgray
fill
grestore
stroke
grestore
} bind def
426.7 333.826 o
grestore
gsave
397.434375 330.029600 translate
0.000000 rotate
0.000000 0.000000 m /zero glyphshow
6.362305 0.000000 m /period glyphshow
9.541016 0.000000 m /eight glyphshow
15.903320 0.000000 m /four glyphshow
grestore
gsave
/o {
gsave
newpath
translate
0.8 setlinewidth
1 setlinejoin
0 setlinecap
0 0 m
-3.5 0 l

gsave
0.000 setgray
fill
grestore
stroke
grestore
} bind def
426.7 384.163 o
grestore
gsave
397.434375 380.366612 translate
0.000000 rotate
0.000000 0.000000 m /zero glyphshow
6.362305 0.000000 m /period glyphshow
9.541016 0.000000 m /eight glyphshow
15.903320 0.000000 m /five glyphshow
grestore
gsave
/o {
gsave
newpath
translate
0.8 setlinewidth
1 setlinejoin
0 setlinecap
0 0 m
-3.5 0 l

gsave
0.000 setgray
fill
grestore
stroke
grestore
} bind def
426.7 434.5 o
grestore
gsave
397.434375 430.703624 translate
0.000000 rotate
0.000000 0.000000 m /zero glyphshow
6.362305 0.000000 m /period glyphshow
9.541016 0.000000 m /eight glyphshow
15.903320 0.000000 m /six glyphshow
grestore
gsave
/o {
gsave
newpath
translate
0.8 setlinewidth
1 setlinejoin
0 setlinecap
0 0 m
-3.5 0 l

gsave
0.000 setgray
fill
grestore
stroke
grestore
} bind def
426.7 484.838 o
grestore
gsave
397.434375 481.040636 translate
0.000000 rotate
0.000000 0.000000 m /zero glyphshow
6.362305 0.000000 m /period glyphshow
9.541016 0.000000 m /eight glyphshow
15.903320 0.000000 m /seven glyphshow
grestore
gsave
/o {
gsave
newpath
translate
0.8 setlinewidth
1 setlinejoin
0 setlinecap
0 0 m
-3.5 0 l

gsave
0.000 setgray
fill
grestore
stroke
grestore
} bind def
426.7 535.175 o
grestore
gsave
397.434375 531.377648 translate
0.000000 rotate
0.000000 0.000000 m /zero glyphshow
6.362305 0.000000 m /period glyphshow
9.541016 0.000000 m /eight glyphshow
15.903320 0.000000 m /eight glyphshow
grestore
1.500 setlinewidth
2 setlinecap
0.122 0.467 0.706 setrgbcolor
gsave
330.6 238.8 426.7 310.4 clipbox
441.727273 369.961469 m
447 385.465947 l
452.272727 390.976275 l
457.545455 399.862209 l
462.818182 399.818989 l
468.090909 406.252655 l
473.363636 408.770716 l
478.636364 412.821254 l
483.909091 418.415319 l
489.181818 420.52588 l
494.454545 427.137631 l
499.727273 431.213784 l
505 434.434554 l
510.272727 436.007142 l
515.545455 439.375787 l
520.818182 443.277166 l
526.090909 448.023114 l
531.363636 451.15376 l
536.636364 451.792332 l
541.909091 454.31482 l
547.181818 457.853135 l
552.454545 461.713964 l
557.727273 463.07214 l
563 461.075561 l
568.272727 468.656338 l
573.545455 471.469507 l
578.818182 472.747697 l
584.090909 478.087138 l
589.363636 480.738881 l
594.636364 480.884525 l
599.909091 483.654575 l
605.181818 487.064142 l
610.454545 489.015034 l
615.727273 491.187401 l
621 494.023548 l
626.272727 495.203369 l
631.545455 498.034752 l
636.818182 500.386521 l
642.090909 503.937509 l
647.363636 498.774936 l
652.636364 506.867733 l
657.909091 508.993433 l
663.181818 510.46086 l
668.454545 513.770402 l
673.727273 513.711333 l
679 517.472441 l
684.272727 519.802651 l
689.545455 521.457794 l
694.818182 522.163713 l
700.090909 522.396778 l
705.363636 524.061248 l
710.636364 527.016174 l
715.909091 528.388375 l
721.181818 529.393457 l
726.454545 527.66512 l
731.727273 534.105376 l
737 533.49252 l
742.272727 538.345455 l
stroke
grestore
1.000 0.498 0.055 setrgbcolor
gsave
330.6 238.8 426.7 310.4 clipbox
441.727273 323.873291 m
447 335.143996 l
452.272727 337.963419 l
457.545455 343.46983 l
462.818182 341.443554 l
468.090909 343.806439 l
473.363636 345.89967 l
478.636364 344.668564 l
483.909091 346.840153 l
489.181818 347.123787 l
494.454545 348.571942 l
499.727273 347.542249 l
505 350.256276 l
510.272727 347.387004 l
515.545455 348.056176 l
520.818182 347.852003 l
526.090909 348.919956 l
531.363636 349.436825 l
536.636364 348.566424 l
541.909091 347.576462 l
547.181818 349.507826 l
552.454545 347.215941 l
557.727273 349.228606 l
563 345.54246 l
568.272727 347.218148 l
573.545455 347.166093 l
578.818182 346.005619 l
584.090909 346.590915 l
589.363636 346.57951 l
594.636364 346.013345 l
599.909091 343.721827 l
605.181818 346.672952 l
610.454545 346.888161 l
615.727273 342.866141 l
621 340.223115 l
626.272727 340.889896 l
631.545455 340.733915 l
636.818182 339.828565 l
642.090909 341.703276 l
647.363636 338.802551 l
652.636364 341.009824 l
657.909091 337.473773 l
663.181818 338.79924 l
668.454545 338.342519 l
673.727273 335.282686 l
679 339.926789 l
684.272727 335.231551 l
689.545455 332.961371 l
694.818182 332.896256 l
700.090909 332.719858 l
705.363636 330.20559 l
710.636364 332.313168 l
715.909091 329.067005 l
721.181818 325.883749 l
726.454545 324.347855 l
731.727273 328.581037 l
737 321.254545 l
742.272727 323.064142 l
stroke
grestore
0.800 setlinewidth
0 setlinejoin
[] 0 setdash
0.000 setgray
gsave
426.7 310.4 m
426.7 549.2 l
stroke
grestore
gsave
757.3 310.4 m
757.3 549.2 l
stroke
grestore
gsave
426.7 310.4 m
757.3 310.4 l
stroke
grestore
gsave
426.7 549.2 m
757.3 549.2 l
stroke
grestore
/DejaVuSans findfont
12.000 scalefont
setfont
gsave
551.648438 555.200000 translate
0.000000 rotate
0.000000 0.000000 m /zero glyphshow
7.634766 0.000000 m /period glyphshow
11.449219 0.000000 m /zero glyphshow
19.083984 0.000000 m /zero glyphshow
26.718750 0.000000 m /one glyphshow
34.353516 0.000000 m /space glyphshow
38.167969 0.000000 m /hyphen glyphshow
42.498047 0.000000 m /space glyphshow
46.312500 0.000000 m /zero glyphshow
53.947266 0.000000 m /period glyphshow
57.761719 0.000000 m /eight glyphshow
65.396484 0.000000 m /four glyphshow
73.031250 0.000000 m /three glyphshow
grestore
1.000 setlinewidth
0 setlinecap
0.800 setgray
gsave
433.7 511.85625 m
499.215625 511.85625 l
500.548958 511.85625 501.215625 512.522917 501.215625 513.85625 c
501.215625 542.2 l
501.215625 543.533333 500.548958 544.2 499.215625 544.2 c
433.7 544.2 l
432.366667 544.2 431.7 543.533333 431.7 542.2 c
431.7 513.85625 l
431.7 512.522917 432.366667 511.85625 433.7 511.85625 c
cl
gsave
1.000 setgray
fill
grestore
stroke
grestore
1.500 setlinewidth
1 setlinejoin
2 setlinecap
[] 0 setdash
0.122 0.467 0.706 setrgbcolor
gsave
435.7 536.10625 m
455.7 536.10625 l
stroke
grestore
0.000 setgray
/DejaVuSans findfont
10.000 scalefont
setfont
gsave
463.700000 532.606250 translate
0.000000 rotate
0.000000 0.000000 m /a glyphshow
6.127930 0.000000 m /u glyphshow
12.465820 0.000000 m /c glyphshow
grestore
1.000 0.498 0.055 setrgbcolor
gsave
435.7 521.434375 m
455.7 521.434375 l
stroke
grestore
0.000 setgray
gsave
463.700000 517.934375 translate
0.000000 rotate
0.000000 0.000000 m /v glyphshow
5.917969 0.000000 m /a glyphshow
12.045898 0.000000 m /l glyphshow
14.824219 0.000000 m /A glyphshow
21.665039 0.000000 m /u glyphshow
28.002930 0.000000 m /c glyphshow
grestore
gsave
807.1 310.4 m
1137.7 310.4 l
1137.7 549.2 l
807.1 549.2 l
cl
1.000 setgray
fill
grestore
0.800 setlinewidth
0 setlinecap
gsave
/o {
gsave
newpath
translate
0.8 setlinewidth
1 setlinejoin
0 setlinecap
0 0 m
0 -3.5 l

gsave
0.000 setgray
fill
grestore
stroke
grestore
} bind def
811.582 310.4 o
grestore
gsave
808.402131 295.806250 translate
0.000000 rotate
0.000000 0.000000 m /zero glyphshow
grestore
gsave
/o {
gsave
newpath
translate
0.8 setlinewidth
1 setlinejoin
0 setlinecap
0 0 m
0 -3.5 l

gsave
0.000 setgray
fill
grestore
stroke
grestore
} bind def
864.309 310.4 o
grestore
gsave
857.949716 295.806250 translate
0.000000 rotate
0.000000 0.000000 m /one glyphshow
6.362305 0.000000 m /zero glyphshow
grestore
gsave
/o {
gsave
newpath
translate
0.8 setlinewidth
1 setlinejoin
0 setlinecap
0 0 m
0 -3.5 l

gsave
0.000 setgray
fill
grestore
stroke
grestore
} bind def
917.036 310.4 o
grestore
gsave
910.676989 295.806250 translate
0.000000 rotate
0.000000 0.000000 m /two glyphshow
6.362305 0.000000 m /zero glyphshow
grestore
gsave
/o {
gsave
newpath
translate
0.8 setlinewidth
1 setlinejoin
0 setlinecap
0 0 m
0 -3.5 l

gsave
0.000 setgray
fill
grestore
stroke
grestore
} bind def
969.764 310.4 o
grestore
gsave
963.404261 295.806250 translate
0.000000 rotate
0.000000 0.000000 m /three glyphshow
6.362305 0.000000 m /zero glyphshow
grestore
gsave
/o {
gsave
newpath
translate
0.8 setlinewidth
1 setlinejoin
0 setlinecap
0 0 m
0 -3.5 l

gsave
0.000 setgray
fill
grestore
stroke
grestore
} bind def
1022.49 310.4 o
grestore
gsave
1016.131534 295.806250 translate
0.000000 rotate
0.000000 0.000000 m /four glyphshow
6.362305 0.000000 m /zero glyphshow
grestore
gsave
/o {
gsave
newpath
translate
0.8 setlinewidth
1 setlinejoin
0 setlinecap
0 0 m
0 -3.5 l

gsave
0.000 setgray
fill
grestore
stroke
grestore
} bind def
1075.22 310.4 o
grestore
gsave
1068.858807 295.806250 translate
0.000000 rotate
0.000000 0.000000 m /five glyphshow
6.362305 0.000000 m /zero glyphshow
grestore
gsave
/o {
gsave
newpath
translate
0.8 setlinewidth
1 setlinejoin
0 setlinecap
0 0 m
0 -3.5 l

gsave
0.000 setgray
fill
grestore
stroke
grestore
} bind def
1127.95 310.4 o
grestore
gsave
1121.586080 295.806250 translate
0.000000 rotate
0.000000 0.000000 m /six glyphshow
6.362305 0.000000 m /zero glyphshow
grestore
gsave
/o {
gsave
newpath
translate
0.8 setlinewidth
1 setlinejoin
0 setlinecap
0 0 m
-3.5 0 l

gsave
0.000 setgray
fill
grestore
stroke
grestore
} bind def
807.1 328.723 o
grestore
gsave
771.475000 324.925719 translate
0.000000 rotate
0.000000 0.000000 m /zero glyphshow
6.362305 0.000000 m /period glyphshow
9.541016 0.000000 m /eight glyphshow
15.903320 0.000000 m /three glyphshow
22.265625 0.000000 m /zero glyphshow
grestore
gsave
/o {
gsave
newpath
translate
0.8 setlinewidth
1 setlinejoin
0 setlinecap
0 0 m
-3.5 0 l

gsave
0.000 setgray
fill
grestore
stroke
grestore
} bind def
807.1 365.348 o
grestore
gsave
771.475000 361.550857 translate
0.000000 rotate
0.000000 0.000000 m /zero glyphshow
6.362305 0.000000 m /period glyphshow
9.541016 0.000000 m /eight glyphshow
15.903320 0.000000 m /three glyphshow
22.265625 0.000000 m /five glyphshow
grestore
gsave
/o {
gsave
newpath
translate
0.8 setlinewidth
1 setlinejoin
0 setlinecap
0 0 m
-3.5 0 l

gsave
0.000 setgray
fill
grestore
stroke
grestore
} bind def
807.1 401.973 o
grestore
gsave
771.475000 398.175996 translate
0.000000 rotate
0.000000 0.000000 m /zero glyphshow
6.362305 0.000000 m /period glyphshow
9.541016 0.000000 m /eight glyphshow
15.903320 0.000000 m /four glyphshow
22.265625 0.000000 m /zero glyphshow
grestore
gsave
/o {
gsave
newpath
translate
0.8 setlinewidth
1 setlinejoin
0 setlinecap
0 0 m
-3.5 0 l

gsave
0.000 setgray
fill
grestore
stroke
grestore
} bind def
807.1 438.598 o
grestore
gsave
771.475000 434.801134 translate
0.000000 rotate
0.000000 0.000000 m /zero glyphshow
6.362305 0.000000 m /period glyphshow
9.541016 0.000000 m /eight glyphshow
15.903320 0.000000 m /four glyphshow
22.265625 0.000000 m /five glyphshow
grestore
gsave
/o {
gsave
newpath
translate
0.8 setlinewidth
1 setlinejoin
0 setlinecap
0 0 m
-3.5 0 l

gsave
0.000 setgray
fill
grestore
stroke
grestore
} bind def
807.1 475.223 o
grestore
gsave
771.475000 471.426273 translate
0.000000 rotate
0.000000 0.000000 m /zero glyphshow
6.362305 0.000000 m /period glyphshow
9.541016 0.000000 m /eight glyphshow
15.903320 0.000000 m /five glyphshow
22.265625 0.000000 m /zero glyphshow
grestore
gsave
/o {
gsave
newpath
translate
0.8 setlinewidth
1 setlinejoin
0 setlinecap
0 0 m
-3.5 0 l

gsave
0.000 setgray
fill
grestore
stroke
grestore
} bind def
807.1 511.848 o
grestore
gsave
771.475000 508.051412 translate
0.000000 rotate
0.000000 0.000000 m /zero glyphshow
6.362305 0.000000 m /period glyphshow
9.541016 0.000000 m /eight glyphshow
15.903320 0.000000 m /five glyphshow
22.265625 0.000000 m /five glyphshow
grestore
gsave
/o {
gsave
newpath
translate
0.8 setlinewidth
1 setlinejoin
0 setlinecap
0 0 m
-3.5 0 l

gsave
0.000 setgray
fill
grestore
stroke
grestore
} bind def
807.1 548.473 o
grestore
gsave
771.475000 544.676550 translate
0.000000 rotate
0.000000 0.000000 m /zero glyphshow
6.362305 0.000000 m /period glyphshow
9.541016 0.000000 m /eight glyphshow
15.903320 0.000000 m /six glyphshow
22.265625 0.000000 m /zero glyphshow
grestore
1.500 setlinewidth
2 setlinecap
0.122 0.467 0.706 setrgbcolor
gsave
330.6 238.8 807.1 310.4 clipbox
822.127273 373.67141 m
827.4 386.958169 l
832.672727 406.339399 l
837.945455 407.232995 l
843.218182 417.515005 l
848.490909 423.174283 l
853.763636 430.004845 l
859.036364 438.81664 l
864.309091 441.095035 l
869.581818 442.807138 l
874.854545 448.338907 l
880.127273 456.97756 l
885.4 455.465252 l
890.672727 455.275144 l
895.945455 463.837331 l
901.218182 461.331899 l
906.490909 464.808721 l
911.763636 467.76046 l
917.036364 471.228972 l
922.309091 469.967109 l
927.581818 476.92218 l
932.854545 479.878443 l
938.127273 489.013462 l
943.4 484.96543 l
948.672727 489.629026 l
953.945455 490.176337 l
959.218182 490.762692 l
964.490909 485.317568 l
969.763636 494.069617 l
975.036364 492.574766 l
980.309091 486.796388 l
985.581818 501.750157 l
990.854545 506.361333 l
996.127273 497.312124 l
1001.4 506.208204 l
1006.672727 509.107572 l
1011.945455 500.862904 l
1017.218182 499.40341 l
1022.490909 512.039642 l
1027.763636 512.215292 l
1033.036364 517.405988 l
1038.309091 514.079393 l
1043.581818 517.775779 l
1048.854545 515.66561 l
1054.127273 515.041883 l
1059.4 513.298898 l
1064.672727 526.733082 l
1069.945455 523.769098 l
1075.218182 524.651089 l
1080.490909 525.714042 l
1085.763636 527.124706 l
1091.036364 530.339872 l
1096.309091 528.375308 l
1101.581818 535.54355 l
1106.854545 529.190864 l
1112.127273 533.373535 l
1117.4 538.345455 l
1122.672727 536.259725 l
stroke
grestore
1.000 0.498 0.055 setrgbcolor
gsave
330.6 238.8 807.1 310.4 clipbox
822.127273 321.254545 m
827.4 322.167829 l
832.672727 339.992654 l
837.945455 345.199067 l
843.218182 351.947248 l
848.490909 352.655766 l
853.763636 358.714969 l
859.036364 371.392803 l
864.309091 375.846533 l
869.581818 369.472284 l
874.854545 380.427406 l
880.127273 387.361617 l
885.4 386.209573 l
890.672727 388.842089 l
895.945455 390.445689 l
901.218182 386.97778 l
906.490909 394.344543 l
911.763636 399.756525 l
917.036364 388.210392 l
922.309091 393.049297 l
927.581818 393.112734 l
932.854545 396.399164 l
938.127273 407.93566 l
943.4 406.186717 l
948.672727 409.847079 l
953.945455 402.445787 l
959.218182 405.277716 l
964.490909 403.287335 l
969.763636 409.971812 l
975.036364 400.969865 l
980.309091 399.158822 l
985.581818 410.391248 l
990.854545 413.64288 l
996.127273 403.190975 l
1001.4 417.965989 l
1006.672727 414.97212 l
1011.945455 407.734909 l
1017.218182 403.026627 l
1022.490909 412.306949 l
1027.763636 412.697744 l
1033.036364 417.543876 l
1038.309091 410.677653 l
1043.581818 417.371498 l
1048.854545 409.833695 l
1054.127273 411.77884 l
1059.4 398.469041 l
1064.672727 419.849569 l
1069.945455 418.387031 l
1075.218182 415.36131 l
1080.490909 418.92772 l
1085.763636 419.535862 l
1091.036364 423.827653 l
1096.309091 418.680395 l
1101.581818 419.763915 l
1106.854545 414.399846 l
1112.127273 414.603274 l
1117.4 420.29711 l
1122.672727 422.504034 l
stroke
grestore
0.800 setlinewidth
0 setlinejoin
[] 0 setdash
0.000 setgray
gsave
807.1 310.4 m
807.1 549.2 l
stroke
grestore
gsave
1137.7 310.4 m
1137.7 549.2 l
stroke
grestore
gsave
807.1 310.4 m
1137.7 310.4 l
stroke
grestore
gsave
807.1 549.2 m
1137.7 549.2 l
stroke
grestore
/DejaVuSans findfont
12.000 scalefont
setfont
gsave
935.868750 555.200000 translate
0.000000 rotate
0.000000 0.000000 m /zero glyphshow
7.634766 0.000000 m /period glyphshow
11.449219 0.000000 m /zero glyphshow
19.083984 0.000000 m /five glyphshow
26.718750 0.000000 m /space glyphshow
30.533203 0.000000 m /hyphen glyphshow
34.863281 0.000000 m /space glyphshow
38.677734 0.000000 m /zero glyphshow
46.312500 0.000000 m /period glyphshow
50.126953 0.000000 m /eight glyphshow
57.761719 0.000000 m /four glyphshow
65.396484 0.000000 m /three glyphshow
grestore
1.000 setlinewidth
0 setlinecap
0.800 setgray
gsave
814.1 511.85625 m
879.615625 511.85625 l
880.948958 511.85625 881.615625 512.522917 881.615625 513.85625 c
881.615625 542.2 l
881.615625 543.533333 880.948958 544.2 879.615625 544.2 c
814.1 544.2 l
812.766667 544.2 812.1 543.533333 812.1 542.2 c
812.1 513.85625 l
812.1 512.522917 812.766667 511.85625 814.1 511.85625 c
cl
gsave
1.000 setgray
fill
grestore
stroke
grestore
1.500 setlinewidth
1 setlinejoin
2 setlinecap
[] 0 setdash
0.122 0.467 0.706 setrgbcolor
gsave
816.1 536.10625 m
836.1 536.10625 l
stroke
grestore
0.000 setgray
/DejaVuSans findfont
10.000 scalefont
setfont
gsave
844.100000 532.606250 translate
0.000000 rotate
0.000000 0.000000 m /a glyphshow
6.127930 0.000000 m /u glyphshow
12.465820 0.000000 m /c glyphshow
grestore
1.000 0.498 0.055 setrgbcolor
gsave
816.1 521.434375 m
836.1 521.434375 l
stroke
grestore
0.000 setgray
gsave
844.100000 517.934375 translate
0.000000 rotate
0.000000 0.000000 m /v glyphshow
5.917969 0.000000 m /a glyphshow
12.045898 0.000000 m /l glyphshow
14.824219 0.000000 m /A glyphshow
21.665039 0.000000 m /u glyphshow
28.002930 0.000000 m /c glyphshow
grestore
gsave
46.3 27.8 m
376.9 27.8 l
376.9 266.6 l
46.3 266.6 l
cl
1.000 setgray
fill
grestore
0.800 setlinewidth
0 setlinecap
gsave
/o {
gsave
newpath
translate
0.8 setlinewidth
1 setlinejoin
0 setlinecap
0 0 m
0 -3.5 l

gsave
0.000 setgray
fill
grestore
stroke
grestore
} bind def
50.7818 27.8 o
grestore
gsave
47.602131 13.206250 translate
0.000000 rotate
0.000000 0.000000 m /zero glyphshow
grestore
gsave
/o {
gsave
newpath
translate
0.8 setlinewidth
1 setlinejoin
0 setlinecap
0 0 m
0 -3.5 l

gsave
0.000 setgray
fill
grestore
stroke
grestore
} bind def
103.509 27.8 o
grestore
gsave
97.149716 13.206250 translate
0.000000 rotate
0.000000 0.000000 m /one glyphshow
6.362305 0.000000 m /zero glyphshow
grestore
gsave
/o {
gsave
newpath
translate
0.8 setlinewidth
1 setlinejoin
0 setlinecap
0 0 m
0 -3.5 l

gsave
0.000 setgray
fill
grestore
stroke
grestore
} bind def
156.236 27.8 o
grestore
gsave
149.876989 13.206250 translate
0.000000 rotate
0.000000 0.000000 m /two glyphshow
6.362305 0.000000 m /zero glyphshow
grestore
gsave
/o {
gsave
newpath
translate
0.8 setlinewidth
1 setlinejoin
0 setlinecap
0 0 m
0 -3.5 l

gsave
0.000 setgray
fill
grestore
stroke
grestore
} bind def
208.964 27.8 o
grestore
gsave
202.604261 13.206250 translate
0.000000 rotate
0.000000 0.000000 m /three glyphshow
6.362305 0.000000 m /zero glyphshow
grestore
gsave
/o {
gsave
newpath
translate
0.8 setlinewidth
1 setlinejoin
0 setlinecap
0 0 m
0 -3.5 l

gsave
0.000 setgray
fill
grestore
stroke
grestore
} bind def
261.691 27.8 o
grestore
gsave
255.331534 13.206250 translate
0.000000 rotate
0.000000 0.000000 m /four glyphshow
6.362305 0.000000 m /zero glyphshow
grestore
gsave
/o {
gsave
newpath
translate
0.8 setlinewidth
1 setlinejoin
0 setlinecap
0 0 m
0 -3.5 l

gsave
0.000 setgray
fill
grestore
stroke
grestore
} bind def
314.418 27.8 o
grestore
gsave
308.058807 13.206250 translate
0.000000 rotate
0.000000 0.000000 m /five glyphshow
6.362305 0.000000 m /zero glyphshow
grestore
gsave
/o {
gsave
newpath
translate
0.8 setlinewidth
1 setlinejoin
0 setlinecap
0 0 m
0 -3.5 l

gsave
0.000 setgray
fill
grestore
stroke
grestore
} bind def
367.145 27.8 o
grestore
gsave
360.786080 13.206250 translate
0.000000 rotate
0.000000 0.000000 m /six glyphshow
6.362305 0.000000 m /zero glyphshow
grestore
gsave
/o {
gsave
newpath
translate
0.8 setlinewidth
1 setlinejoin
0 setlinecap
0 0 m
-3.5 0 l

gsave
0.000 setgray
fill
grestore
stroke
grestore
} bind def
46.3 29.0172 o
grestore
gsave
10.675000 25.220356 translate
0.000000 rotate
0.000000 0.000000 m /zero glyphshow
6.362305 0.000000 m /period glyphshow
9.541016 0.000000 m /eight glyphshow
15.903320 0.000000 m /two glyphshow
22.265625 0.000000 m /zero glyphshow
grestore
gsave
/o {
gsave
newpath
translate
0.8 setlinewidth
1 setlinejoin
0 setlinecap
0 0 m
-3.5 0 l

gsave
0.000 setgray
fill
grestore
stroke
grestore
} bind def
46.3 59.6163 o
grestore
gsave
10.675000 55.819390 translate
0.000000 rotate
0.000000 0.000000 m /zero glyphshow
6.362305 0.000000 m /period glyphshow
9.541016 0.000000 m /eight glyphshow
15.903320 0.000000 m /two glyphshow
22.265625 0.000000 m /five glyphshow
grestore
gsave
/o {
gsave
newpath
translate
0.8 setlinewidth
1 setlinejoin
0 setlinecap
0 0 m
-3.5 0 l

gsave
0.000 setgray
fill
grestore
stroke
grestore
} bind def
46.3 90.2153 o
grestore
gsave
10.675000 86.418423 translate
0.000000 rotate
0.000000 0.000000 m /zero glyphshow
6.362305 0.000000 m /period glyphshow
9.541016 0.000000 m /eight glyphshow
15.903320 0.000000 m /three glyphshow
22.265625 0.000000 m /zero glyphshow
grestore
gsave
/o {
gsave
newpath
translate
0.8 setlinewidth
1 setlinejoin
0 setlinecap
0 0 m
-3.5 0 l

gsave
0.000 setgray
fill
grestore
stroke
grestore
} bind def
46.3 120.814 o
grestore
gsave
10.675000 117.017457 translate
0.000000 rotate
0.000000 0.000000 m /zero glyphshow
6.362305 0.000000 m /period glyphshow
9.541016 0.000000 m /eight glyphshow
15.903320 0.000000 m /three glyphshow
22.265625 0.000000 m /five glyphshow
grestore
gsave
/o {
gsave
newpath
translate
0.8 setlinewidth
1 setlinejoin
0 setlinecap
0 0 m
-3.5 0 l

gsave
0.000 setgray
fill
grestore
stroke
grestore
} bind def
46.3 151.413 o
grestore
gsave
10.675000 147.616491 translate
0.000000 rotate
0.000000 0.000000 m /zero glyphshow
6.362305 0.000000 m /period glyphshow
9.541016 0.000000 m /eight glyphshow
15.903320 0.000000 m /four glyphshow
22.265625 0.000000 m /zero glyphshow
grestore
gsave
/o {
gsave
newpath
translate
0.8 setlinewidth
1 setlinejoin
0 setlinecap
0 0 m
-3.5 0 l

gsave
0.000 setgray
fill
grestore
stroke
grestore
} bind def
46.3 182.012 o
grestore
gsave
10.675000 178.215524 translate
0.000000 rotate
0.000000 0.000000 m /zero glyphshow
6.362305 0.000000 m /period glyphshow
9.541016 0.000000 m /eight glyphshow
15.903320 0.000000 m /four glyphshow
22.265625 0.000000 m /five glyphshow
grestore
gsave
/o {
gsave
newpath
translate
0.8 setlinewidth
1 setlinejoin
0 setlinecap
0 0 m
-3.5 0 l

gsave
0.000 setgray
fill
grestore
stroke
grestore
} bind def
46.3 212.611 o
grestore
gsave
10.675000 208.814558 translate
0.000000 rotate
0.000000 0.000000 m /zero glyphshow
6.362305 0.000000 m /period glyphshow
9.541016 0.000000 m /eight glyphshow
15.903320 0.000000 m /five glyphshow
22.265625 0.000000 m /zero glyphshow
grestore
gsave
/o {
gsave
newpath
translate
0.8 setlinewidth
1 setlinejoin
0 setlinecap
0 0 m
-3.5 0 l

gsave
0.000 setgray
fill
grestore
stroke
grestore
} bind def
46.3 243.21 o
grestore
gsave
10.675000 239.413591 translate
0.000000 rotate
0.000000 0.000000 m /zero glyphshow
6.362305 0.000000 m /period glyphshow
9.541016 0.000000 m /eight glyphshow
15.903320 0.000000 m /five glyphshow
22.265625 0.000000 m /five glyphshow
grestore
1.500 setlinewidth
2 setlinecap
0.122 0.467 0.706 setrgbcolor
gsave
330.6 238.8 46.3 27.8 clipbox
61.327273 84.788608 m
66.6 129.088775 l
71.872727 133.092892 l
77.145455 144.16098 l
82.418182 154.226509 l
87.690909 159.654373 l
92.963636 165.887514 l
98.236364 170.154688 l
103.509091 174.873 l
108.781818 185.163338 l
114.054545 185.551535 l
119.327273 179.178218 l
124.6 192.365473 l
129.872727 192.686252 l
135.145455 194.701889 l
140.418182 202.877209 l
145.690909 204.710476 l
150.963636 204.67876 l
156.236364 209.201103 l
161.509091 205.876548 l
166.781818 201.34151 l
172.054545 215.860239 l
177.327273 211.585793 l
182.6 213.809969 l
187.872727 220.27482 l
193.145455 213.80738 l
198.418182 212.398875 l
203.690909 215.89405 l
208.963636 220.900686 l
214.236364 229.840528 l
219.509091 221.857766 l
224.781818 231.193611 l
230.054545 229.544604 l
235.327273 231.744294 l
240.6 230.986345 l
245.872727 221.844373 l
251.145455 233.95557 l
256.418182 241.277587 l
261.690909 237.984214 l
266.963636 236.896447 l
272.236364 239.078965 l
277.509091 237.206668 l
282.781818 240.292118 l
288.054545 244.976371 l
293.327273 243.223998 l
298.6 247.146235 l
303.872727 244.914787 l
309.145455 244.730487 l
314.418182 252.870023 l
319.690909 253.306412 l
324.963636 249.748379 l
330.236364 246.283894 l
335.509091 253.725504 l
340.781818 253.489603 l
346.054545 255.275994 l
351.327273 255.077232 l
356.6 236.834165 l
361.872727 255.745455 l
stroke
grestore
1.000 0.498 0.055 setrgbcolor
gsave
330.6 238.8 46.3 27.8 clipbox
61.327273 38.654545 m
66.6 79.081916 l
71.872727 71.892741 l
77.145455 86.152569 l
82.418182 105.27294 l
87.690909 106.283288 l
92.963636 104.981329 l
98.236364 116.524084 l
103.509091 122.500304 l
108.781818 127.425251 l
114.054545 129.533835 l
119.327273 123.122212 l
124.6 128.806822 l
129.872727 130.438184 l
135.145455 137.112122 l
140.418182 144.124631 l
145.690909 141.846762 l
150.963636 146.097473 l
156.236364 144.873336 l
161.509091 146.144882 l
166.781818 139.595952 l
172.054545 155.600521 l
177.327273 149.336045 l
182.6 146.811292 l
187.872727 156.588731 l
193.145455 158.671373 l
198.418182 149.560567 l
203.690909 153.887759 l
208.963636 152.38118 l
214.236364 158.768204 l
219.509091 152.027402 l
224.781818 154.694159 l
230.054545 157.180002 l
235.327273 160.018952 l
240.6 159.632748 l
245.872727 147.097087 l
251.145455 158.201532 l
256.418182 164.732348 l
261.690909 159.485601 l
266.963636 157.03129 l
272.236364 161.018791 l
277.509091 158.426501 l
282.781818 162.543706 l
288.054545 168.093469 l
293.327273 166.099606 l
298.6 168.814891 l
303.872727 163.584692 l
309.145455 166.111459 l
314.418182 170.954111 l
319.690909 169.280036 l
324.963636 166.636312 l
330.236364 160.506684 l
335.509091 172.225657 l
340.781818 169.023535 l
346.054545 165.043638 l
351.327273 170.970212 l
356.6 155.466345 l
361.872727 167.56705 l
stroke
grestore
0.800 setlinewidth
0 setlinejoin
[] 0 setdash
0.000 setgray
gsave
46.3 27.8 m
46.3 266.6 l
stroke
grestore
gsave
376.9 27.8 m
376.9 266.6 l
stroke
grestore
gsave
46.3 27.8 m
376.9 27.8 l
stroke
grestore
gsave
46.3 266.6 m
376.9 266.6 l
stroke
grestore
/DejaVuSans findfont
12.000 scalefont
setfont
gsave
178.889062 272.600000 translate
0.000000 rotate
0.000000 0.000000 m /zero glyphshow
7.634766 0.000000 m /period glyphshow
11.449219 0.000000 m /one glyphshow
19.083984 0.000000 m /space glyphshow
22.898438 0.000000 m /hyphen glyphshow
27.228516 0.000000 m /space glyphshow
31.042969 0.000000 m /zero glyphshow
38.677734 0.000000 m /period glyphshow
42.492188 0.000000 m /eight glyphshow
50.126953 0.000000 m /four glyphshow
57.761719 0.000000 m /three glyphshow
grestore
1.000 setlinewidth
0 setlinecap
0.800 setgray
gsave
53.3 229.25625 m
118.815625 229.25625 l
120.148958 229.25625 120.815625 229.922917 120.815625 231.25625 c
120.815625 259.6 l
120.815625 260.933333 120.148958 261.6 118.815625 261.6 c
53.3 261.6 l
51.966667 261.6 51.3 260.933333 51.3 259.6 c
51.3 231.25625 l
51.3 229.922917 51.966667 229.25625 53.3 229.25625 c
cl
gsave
1.000 setgray
fill
grestore
stroke
grestore
1.500 setlinewidth
1 setlinejoin
2 setlinecap
[] 0 setdash
0.122 0.467 0.706 setrgbcolor
gsave
55.3 253.50625 m
75.3 253.50625 l
stroke
grestore
0.000 setgray
/DejaVuSans findfont
10.000 scalefont
setfont
gsave
83.300000 250.006250 translate
0.000000 rotate
0.000000 0.000000 m /a glyphshow
6.127930 0.000000 m /u glyphshow
12.465820 0.000000 m /c glyphshow
grestore
1.000 0.498 0.055 setrgbcolor
gsave
55.3 238.834375 m
75.3 238.834375 l
stroke
grestore
0.000 setgray
gsave
83.300000 235.334375 translate
0.000000 rotate
0.000000 0.000000 m /v glyphshow
5.917969 0.000000 m /a glyphshow
12.045898 0.000000 m /l glyphshow
14.824219 0.000000 m /A glyphshow
21.665039 0.000000 m /u glyphshow
28.002930 0.000000 m /c glyphshow
grestore
gsave
426.7 27.8 m
757.3 27.8 l
757.3 266.6 l
426.7 266.6 l
cl
1.000 setgray
fill
grestore
0.800 setlinewidth
0 setlinecap
gsave
/o {
gsave
newpath
translate
0.8 setlinewidth
1 setlinejoin
0 setlinecap
0 0 m
0 -3.5 l

gsave
0.000 setgray
fill
grestore
stroke
grestore
} bind def
431.182 27.8 o
grestore
gsave
428.002131 13.206250 translate
0.000000 rotate
0.000000 0.000000 m /zero glyphshow
grestore
gsave
/o {
gsave
newpath
translate
0.8 setlinewidth
1 setlinejoin
0 setlinecap
0 0 m
0 -3.5 l

gsave
0.000 setgray
fill
grestore
stroke
grestore
} bind def
483.909 27.8 o
grestore
gsave
477.549716 13.206250 translate
0.000000 rotate
0.000000 0.000000 m /one glyphshow
6.362305 0.000000 m /zero glyphshow
grestore
gsave
/o {
gsave
newpath
translate
0.8 setlinewidth
1 setlinejoin
0 setlinecap
0 0 m
0 -3.5 l

gsave
0.000 setgray
fill
grestore
stroke
grestore
} bind def
536.636 27.8 o
grestore
gsave
530.276989 13.206250 translate
0.000000 rotate
0.000000 0.000000 m /two glyphshow
6.362305 0.000000 m /zero glyphshow
grestore
gsave
/o {
gsave
newpath
translate
0.8 setlinewidth
1 setlinejoin
0 setlinecap
0 0 m
0 -3.5 l

gsave
0.000 setgray
fill
grestore
stroke
grestore
} bind def
589.364 27.8 o
grestore
gsave
583.004261 13.206250 translate
0.000000 rotate
0.000000 0.000000 m /three glyphshow
6.362305 0.000000 m /zero glyphshow
grestore
gsave
/o {
gsave
newpath
translate
0.8 setlinewidth
1 setlinejoin
0 setlinecap
0 0 m
0 -3.5 l

gsave
0.000 setgray
fill
grestore
stroke
grestore
} bind def
642.091 27.8 o
grestore
gsave
635.731534 13.206250 translate
0.000000 rotate
0.000000 0.000000 m /four glyphshow
6.362305 0.000000 m /zero glyphshow
grestore
gsave
/o {
gsave
newpath
translate
0.8 setlinewidth
1 setlinejoin
0 setlinecap
0 0 m
0 -3.5 l

gsave
0.000 setgray
fill
grestore
stroke
grestore
} bind def
694.818 27.8 o
grestore
gsave
688.458807 13.206250 translate
0.000000 rotate
0.000000 0.000000 m /five glyphshow
6.362305 0.000000 m /zero glyphshow
grestore
gsave
/o {
gsave
newpath
translate
0.8 setlinewidth
1 setlinejoin
0 setlinecap
0 0 m
0 -3.5 l

gsave
0.000 setgray
fill
grestore
stroke
grestore
} bind def
747.545 27.8 o
grestore
gsave
741.186080 13.206250 translate
0.000000 rotate
0.000000 0.000000 m /six glyphshow
6.362305 0.000000 m /zero glyphshow
grestore
gsave
/o {
gsave
newpath
translate
0.8 setlinewidth
1 setlinejoin
0 setlinecap
0 0 m
-3.5 0 l

gsave
0.000 setgray
fill
grestore
stroke
grestore
} bind def
426.7 36.0136 o
grestore
gsave
391.075000 32.216747 translate
0.000000 rotate
0.000000 0.000000 m /zero glyphshow
6.362305 0.000000 m /period glyphshow
9.541016 0.000000 m /eight glyphshow
15.903320 0.000000 m /two glyphshow
22.265625 0.000000 m /five glyphshow
grestore
gsave
/o {
gsave
newpath
translate
0.8 setlinewidth
1 setlinejoin
0 setlinecap
0 0 m
-3.5 0 l

gsave
0.000 setgray
fill
grestore
stroke
grestore
} bind def
426.7 74.4233 o
grestore
gsave
391.075000 70.626464 translate
0.000000 rotate
0.000000 0.000000 m /zero glyphshow
6.362305 0.000000 m /period glyphshow
9.541016 0.000000 m /eight glyphshow
15.903320 0.000000 m /three glyphshow
22.265625 0.000000 m /zero glyphshow
grestore
gsave
/o {
gsave
newpath
translate
0.8 setlinewidth
1 setlinejoin
0 setlinecap
0 0 m
-3.5 0 l

gsave
0.000 setgray
fill
grestore
stroke
grestore
} bind def
426.7 112.833 o
grestore
gsave
391.075000 109.036180 translate
0.000000 rotate
0.000000 0.000000 m /zero glyphshow
6.362305 0.000000 m /period glyphshow
9.541016 0.000000 m /eight glyphshow
15.903320 0.000000 m /three glyphshow
22.265625 0.000000 m /five glyphshow
grestore
gsave
/o {
gsave
newpath
translate
0.8 setlinewidth
1 setlinejoin
0 setlinecap
0 0 m
-3.5 0 l

gsave
0.000 setgray
fill
grestore
stroke
grestore
} bind def
426.7 151.243 o
grestore
gsave
391.075000 147.445897 translate
0.000000 rotate
0.000000 0.000000 m /zero glyphshow
6.362305 0.000000 m /period glyphshow
9.541016 0.000000 m /eight glyphshow
15.903320 0.000000 m /four glyphshow
22.265625 0.000000 m /zero glyphshow
grestore
gsave
/o {
gsave
newpath
translate
0.8 setlinewidth
1 setlinejoin
0 setlinecap
0 0 m
-3.5 0 l

gsave
0.000 setgray
fill
grestore
stroke
grestore
} bind def
426.7 189.652 o
grestore
gsave
391.075000 185.855613 translate
0.000000 rotate
0.000000 0.000000 m /zero glyphshow
6.362305 0.000000 m /period glyphshow
9.541016 0.000000 m /eight glyphshow
15.903320 0.000000 m /four glyphshow
22.265625 0.000000 m /five glyphshow
grestore
gsave
/o {
gsave
newpath
translate
0.8 setlinewidth
1 setlinejoin
0 setlinecap
0 0 m
-3.5 0 l

gsave
0.000 setgray
fill
grestore
stroke
grestore
} bind def
426.7 228.062 o
grestore
gsave
391.075000 224.265330 translate
0.000000 rotate
0.000000 0.000000 m /zero glyphshow
6.362305 0.000000 m /period glyphshow
9.541016 0.000000 m /eight glyphshow
15.903320 0.000000 m /five glyphshow
22.265625 0.000000 m /zero glyphshow
grestore
gsave
/o {
gsave
newpath
translate
0.8 setlinewidth
1 setlinejoin
0 setlinecap
0 0 m
-3.5 0 l

gsave
0.000 setgray
fill
grestore
stroke
grestore
} bind def
426.7 266.472 o
grestore
gsave
391.075000 262.675046 translate
0.000000 rotate
0.000000 0.000000 m /zero glyphshow
6.362305 0.000000 m /period glyphshow
9.541016 0.000000 m /eight glyphshow
15.903320 0.000000 m /five glyphshow
22.265625 0.000000 m /five glyphshow
grestore
1.500 setlinewidth
2 setlinecap
0.122 0.467 0.706 setrgbcolor
gsave
330.6 238.8 426.7 27.8 clipbox
441.727273 107.825763 m
447 104.71447 l
452.272727 105.338781 l
457.545455 123.241027 l
462.818182 144.962937 l
468.090909 134.296376 l
473.363636 163.794945 l
478.636364 153.274277 l
483.909091 153.584009 l
489.181818 153.971148 l
494.454545 174.650305 l
499.727273 179.929565 l
505 168.557109 l
510.272727 190.844591 l
515.545455 198.248293 l
520.818182 198.247416 l
526.090909 171.582692 l
531.363636 195.693445 l
536.636364 186.563424 l
541.909091 194.562094 l
547.181818 201.600265 l
552.454545 187.836026 l
557.727273 208.236032 l
563 199.571435 l
568.272727 203.520849 l
573.545455 206.809802 l
578.818182 208.515647 l
584.090909 218.524272 l
589.363636 218.509214 l
594.636364 214.495078 l
599.909091 227.337135 l
605.181818 223.21857 l
610.454545 224.316091 l
615.727273 232.274999 l
621 204.120458 l
626.272727 225.576368 l
631.545455 222.791309 l
636.818182 231.800965 l
642.090909 237.232821 l
647.363636 230.887189 l
652.636364 237.158869 l
657.909091 233.563279 l
663.181818 241.9774 l
668.454545 236.25185 l
673.727273 246.291159 l
679 231.955676 l
684.272727 246.100813 l
689.545455 248.6126 l
694.818182 249.339485 l
700.090909 248.766177 l
705.363636 237.318428 l
710.636364 249.713318 l
715.909091 251.357382 l
721.181818 250.92842 l
726.454545 244.285381 l
731.727273 255.745455 l
737 251.151977 l
742.272727 255.629266 l
stroke
grestore
1.000 0.498 0.055 setrgbcolor
gsave
330.6 238.8 426.7 27.8 clipbox
441.727273 57.956193 m
447 51.651437 l
452.272727 38.654545 l
457.545455 55.988132 l
462.818182 89.961389 l
468.090909 76.108892 l
473.363636 103.483209 l
478.636364 82.079883 l
483.909091 81.204067 l
489.181818 86.71385 l
494.454545 113.537975 l
499.727273 112.179617 l
505 94.165027 l
510.272727 115.138586 l
515.545455 122.568709 l
520.818182 124.572701 l
526.090909 114.856191 l
531.363636 127.195659 l
536.636364 118.00913 l
541.909091 120.824656 l
547.181818 128.158776 l
552.454545 103.816412 l
557.727273 134.017202 l
563 126.771786 l
568.272727 121.256107 l
573.545455 133.274723 l
578.818182 137.981114 l
584.090909 139.581163 l
589.363636 145.684649 l
594.636364 140.440698 l
599.909091 145.611384 l
605.181818 142.975513 l
610.454545 132.955275 l
615.727273 154.758052 l
621 115.596986 l
626.272727 145.111439 l
631.545455 146.441725 l
636.818182 140.515929 l
642.090909 148.850221 l
647.363636 142.138996 l
652.636364 145.635525 l
657.909091 155.198206 l
663.181818 154.989357 l
668.454545 152.439384 l
673.727273 153.089509 l
679 144.177515 l
684.272727 163.011499 l
689.545455 152.017757 l
694.818182 162.22972 l
700.090909 157.223812 l
705.363636 152.314468 l
710.636364 157.960957 l
715.909091 163.095431 l
721.181818 151.317665 l
726.454545 151.934667 l
731.727273 156.225886 l
737 167.571359 l
742.272727 159.430757 l
stroke
grestore
0.800 setlinewidth
0 setlinejoin
[] 0 setdash
0.000 setgray
gsave
426.7 27.8 m
426.7 266.6 l
stroke
grestore
gsave
757.3 27.8 m
757.3 266.6 l
stroke
grestore
gsave
426.7 27.8 m
757.3 27.8 l
stroke
grestore
gsave
426.7 266.6 m
757.3 266.6 l
stroke
grestore
/DejaVuSans findfont
12.000 scalefont
setfont
gsave
559.289062 272.600000 translate
0.000000 rotate
0.000000 0.000000 m /zero glyphshow
7.634766 0.000000 m /period glyphshow
11.449219 0.000000 m /two glyphshow
19.083984 0.000000 m /space glyphshow
22.898438 0.000000 m /hyphen glyphshow
27.228516 0.000000 m /space glyphshow
31.042969 0.000000 m /zero glyphshow
38.677734 0.000000 m /period glyphshow
42.492188 0.000000 m /eight glyphshow
50.126953 0.000000 m /four glyphshow
57.761719 0.000000 m /two glyphshow
grestore
1.000 setlinewidth
0 setlinecap
0.800 setgray
gsave
433.7 229.25625 m
499.215625 229.25625 l
500.548958 229.25625 501.215625 229.922917 501.215625 231.25625 c
501.215625 259.6 l
501.215625 260.933333 500.548958 261.6 499.215625 261.6 c
433.7 261.6 l
432.366667 261.6 431.7 260.933333 431.7 259.6 c
431.7 231.25625 l
431.7 229.922917 432.366667 229.25625 433.7 229.25625 c
cl
gsave
1.000 setgray
fill
grestore
stroke
grestore
1.500 setlinewidth
1 setlinejoin
2 setlinecap
[] 0 setdash
0.122 0.467 0.706 setrgbcolor
gsave
435.7 253.50625 m
455.7 253.50625 l
stroke
grestore
0.000 setgray
/DejaVuSans findfont
10.000 scalefont
setfont
gsave
463.700000 250.006250 translate
0.000000 rotate
0.000000 0.000000 m /a glyphshow
6.127930 0.000000 m /u glyphshow
12.465820 0.000000 m /c glyphshow
grestore
1.000 0.498 0.055 setrgbcolor
gsave
435.7 238.834375 m
455.7 238.834375 l
stroke
grestore
0.000 setgray
gsave
463.700000 235.334375 translate
0.000000 rotate
0.000000 0.000000 m /v glyphshow
5.917969 0.000000 m /a glyphshow
12.045898 0.000000 m /l glyphshow
14.824219 0.000000 m /A glyphshow
21.665039 0.000000 m /u glyphshow
28.002930 0.000000 m /c glyphshow
grestore
gsave
807.1 27.8 m
1137.7 27.8 l
1137.7 266.6 l
807.1 266.6 l
cl
1.000 setgray
fill
grestore
0.800 setlinewidth
0 setlinecap
gsave
/o {
gsave
newpath
translate
0.8 setlinewidth
1 setlinejoin
0 setlinecap
0 0 m
0 -3.5 l

gsave
0.000 setgray
fill
grestore
stroke
grestore
} bind def
811.582 27.8 o
grestore
gsave
808.402131 13.206250 translate
0.000000 rotate
0.000000 0.000000 m /zero glyphshow
grestore
gsave
/o {
gsave
newpath
translate
0.8 setlinewidth
1 setlinejoin
0 setlinecap
0 0 m
0 -3.5 l

gsave
0.000 setgray
fill
grestore
stroke
grestore
} bind def
864.309 27.8 o
grestore
gsave
857.949716 13.206250 translate
0.000000 rotate
0.000000 0.000000 m /one glyphshow
6.362305 0.000000 m /zero glyphshow
grestore
gsave
/o {
gsave
newpath
translate
0.8 setlinewidth
1 setlinejoin
0 setlinecap
0 0 m
0 -3.5 l

gsave
0.000 setgray
fill
grestore
stroke
grestore
} bind def
917.036 27.8 o
grestore
gsave
910.676989 13.206250 translate
0.000000 rotate
0.000000 0.000000 m /two glyphshow
6.362305 0.000000 m /zero glyphshow
grestore
gsave
/o {
gsave
newpath
translate
0.8 setlinewidth
1 setlinejoin
0 setlinecap
0 0 m
0 -3.5 l

gsave
0.000 setgray
fill
grestore
stroke
grestore
} bind def
969.764 27.8 o
grestore
gsave
963.404261 13.206250 translate
0.000000 rotate
0.000000 0.000000 m /three glyphshow
6.362305 0.000000 m /zero glyphshow
grestore
gsave
/o {
gsave
newpath
translate
0.8 setlinewidth
1 setlinejoin
0 setlinecap
0 0 m
0 -3.5 l

gsave
0.000 setgray
fill
grestore
stroke
grestore
} bind def
1022.49 27.8 o
grestore
gsave
1016.131534 13.206250 translate
0.000000 rotate
0.000000 0.000000 m /four glyphshow
6.362305 0.000000 m /zero glyphshow
grestore
gsave
/o {
gsave
newpath
translate
0.8 setlinewidth
1 setlinejoin
0 setlinecap
0 0 m
0 -3.5 l

gsave
0.000 setgray
fill
grestore
stroke
grestore
} bind def
1075.22 27.8 o
grestore
gsave
1068.858807 13.206250 translate
0.000000 rotate
0.000000 0.000000 m /five glyphshow
6.362305 0.000000 m /zero glyphshow
grestore
gsave
/o {
gsave
newpath
translate
0.8 setlinewidth
1 setlinejoin
0 setlinecap
0 0 m
0 -3.5 l

gsave
0.000 setgray
fill
grestore
stroke
grestore
} bind def
1127.95 27.8 o
grestore
gsave
1121.586080 13.206250 translate
0.000000 rotate
0.000000 0.000000 m /six glyphshow
6.362305 0.000000 m /zero glyphshow
grestore
gsave
/o {
gsave
newpath
translate
0.8 setlinewidth
1 setlinejoin
0 setlinecap
0 0 m
-3.5 0 l

gsave
0.000 setgray
fill
grestore
stroke
grestore
} bind def
807.1 27.9791 o
grestore
gsave
771.475000 24.182227 translate
0.000000 rotate
0.000000 0.000000 m /zero glyphshow
6.362305 0.000000 m /period glyphshow
9.541016 0.000000 m /eight glyphshow
15.903320 0.000000 m /two glyphshow
22.265625 0.000000 m /zero glyphshow
grestore
gsave
/o {
gsave
newpath
translate
0.8 setlinewidth
1 setlinejoin
0 setlinecap
0 0 m
-3.5 0 l

gsave
0.000 setgray
fill
grestore
stroke
grestore
} bind def
807.1 66.6263 o
grestore
gsave
771.475000 62.829432 translate
0.000000 rotate
0.000000 0.000000 m /zero glyphshow
6.362305 0.000000 m /period glyphshow
9.541016 0.000000 m /eight glyphshow
15.903320 0.000000 m /two glyphshow
22.265625 0.000000 m /five glyphshow
grestore
gsave
/o {
gsave
newpath
translate
0.8 setlinewidth
1 setlinejoin
0 setlinecap
0 0 m
-3.5 0 l

gsave
0.000 setgray
fill
grestore
stroke
grestore
} bind def
807.1 105.274 o
grestore
gsave
771.475000 101.476638 translate
0.000000 rotate
0.000000 0.000000 m /zero glyphshow
6.362305 0.000000 m /period glyphshow
9.541016 0.000000 m /eight glyphshow
15.903320 0.000000 m /three glyphshow
22.265625 0.000000 m /zero glyphshow
grestore
gsave
/o {
gsave
newpath
translate
0.8 setlinewidth
1 setlinejoin
0 setlinecap
0 0 m
-3.5 0 l

gsave
0.000 setgray
fill
grestore
stroke
grestore
} bind def
807.1 143.921 o
grestore
gsave
771.475000 140.123844 translate
0.000000 rotate
0.000000 0.000000 m /zero glyphshow
6.362305 0.000000 m /period glyphshow
9.541016 0.000000 m /eight glyphshow
15.903320 0.000000 m /three glyphshow
22.265625 0.000000 m /five glyphshow
grestore
gsave
/o {
gsave
newpath
translate
0.8 setlinewidth
1 setlinejoin
0 setlinecap
0 0 m
-3.5 0 l

gsave
0.000 setgray
fill
grestore
stroke
grestore
} bind def
807.1 182.568 o
grestore
gsave
771.475000 178.771050 translate
0.000000 rotate
0.000000 0.000000 m /zero glyphshow
6.362305 0.000000 m /period glyphshow
9.541016 0.000000 m /eight glyphshow
15.903320 0.000000 m /four glyphshow
22.265625 0.000000 m /zero glyphshow
grestore
gsave
/o {
gsave
newpath
translate
0.8 setlinewidth
1 setlinejoin
0 setlinecap
0 0 m
-3.5 0 l

gsave
0.000 setgray
fill
grestore
stroke
grestore
} bind def
807.1 221.215 o
grestore
gsave
771.475000 217.418256 translate
0.000000 rotate
0.000000 0.000000 m /zero glyphshow
6.362305 0.000000 m /period glyphshow
9.541016 0.000000 m /eight glyphshow
15.903320 0.000000 m /four glyphshow
22.265625 0.000000 m /five glyphshow
grestore
gsave
/o {
gsave
newpath
translate
0.8 setlinewidth
1 setlinejoin
0 setlinecap
0 0 m
-3.5 0 l

gsave
0.000 setgray
fill
grestore
stroke
grestore
} bind def
807.1 259.862 o
grestore
gsave
771.475000 256.065462 translate
0.000000 rotate
0.000000 0.000000 m /zero glyphshow
6.362305 0.000000 m /period glyphshow
9.541016 0.000000 m /eight glyphshow
15.903320 0.000000 m /five glyphshow
22.265625 0.000000 m /zero glyphshow
grestore
1.500 setlinewidth
2 setlinecap
0.122 0.467 0.706 setrgbcolor
gsave
330.6 238.8 807.1 27.8 clipbox
822.127273 73.41064 m
827.4 94.669041 l
832.672727 116.576317 l
837.945455 143.531224 l
843.218182 122.763851 l
848.490909 133.318642 l
853.763636 129.436756 l
859.036364 160.943595 l
864.309091 181.890142 l
869.581818 170.716259 l
874.854545 156.04992 l
880.127273 179.424001 l
885.4 167.870705 l
890.672727 184.386378 l
895.945455 171.432954 l
901.218182 192.045749 l
906.490909 188.060292 l
911.763636 191.078845 l
917.036364 184.649145 l
922.309091 204.80682 l
927.581818 201.660463 l
932.854545 203.021829 l
938.127273 204.458798 l
943.4 192.940216 l
948.672727 214.863526 l
953.945455 209.643779 l
959.218182 213.484933 l
964.490909 201.090719 l
969.763636 214.098004 l
975.036364 209.483182 l
980.309091 223.324742 l
985.581818 223.254848 l
990.854545 220.624945 l
996.127273 229.660056 l
1001.4 229.047815 l
1006.672727 215.950295 l
1011.945455 223.127875 l
1017.218182 225.702308 l
1022.490909 236.79353 l
1027.763636 231.298251 l
1033.036364 219.986396 l
1038.309091 231.747405 l
1043.581818 237.252127 l
1048.854545 232.318498 l
1054.127273 241.021466 l
1059.4 235.402898 l
1064.672727 243.579346 l
1069.945455 243.903602 l
1075.218182 240.026801 l
1080.490909 236.634386 l
1085.763636 246.645067 l
1091.036364 239.484247 l
1096.309091 235.185949 l
1101.581818 249.654072 l
1106.854545 243.028334 l
1112.127273 255.745455 l
1117.4 248.346982 l
1122.672727 247.571964 l
stroke
grestore
1.000 0.498 0.055 setrgbcolor
gsave
330.6 238.8 807.1 27.8 clipbox
822.127273 38.654545 m
827.4 53.505276 l
832.672727 56.434807 l
837.945455 81.497939 l
843.218182 61.267176 l
848.490909 67.512623 l
853.763636 69.07116 l
859.036364 94.697491 l
864.309091 115.94054 l
869.581818 109.913142 l
874.854545 100.946892 l
880.127273 125.155343 l
885.4 112.282017 l
890.672727 123.075692 l
895.945455 114.617281 l
901.218182 129.610647 l
906.490909 128.153225 l
911.763636 129.395988 l
917.036364 126.146163 l
922.309091 150.843528 l
927.581818 147.017232 l
932.854545 136.92035 l
938.127273 146.118488 l
943.4 140.646096 l
948.672727 147.735775 l
953.945455 151.427909 l
959.218182 138.469285 l
964.490909 148.07132 l
969.763636 155.615454 l
975.036364 150.176108 l
980.309091 161.614326 l
985.581818 160.130072 l
990.854545 159.962864 l
996.127273 173.882935 l
1001.4 163.061297 l
1006.672727 145.55868 l
1011.945455 160.996334 l
1017.218182 156.206614 l
1022.490909 166.003255 l
1027.763636 155.371421 l
1033.036364 149.340633 l
1038.309091 157.363231 l
1043.581818 169.422547 l
1048.854545 166.191647 l
1054.127273 175.033055 l
1059.4 157.127671 l
1064.672727 178.498104 l
1069.945455 169.275675 l
1075.218182 176.411957 l
1080.490909 165.260422 l
1085.763636 171.182186 l
1091.036364 170.045058 l
1096.309091 161.220314 l
1101.581818 179.01159 l
1106.854545 176.213962 l
1112.127273 180.801169 l
1117.4 172.223282 l
1122.672727 171.611786 l
stroke
grestore
0.800 setlinewidth
0 setlinejoin
[] 0 setdash
0.000 setgray
gsave
807.1 27.8 m
807.1 266.6 l
stroke
grestore
gsave
1137.7 27.8 m
1137.7 266.6 l
stroke
grestore
gsave
807.1 27.8 m
1137.7 27.8 l
stroke
grestore
gsave
807.1 266.6 m
1137.7 266.6 l
stroke
grestore
/DejaVuSans findfont
12.000 scalefont
setfont
gsave
943.509375 272.600000 translate
0.000000 rotate
0.000000 0.000000 m /zero glyphshow
7.634766 0.000000 m /period glyphshow
11.449219 0.000000 m /five glyphshow
19.083984 0.000000 m /space glyphshow
22.898438 0.000000 m /hyphen glyphshow
27.228516 0.000000 m /space glyphshow
31.042969 0.000000 m /zero glyphshow
38.677734 0.000000 m /period glyphshow
42.492188 0.000000 m /eight glyphshow
50.126953 0.000000 m /four glyphshow
grestore
1.000 setlinewidth
0 setlinecap
0.800 setgray
gsave
814.1 229.25625 m
879.615625 229.25625 l
880.948958 229.25625 881.615625 229.922917 881.615625 231.25625 c
881.615625 259.6 l
881.615625 260.933333 880.948958 261.6 879.615625 261.6 c
814.1 261.6 l
812.766667 261.6 812.1 260.933333 812.1 259.6 c
812.1 231.25625 l
812.1 229.922917 812.766667 229.25625 814.1 229.25625 c
cl
gsave
1.000 setgray
fill
grestore
stroke
grestore
1.500 setlinewidth
1 setlinejoin
2 setlinecap
[] 0 setdash
0.122 0.467 0.706 setrgbcolor
gsave
816.1 253.50625 m
836.1 253.50625 l
stroke
grestore
0.000 setgray
/DejaVuSans findfont
10.000 scalefont
setfont
gsave
844.100000 250.006250 translate
0.000000 rotate
0.000000 0.000000 m /a glyphshow
6.127930 0.000000 m /u glyphshow
12.465820 0.000000 m /c glyphshow
grestore
1.000 0.498 0.055 setrgbcolor
gsave
816.1 238.834375 m
836.1 238.834375 l
stroke
grestore
0.000 setgray
gsave
844.100000 235.334375 translate
0.000000 rotate
0.000000 0.000000 m /v glyphshow
5.917969 0.000000 m /a glyphshow
12.045898 0.000000 m /l glyphshow
14.824219 0.000000 m /A glyphshow
21.665039 0.000000 m /u glyphshow
28.002930 0.000000 m /c glyphshow
grestore

end
showpage
