%!PS-Adobe-3.0 EPSF-3.0
%%Title: imgNets/dropRate2.eps
%%Creator: matplotlib version 2.0.2, http://matplotlib.org/
%%CreationDate: Fri Apr 20 15:15:43 2018
%%Orientation: portrait
%%BoundingBox: -270 108 882 684
%%EndComments
%%BeginProlog
/mpldict 8 dict def
mpldict begin
/m { moveto } bind def
/l { lineto } bind def
/r { rlineto } bind def
/c { curveto } bind def
/cl { closepath } bind def
/box {
m
1 index 0 r
0 exch r
neg 0 r
cl
} bind def
/clipbox {
box
clip
newpath
} bind def
%!PS-Adobe-3.0 Resource-Font
%%Title: DejaVu Sans
%%Copyright: Copyright (c) 2003 by Bitstream, Inc. All Rights Reserved. Copyright (c) 2006 by Tavmjong Bah. All Rights Reserved. DejaVu changes are in public domain 
%%Creator: Converted from TrueType to type 3 by PPR
25 dict begin
/_d{bind def}bind def
/_m{moveto}_d
/_l{lineto}_d
/_cl{closepath eofill}_d
/_c{curveto}_d
/_sc{7 -1 roll{setcachedevice}{pop pop pop pop pop pop}ifelse}_d
/_e{exec}_d
/FontName /DejaVuSans def
/PaintType 0 def
/FontMatrix[.001 0 0 .001 0 0]def
/FontBBox[-1021 -463 1793 1232]def
/FontType 3 def
/Encoding [ /space /hyphen /period /zero /one /two /three /four /five /six /seven /eight /A /a /c /l /u /v ] def
/FontInfo 10 dict dup begin
/FamilyName (DejaVu Sans) def
/FullName (DejaVu Sans) def
/Notice (Copyright (c) 2003 by Bitstream, Inc. All Rights Reserved. Copyright (c) 2006 by Tavmjong Bah. All Rights Reserved. DejaVu changes are in public domain ) def
/Weight (Book) def
/Version (Version 2.35) def
/ItalicAngle 0.0 def
/isFixedPitch false def
/UnderlinePosition -130 def
/UnderlineThickness 90 def
end readonly def
/CharStrings 18 dict dup begin
/space{318 0 0 0 0 0 _sc
}_d
/hyphen{361 0 49 234 312 314 _sc
49 314 _m
312 314 _l
312 234 _l
49 234 _l
49 314 _l
_cl}_d
/period{318 0 107 0 210 124 _sc
107 124 _m
210 124 _l
210 0 _l
107 0 _l
107 124 _l
_cl}_d
/zero{636 0 66 -13 570 742 _sc
318 664 _m
267 664 229 639 203 589 _c
177 539 165 464 165 364 _c
165 264 177 189 203 139 _c
229 89 267 64 318 64 _c
369 64 407 89 433 139 _c
458 189 471 264 471 364 _c
471 464 458 539 433 589 _c
407 639 369 664 318 664 _c
318 742 _m
399 742 461 709 505 645 _c
548 580 570 486 570 364 _c
570 241 548 147 505 83 _c
461 19 399 -13 318 -13 _c
236 -13 173 19 130 83 _c
87 147 66 241 66 364 _c
66 486 87 580 130 645 _c
173 709 236 742 318 742 _c
_cl}_d
/one{636 0 110 0 544 729 _sc
124 83 _m
285 83 _l
285 639 _l
110 604 _l
110 694 _l
284 729 _l
383 729 _l
383 83 _l
544 83 _l
544 0 _l
124 0 _l
124 83 _l
_cl}_d
/two{{636 0 73 0 536 742 _sc
192 83 _m
536 83 _l
536 0 _l
73 0 _l
73 83 _l
110 121 161 173 226 239 _c
290 304 331 346 348 365 _c
380 400 402 430 414 455 _c
426 479 433 504 433 528 _c
433 566 419 598 392 622 _c
365 646 330 659 286 659 _c
255 659 222 653 188 643 _c
154 632 117 616 78 594 _c
78 694 _l
118 710 155 722 189 730 _c
223 738 255 742 284 742 _c
}_e{359 742 419 723 464 685 _c
509 647 532 597 532 534 _c
532 504 526 475 515 449 _c
504 422 484 390 454 354 _c
446 344 420 317 376 272 _c
332 227 271 164 192 83 _c
_cl}_e}_d
/three{{636 0 76 -13 556 742 _sc
406 393 _m
453 383 490 362 516 330 _c
542 298 556 258 556 212 _c
556 140 531 84 482 45 _c
432 6 362 -13 271 -13 _c
240 -13 208 -10 176 -4 _c
144 1 110 10 76 22 _c
76 117 _l
103 101 133 89 166 81 _c
198 73 232 69 268 69 _c
330 69 377 81 409 105 _c
441 129 458 165 458 212 _c
458 254 443 288 413 312 _c
383 336 341 349 287 349 _c
}_e{202 349 _l
202 430 _l
291 430 _l
339 430 376 439 402 459 _c
428 478 441 506 441 543 _c
441 580 427 609 401 629 _c
374 649 336 659 287 659 _c
260 659 231 656 200 650 _c
169 644 135 635 98 623 _c
98 711 _l
135 721 170 729 203 734 _c
235 739 266 742 296 742 _c
370 742 429 725 473 691 _c
517 657 539 611 539 553 _c
539 513 527 479 504 451 _c
481 423 448 403 406 393 _c
_cl}_e}_d
/four{636 0 49 0 580 729 _sc
378 643 _m
129 254 _l
378 254 _l
378 643 _l
352 729 _m
476 729 _l
476 254 _l
580 254 _l
580 172 _l
476 172 _l
476 0 _l
378 0 _l
378 172 _l
49 172 _l
49 267 _l
352 729 _l
_cl}_d
/five{{636 0 77 -13 549 729 _sc
108 729 _m
495 729 _l
495 646 _l
198 646 _l
198 467 _l
212 472 227 476 241 478 _c
255 480 270 482 284 482 _c
365 482 429 459 477 415 _c
525 370 549 310 549 234 _c
549 155 524 94 475 51 _c
426 8 357 -13 269 -13 _c
238 -13 207 -10 175 -6 _c
143 -1 111 6 77 17 _c
77 116 _l
106 100 136 88 168 80 _c
199 72 232 69 267 69 _c
}_e{323 69 368 83 401 113 _c
433 143 450 183 450 234 _c
450 284 433 324 401 354 _c
368 384 323 399 267 399 _c
241 399 214 396 188 390 _c
162 384 135 375 108 363 _c
108 729 _l
_cl}_e}_d
/six{{636 0 70 -13 573 742 _sc
330 404 _m
286 404 251 388 225 358 _c
199 328 186 286 186 234 _c
186 181 199 139 225 109 _c
251 79 286 64 330 64 _c
374 64 409 79 435 109 _c
461 139 474 181 474 234 _c
474 286 461 328 435 358 _c
409 388 374 404 330 404 _c
526 713 _m
526 623 _l
501 635 476 644 451 650 _c
425 656 400 659 376 659 _c
310 659 260 637 226 593 _c
}_e{192 549 172 482 168 394 _c
187 422 211 444 240 459 _c
269 474 301 482 336 482 _c
409 482 467 459 509 415 _c
551 371 573 310 573 234 _c
573 159 550 99 506 54 _c
462 9 403 -13 330 -13 _c
246 -13 181 19 137 83 _c
92 147 70 241 70 364 _c
70 479 97 571 152 639 _c
206 707 280 742 372 742 _c
396 742 421 739 447 735 _c
472 730 498 723 526 713 _c
_cl}_e}_d
/seven{636 0 82 0 551 729 _sc
82 729 _m
551 729 _l
551 687 _l
286 0 _l
183 0 _l
432 646 _l
82 646 _l
82 729 _l
_cl}_d
/eight{{636 0 68 -13 568 742 _sc
318 346 _m
271 346 234 333 207 308 _c
180 283 167 249 167 205 _c
167 161 180 126 207 101 _c
234 76 271 64 318 64 _c
364 64 401 76 428 102 _c
455 127 469 161 469 205 _c
469 249 455 283 429 308 _c
402 333 365 346 318 346 _c
219 388 _m
177 398 144 418 120 447 _c
96 476 85 511 85 553 _c
85 611 105 657 147 691 _c
188 725 245 742 318 742 _c
}_e{390 742 447 725 489 691 _c
530 657 551 611 551 553 _c
551 511 539 476 515 447 _c
491 418 459 398 417 388 _c
464 377 501 355 528 323 _c
554 291 568 251 568 205 _c
568 134 546 80 503 43 _c
459 5 398 -13 318 -13 _c
237 -13 175 5 132 43 _c
89 80 68 134 68 205 _c
68 251 81 291 108 323 _c
134 355 171 377 219 388 _c
183 544 _m
183 506 194 476 218 455 _c
}_e{242 434 275 424 318 424 _c
360 424 393 434 417 455 _c
441 476 453 506 453 544 _c
453 582 441 611 417 632 _c
393 653 360 664 318 664 _c
275 664 242 653 218 632 _c
194 611 183 582 183 544 _c
_cl}_e}_d
/A{684 0 8 0 676 729 _sc
342 632 _m
208 269 _l
476 269 _l
342 632 _l
286 729 _m
398 729 _l
676 0 _l
573 0 _l
507 187 _l
178 187 _l
112 0 _l
8 0 _l
286 729 _l
_cl}_d
/a{{613 0 60 -13 522 560 _sc
343 275 _m
270 275 220 266 192 250 _c
164 233 150 205 150 165 _c
150 133 160 107 181 89 _c
202 70 231 61 267 61 _c
317 61 357 78 387 114 _c
417 149 432 196 432 255 _c
432 275 _l
343 275 _l
522 312 _m
522 0 _l
432 0 _l
432 83 _l
411 49 385 25 355 10 _c
325 -5 287 -13 243 -13 _c
187 -13 142 2 109 33 _c
76 64 60 106 60 159 _c
}_e{60 220 80 266 122 298 _c
163 329 224 345 306 345 _c
432 345 _l
432 354 _l
432 395 418 427 391 450 _c
364 472 326 484 277 484 _c
245 484 215 480 185 472 _c
155 464 127 453 100 439 _c
100 522 _l
132 534 164 544 195 550 _c
226 556 256 560 286 560 _c
365 560 424 539 463 498 _c
502 457 522 395 522 312 _c
_cl}_e}_d
/c{{550 0 55 -13 488 560 _sc
488 526 _m
488 442 _l
462 456 437 466 411 473 _c
385 480 360 484 334 484 _c
276 484 230 465 198 428 _c
166 391 150 339 150 273 _c
150 206 166 154 198 117 _c
230 80 276 62 334 62 _c
360 62 385 65 411 72 _c
437 79 462 90 488 104 _c
488 21 _l
462 9 436 0 410 -5 _c
383 -10 354 -13 324 -13 _c
242 -13 176 12 128 64 _c
}_e{79 115 55 185 55 273 _c
55 362 79 432 128 483 _c
177 534 244 560 330 560 _c
358 560 385 557 411 551 _c
437 545 463 537 488 526 _c
_cl}_e}_d
/l{278 0 94 0 184 760 _sc
94 760 _m
184 760 _l
184 0 _l
94 0 _l
94 760 _l
_cl}_d
/u{634 0 85 -13 543 560 _sc
85 216 _m
85 547 _l
175 547 _l
175 219 _l
175 167 185 129 205 103 _c
225 77 255 64 296 64 _c
344 64 383 79 411 110 _c
439 141 453 183 453 237 _c
453 547 _l
543 547 _l
543 0 _l
453 0 _l
453 84 _l
431 50 405 26 377 10 _c
348 -5 315 -13 277 -13 _c
214 -13 166 6 134 45 _c
101 83 85 140 85 216 _c
311 560 _m
311 560 _l
_cl}_d
/v{592 0 30 0 562 547 _sc
30 547 _m
125 547 _l
296 88 _l
467 547 _l
562 547 _l
357 0 _l
235 0 _l
30 547 _l
_cl}_d
end readonly def

/BuildGlyph
 {exch begin
 CharStrings exch
 2 copy known not{pop /.notdef}if
 true 3 1 roll get exec
 end}_d

/BuildChar {
 1 index /Encoding get exch get
 1 index /BuildGlyph get exec
}_d

FontName currentdict end definefont pop
end
%%EndProlog
mpldict begin
-270 108 translate
1152 576 0 0 clipbox
gsave
0 0 m
1152 0 l
1152 576 l
0 576 l
cl
1.000 setgray
fill
grestore
gsave
46.3 310.4 m
376.9 310.4 l
376.9 549.2 l
46.3 549.2 l
cl
1.000 setgray
fill
grestore
0.800 setlinewidth
1 setlinejoin
0 setlinecap
[] 0 setdash
0.000 setgray
gsave
/o {
gsave
newpath
translate
0.8 setlinewidth
1 setlinejoin
0 setlinecap
0 0 m
0 -3.5 l

gsave
0.000 setgray
fill
grestore
stroke
grestore
} bind def
50.7818 310.4 o
grestore
/DejaVuSans findfont
10.000 scalefont
setfont
gsave
47.602131 295.806250 translate
0.000000 rotate
0.000000 0.000000 m /zero glyphshow
grestore
gsave
/o {
gsave
newpath
translate
0.8 setlinewidth
1 setlinejoin
0 setlinecap
0 0 m
0 -3.5 l

gsave
0.000 setgray
fill
grestore
stroke
grestore
} bind def
103.509 310.4 o
grestore
gsave
97.149716 295.806250 translate
0.000000 rotate
0.000000 0.000000 m /one glyphshow
6.362305 0.000000 m /zero glyphshow
grestore
gsave
/o {
gsave
newpath
translate
0.8 setlinewidth
1 setlinejoin
0 setlinecap
0 0 m
0 -3.5 l

gsave
0.000 setgray
fill
grestore
stroke
grestore
} bind def
156.236 310.4 o
grestore
gsave
149.876989 295.806250 translate
0.000000 rotate
0.000000 0.000000 m /two glyphshow
6.362305 0.000000 m /zero glyphshow
grestore
gsave
/o {
gsave
newpath
translate
0.8 setlinewidth
1 setlinejoin
0 setlinecap
0 0 m
0 -3.5 l

gsave
0.000 setgray
fill
grestore
stroke
grestore
} bind def
208.964 310.4 o
grestore
gsave
202.604261 295.806250 translate
0.000000 rotate
0.000000 0.000000 m /three glyphshow
6.362305 0.000000 m /zero glyphshow
grestore
gsave
/o {
gsave
newpath
translate
0.8 setlinewidth
1 setlinejoin
0 setlinecap
0 0 m
0 -3.5 l

gsave
0.000 setgray
fill
grestore
stroke
grestore
} bind def
261.691 310.4 o
grestore
gsave
255.331534 295.806250 translate
0.000000 rotate
0.000000 0.000000 m /four glyphshow
6.362305 0.000000 m /zero glyphshow
grestore
gsave
/o {
gsave
newpath
translate
0.8 setlinewidth
1 setlinejoin
0 setlinecap
0 0 m
0 -3.5 l

gsave
0.000 setgray
fill
grestore
stroke
grestore
} bind def
314.418 310.4 o
grestore
gsave
308.058807 295.806250 translate
0.000000 rotate
0.000000 0.000000 m /five glyphshow
6.362305 0.000000 m /zero glyphshow
grestore
gsave
/o {
gsave
newpath
translate
0.8 setlinewidth
1 setlinejoin
0 setlinecap
0 0 m
0 -3.5 l

gsave
0.000 setgray
fill
grestore
stroke
grestore
} bind def
367.145 310.4 o
grestore
gsave
360.786080 295.806250 translate
0.000000 rotate
0.000000 0.000000 m /six glyphshow
6.362305 0.000000 m /zero glyphshow
grestore
gsave
/o {
gsave
newpath
translate
0.8 setlinewidth
1 setlinejoin
0 setlinecap
0 0 m
-3.5 0 l

gsave
0.000 setgray
fill
grestore
stroke
grestore
} bind def
46.3 322.143 o
grestore
gsave
17.034375 318.345688 translate
0.000000 rotate
0.000000 0.000000 m /zero glyphshow
6.362305 0.000000 m /period glyphshow
9.541016 0.000000 m /eight glyphshow
15.903320 0.000000 m /four glyphshow
grestore
gsave
/o {
gsave
newpath
translate
0.8 setlinewidth
1 setlinejoin
0 setlinecap
0 0 m
-3.5 0 l

gsave
0.000 setgray
fill
grestore
stroke
grestore
} bind def
46.3 369.941 o
grestore
gsave
17.034375 366.143867 translate
0.000000 rotate
0.000000 0.000000 m /zero glyphshow
6.362305 0.000000 m /period glyphshow
9.541016 0.000000 m /eight glyphshow
15.903320 0.000000 m /five glyphshow
grestore
gsave
/o {
gsave
newpath
translate
0.8 setlinewidth
1 setlinejoin
0 setlinecap
0 0 m
-3.5 0 l

gsave
0.000 setgray
fill
grestore
stroke
grestore
} bind def
46.3 417.739 o
grestore
gsave
17.034375 413.942047 translate
0.000000 rotate
0.000000 0.000000 m /zero glyphshow
6.362305 0.000000 m /period glyphshow
9.541016 0.000000 m /eight glyphshow
15.903320 0.000000 m /six glyphshow
grestore
gsave
/o {
gsave
newpath
translate
0.8 setlinewidth
1 setlinejoin
0 setlinecap
0 0 m
-3.5 0 l

gsave
0.000 setgray
fill
grestore
stroke
grestore
} bind def
46.3 465.537 o
grestore
gsave
17.034375 461.740226 translate
0.000000 rotate
0.000000 0.000000 m /zero glyphshow
6.362305 0.000000 m /period glyphshow
9.541016 0.000000 m /eight glyphshow
15.903320 0.000000 m /seven glyphshow
grestore
gsave
/o {
gsave
newpath
translate
0.8 setlinewidth
1 setlinejoin
0 setlinecap
0 0 m
-3.5 0 l

gsave
0.000 setgray
fill
grestore
stroke
grestore
} bind def
46.3 513.335 o
grestore
gsave
17.034375 509.538406 translate
0.000000 rotate
0.000000 0.000000 m /zero glyphshow
6.362305 0.000000 m /period glyphshow
9.541016 0.000000 m /eight glyphshow
15.903320 0.000000 m /eight glyphshow
grestore
1.500 setlinewidth
2 setlinecap
0.122 0.467 0.706 setrgbcolor
gsave
330.6 238.8 46.3 310.4 clipbox
61.327273 368.769478 m
66.6 377.840874 l
71.872727 384.094667 l
77.145455 393.226292 l
82.418182 400.728912 l
87.690909 404.819022 l
92.963636 410.561528 l
98.236364 413.978146 l
103.509091 421.378246 l
108.781818 425.560576 l
114.054545 429.479337 l
119.327273 434.348315 l
124.6 439.893641 l
129.872727 442.793549 l
135.145455 447.278211 l
140.418182 449.187663 l
145.690909 452.557657 l
150.963636 454.589042 l
156.236364 461.481609 l
161.509091 463.532151 l
166.781818 465.956516 l
172.054545 468.804923 l
177.327273 470.527912 l
182.6 475.343817 l
187.872727 475.755857 l
193.145455 478.9829 l
198.418182 479.857968 l
203.690909 485.170432 l
208.963636 485.937396 l
214.236364 488.707508 l
219.509091 491.853497 l
224.781818 495.242552 l
230.054545 496.641293 l
235.327273 498.310952 l
240.6 499.065626 l
245.872727 500.222008 l
251.145455 503.406631 l
256.418182 506.327524 l
261.690909 507.777574 l
266.963636 509.887254 l
272.236364 511.559416 l
277.509091 514.716732 l
282.781818 516.38729 l
288.054545 515.358136 l
293.327273 518.337782 l
298.6 520.578508 l
303.872727 521.889489 l
309.145455 523.571695 l
314.418182 525.340345 l
319.690909 525.51455 l
324.963636 527.519624 l
330.236364 528.133721 l
335.509091 533.115873 l
340.781818 533.543379 l
346.054545 536.60886 l
351.327273 537.792164 l
356.6 537.781029 l
361.872727 538.345455 l
stroke
grestore
1.000 0.498 0.055 setrgbcolor
gsave
330.6 238.8 46.3 310.4 clipbox
61.327273 324.198825 m
66.6 329.761465 l
71.872727 330.683331 l
77.145455 332.220358 l
82.418182 336.063973 l
87.690909 337.623182 l
92.963636 338.051454 l
98.236364 340.279968 l
103.509091 340.825962 l
108.781818 342.333296 l
114.054545 343.966037 l
119.327273 341.39274 l
124.6 342.1244 l
129.872727 343.740025 l
135.145455 343.374282 l
140.418182 343.184599 l
145.690909 342.656071 l
150.963636 342.873002 l
156.236364 341.840749 l
161.509091 340.955561 l
166.781818 342.90514 l
172.054545 340.800636 l
177.327273 335.308385 l
182.6 338.881797 l
187.872727 336.864624 l
193.145455 336.564206 l
198.418182 338.933672 l
203.690909 339.023099 l
208.963636 339.121958 l
214.236364 334.911902 l
219.509091 335.484619 l
224.781818 337.338308 l
230.054545 337.703003 l
235.327273 332.67413 l
240.6 334.94893 l
245.872727 331.668077 l
251.145455 336.310247 l
256.418182 331.26024 l
261.690909 333.148338 l
266.963636 334.607291 l
272.236364 333.463079 l
277.509091 329.516938 l
282.781818 328.890075 l
288.054545 330.339072 l
293.327273 329.199926 l
298.6 329.693696 l
303.872727 327.077956 l
309.145455 326.752735 l
314.418182 325.437704 l
319.690909 329.408647 l
324.963636 325.472287 l
330.236364 328.723273 l
335.509091 325.373603 l
340.781818 326.687062 l
346.054545 323.426818 l
351.327273 323.615978 l
356.6 321.254545 l
361.872727 324.15481 l
stroke
grestore
0.800 setlinewidth
0 setlinejoin
[] 0 setdash
0.000 setgray
gsave
46.3 310.4 m
46.3 549.2 l
stroke
grestore
gsave
376.9 310.4 m
376.9 549.2 l
stroke
grestore
gsave
46.3 310.4 m
376.9 310.4 l
stroke
grestore
gsave
46.3 549.2 m
376.9 549.2 l
stroke
grestore
/DejaVuSans findfont
12.000 scalefont
setfont
gsave
184.615625 555.200000 translate
0.000000 rotate
0.000000 0.000000 m /zero glyphshow
7.634766 0.000000 m /space glyphshow
11.449219 0.000000 m /hyphen glyphshow
15.779297 0.000000 m /space glyphshow
19.593750 0.000000 m /zero glyphshow
27.228516 0.000000 m /period glyphshow
31.042969 0.000000 m /eight glyphshow
38.677734 0.000000 m /four glyphshow
46.312500 0.000000 m /five glyphshow
grestore
1.000 setlinewidth
0 setlinecap
0.800 setgray
gsave
53.3 511.85625 m
118.815625 511.85625 l
120.148958 511.85625 120.815625 512.522917 120.815625 513.85625 c
120.815625 542.2 l
120.815625 543.533333 120.148958 544.2 118.815625 544.2 c
53.3 544.2 l
51.966667 544.2 51.3 543.533333 51.3 542.2 c
51.3 513.85625 l
51.3 512.522917 51.966667 511.85625 53.3 511.85625 c
cl
gsave
1.000 setgray
fill
grestore
stroke
grestore
1.500 setlinewidth
1 setlinejoin
2 setlinecap
[] 0 setdash
0.122 0.467 0.706 setrgbcolor
gsave
55.3 536.10625 m
75.3 536.10625 l
stroke
grestore
0.000 setgray
/DejaVuSans findfont
10.000 scalefont
setfont
gsave
83.300000 532.606250 translate
0.000000 rotate
0.000000 0.000000 m /a glyphshow
6.127930 0.000000 m /u glyphshow
12.465820 0.000000 m /c glyphshow
grestore
1.000 0.498 0.055 setrgbcolor
gsave
55.3 521.434375 m
75.3 521.434375 l
stroke
grestore
0.000 setgray
gsave
83.300000 517.934375 translate
0.000000 rotate
0.000000 0.000000 m /v glyphshow
5.917969 0.000000 m /a glyphshow
12.045898 0.000000 m /l glyphshow
14.824219 0.000000 m /A glyphshow
21.665039 0.000000 m /u glyphshow
28.002930 0.000000 m /c glyphshow
grestore
gsave
426.7 310.4 m
757.3 310.4 l
757.3 549.2 l
426.7 549.2 l
cl
1.000 setgray
fill
grestore
0.800 setlinewidth
0 setlinecap
gsave
/o {
gsave
newpath
translate
0.8 setlinewidth
1 setlinejoin
0 setlinecap
0 0 m
0 -3.5 l

gsave
0.000 setgray
fill
grestore
stroke
grestore
} bind def
431.182 310.4 o
grestore
gsave
428.002131 295.806250 translate
0.000000 rotate
0.000000 0.000000 m /zero glyphshow
grestore
gsave
/o {
gsave
newpath
translate
0.8 setlinewidth
1 setlinejoin
0 setlinecap
0 0 m
0 -3.5 l

gsave
0.000 setgray
fill
grestore
stroke
grestore
} bind def
483.909 310.4 o
grestore
gsave
477.549716 295.806250 translate
0.000000 rotate
0.000000 0.000000 m /one glyphshow
6.362305 0.000000 m /zero glyphshow
grestore
gsave
/o {
gsave
newpath
translate
0.8 setlinewidth
1 setlinejoin
0 setlinecap
0 0 m
0 -3.5 l

gsave
0.000 setgray
fill
grestore
stroke
grestore
} bind def
536.636 310.4 o
grestore
gsave
530.276989 295.806250 translate
0.000000 rotate
0.000000 0.000000 m /two glyphshow
6.362305 0.000000 m /zero glyphshow
grestore
gsave
/o {
gsave
newpath
translate
0.8 setlinewidth
1 setlinejoin
0 setlinecap
0 0 m
0 -3.5 l

gsave
0.000 setgray
fill
grestore
stroke
grestore
} bind def
589.364 310.4 o
grestore
gsave
583.004261 295.806250 translate
0.000000 rotate
0.000000 0.000000 m /three glyphshow
6.362305 0.000000 m /zero glyphshow
grestore
gsave
/o {
gsave
newpath
translate
0.8 setlinewidth
1 setlinejoin
0 setlinecap
0 0 m
0 -3.5 l

gsave
0.000 setgray
fill
grestore
stroke
grestore
} bind def
642.091 310.4 o
grestore
gsave
635.731534 295.806250 translate
0.000000 rotate
0.000000 0.000000 m /four glyphshow
6.362305 0.000000 m /zero glyphshow
grestore
gsave
/o {
gsave
newpath
translate
0.8 setlinewidth
1 setlinejoin
0 setlinecap
0 0 m
0 -3.5 l

gsave
0.000 setgray
fill
grestore
stroke
grestore
} bind def
694.818 310.4 o
grestore
gsave
688.458807 295.806250 translate
0.000000 rotate
0.000000 0.000000 m /five glyphshow
6.362305 0.000000 m /zero glyphshow
grestore
gsave
/o {
gsave
newpath
translate
0.8 setlinewidth
1 setlinejoin
0 setlinecap
0 0 m
0 -3.5 l

gsave
0.000 setgray
fill
grestore
stroke
grestore
} bind def
747.545 310.4 o
grestore
gsave
741.186080 295.806250 translate
0.000000 rotate
0.000000 0.000000 m /six glyphshow
6.362305 0.000000 m /zero glyphshow
grestore
gsave
/o {
gsave
newpath
translate
0.8 setlinewidth
1 setlinejoin
0 setlinecap
0 0 m
-3.5 0 l

gsave
0.000 setgray
fill
grestore
stroke
grestore
} bind def
426.7 330.027 o
grestore
gsave
391.075000 326.230599 translate
0.000000 rotate
0.000000 0.000000 m /zero glyphshow
6.362305 0.000000 m /period glyphshow
9.541016 0.000000 m /eight glyphshow
15.903320 0.000000 m /four glyphshow
22.265625 0.000000 m /zero glyphshow
grestore
gsave
/o {
gsave
newpath
translate
0.8 setlinewidth
1 setlinejoin
0 setlinecap
0 0 m
-3.5 0 l

gsave
0.000 setgray
fill
grestore
stroke
grestore
} bind def
426.7 361.724 o
grestore
gsave
391.075000 357.926759 translate
0.000000 rotate
0.000000 0.000000 m /zero glyphshow
6.362305 0.000000 m /period glyphshow
9.541016 0.000000 m /eight glyphshow
15.903320 0.000000 m /four glyphshow
22.265625 0.000000 m /five glyphshow
grestore
gsave
/o {
gsave
newpath
translate
0.8 setlinewidth
1 setlinejoin
0 setlinecap
0 0 m
-3.5 0 l

gsave
0.000 setgray
fill
grestore
stroke
grestore
} bind def
426.7 393.42 o
grestore
gsave
391.075000 389.622919 translate
0.000000 rotate
0.000000 0.000000 m /zero glyphshow
6.362305 0.000000 m /period glyphshow
9.541016 0.000000 m /eight glyphshow
15.903320 0.000000 m /five glyphshow
22.265625 0.000000 m /zero glyphshow
grestore
gsave
/o {
gsave
newpath
translate
0.8 setlinewidth
1 setlinejoin
0 setlinecap
0 0 m
-3.5 0 l

gsave
0.000 setgray
fill
grestore
stroke
grestore
} bind def
426.7 425.116 o
grestore
gsave
391.075000 421.319079 translate
0.000000 rotate
0.000000 0.000000 m /zero glyphshow
6.362305 0.000000 m /period glyphshow
9.541016 0.000000 m /eight glyphshow
15.903320 0.000000 m /five glyphshow
22.265625 0.000000 m /five glyphshow
grestore
gsave
/o {
gsave
newpath
translate
0.8 setlinewidth
1 setlinejoin
0 setlinecap
0 0 m
-3.5 0 l

gsave
0.000 setgray
fill
grestore
stroke
grestore
} bind def
426.7 456.812 o
grestore
gsave
391.075000 453.015239 translate
0.000000 rotate
0.000000 0.000000 m /zero glyphshow
6.362305 0.000000 m /period glyphshow
9.541016 0.000000 m /eight glyphshow
15.903320 0.000000 m /six glyphshow
22.265625 0.000000 m /zero glyphshow
grestore
gsave
/o {
gsave
newpath
translate
0.8 setlinewidth
1 setlinejoin
0 setlinecap
0 0 m
-3.5 0 l

gsave
0.000 setgray
fill
grestore
stroke
grestore
} bind def
426.7 488.508 o
grestore
gsave
391.075000 484.711399 translate
0.000000 rotate
0.000000 0.000000 m /zero glyphshow
6.362305 0.000000 m /period glyphshow
9.541016 0.000000 m /eight glyphshow
15.903320 0.000000 m /six glyphshow
22.265625 0.000000 m /five glyphshow
grestore
gsave
/o {
gsave
newpath
translate
0.8 setlinewidth
1 setlinejoin
0 setlinecap
0 0 m
-3.5 0 l

gsave
0.000 setgray
fill
grestore
stroke
grestore
} bind def
426.7 520.204 o
grestore
gsave
391.075000 516.407559 translate
0.000000 rotate
0.000000 0.000000 m /zero glyphshow
6.362305 0.000000 m /period glyphshow
9.541016 0.000000 m /eight glyphshow
15.903320 0.000000 m /seven glyphshow
22.265625 0.000000 m /zero glyphshow
grestore
1.500 setlinewidth
2 setlinecap
0.122 0.467 0.706 setrgbcolor
gsave
330.6 238.8 426.7 310.4 clipbox
441.727273 381.226727 m
447 390.047838 l
452.272727 408.119499 l
457.545455 412.721048 l
462.818182 417.743396 l
468.090909 428.362562 l
473.363636 433.073056 l
478.636364 437.10571 l
483.909091 442.774619 l
489.181818 443.88496 l
494.454545 449.702477 l
499.727273 455.106769 l
505 456.343844 l
510.272727 459.877098 l
515.545455 462.858308 l
520.818182 464.718666 l
526.090909 470.756752 l
531.363636 472.261167 l
536.636364 476.439705 l
541.909091 474.969165 l
547.181818 480.494488 l
552.454545 482.836798 l
557.727273 485.519177 l
563 488.360844 l
568.272727 491.467469 l
573.545455 492.751824 l
578.818182 494.376078 l
584.090909 496.385937 l
589.363636 498.402051 l
594.636364 498.646793 l
599.909091 500.014048 l
605.181818 503.936056 l
610.454545 504.559806 l
615.727273 506.372841 l
621 509.280769 l
626.272727 509.786638 l
631.545455 512.146311 l
636.818182 512.873091 l
642.090909 512.166781 l
647.363636 514.631398 l
652.636364 516.745349 l
657.909091 518.57779 l
663.181818 519.64932 l
668.454545 521.835788 l
673.727273 522.565802 l
679 526.270133 l
684.272727 525.414662 l
689.545455 527.412179 l
694.818182 526.564624 l
700.090909 529.0006 l
705.363636 530.134944 l
710.636364 532.526023 l
715.909091 533.737649 l
721.181818 533.864 l
726.454545 535.273173 l
731.727273 535.510638 l
737 537.506496 l
742.272727 538.345455 l
stroke
grestore
1.000 0.498 0.055 setrgbcolor
gsave
330.6 238.8 426.7 310.4 clipbox
441.727273 321.254545 m
447 328.694307 l
452.272727 337.055787 l
457.545455 341.085494 l
462.818182 340.634248 l
468.090909 345.210638 l
473.363636 349.452069 l
478.636364 348.626948 l
483.909091 348.968162 l
489.181818 348.980439 l
494.454545 352.545001 l
499.727273 352.880424 l
505 354.514452 l
510.272727 354.590895 l
515.545455 351.463216 l
520.818182 353.605475 l
526.090909 352.141938 l
531.363636 356.157283 l
536.636364 356.526989 l
541.909091 354.886938 l
547.181818 356.381979 l
552.454545 358.101716 l
557.727273 358.983822 l
563 358.889311 l
568.272727 358.02064 l
573.545455 357.792237 l
578.818182 359.028762 l
584.090909 359.987774 l
589.363636 360.125372 l
594.636364 360.36999 l
599.909091 361.285453 l
605.181818 361.553699 l
610.454545 362.707294 l
615.727273 361.57501 l
621 360.821467 l
626.272727 360.795291 l
631.545455 360.52774 l
636.818182 360.708192 l
642.090909 360.29679 l
647.363636 360.176102 l
652.636364 359.758445 l
657.909091 362.183775 l
663.181818 359.794582 l
668.454545 359.095939 l
673.727273 359.958587 l
679 358.557363 l
684.272727 359.328511 l
689.545455 359.007914 l
694.818182 359.056559 l
700.090909 357.989599 l
705.363636 358.732255 l
710.636364 358.110982 l
715.909091 357.899489 l
721.181818 360.315553 l
726.454545 358.511729 l
731.727273 359.770954 l
737 359.403564 l
742.272727 358.574736 l
stroke
grestore
0.800 setlinewidth
0 setlinejoin
[] 0 setdash
0.000 setgray
gsave
426.7 310.4 m
426.7 549.2 l
stroke
grestore
gsave
757.3 310.4 m
757.3 549.2 l
stroke
grestore
gsave
426.7 310.4 m
757.3 310.4 l
stroke
grestore
gsave
426.7 549.2 m
757.3 549.2 l
stroke
grestore
/DejaVuSans findfont
12.000 scalefont
setfont
gsave
559.289062 555.200000 translate
0.000000 rotate
0.000000 0.000000 m /zero glyphshow
7.634766 0.000000 m /period glyphshow
11.449219 0.000000 m /two glyphshow
19.083984 0.000000 m /space glyphshow
22.898438 0.000000 m /hyphen glyphshow
27.228516 0.000000 m /space glyphshow
31.042969 0.000000 m /zero glyphshow
38.677734 0.000000 m /period glyphshow
42.492188 0.000000 m /eight glyphshow
50.126953 0.000000 m /four glyphshow
57.761719 0.000000 m /five glyphshow
grestore
1.000 setlinewidth
0 setlinecap
0.800 setgray
gsave
433.7 511.85625 m
499.215625 511.85625 l
500.548958 511.85625 501.215625 512.522917 501.215625 513.85625 c
501.215625 542.2 l
501.215625 543.533333 500.548958 544.2 499.215625 544.2 c
433.7 544.2 l
432.366667 544.2 431.7 543.533333 431.7 542.2 c
431.7 513.85625 l
431.7 512.522917 432.366667 511.85625 433.7 511.85625 c
cl
gsave
1.000 setgray
fill
grestore
stroke
grestore
1.500 setlinewidth
1 setlinejoin
2 setlinecap
[] 0 setdash
0.122 0.467 0.706 setrgbcolor
gsave
435.7 536.10625 m
455.7 536.10625 l
stroke
grestore
0.000 setgray
/DejaVuSans findfont
10.000 scalefont
setfont
gsave
463.700000 532.606250 translate
0.000000 rotate
0.000000 0.000000 m /a glyphshow
6.127930 0.000000 m /u glyphshow
12.465820 0.000000 m /c glyphshow
grestore
1.000 0.498 0.055 setrgbcolor
gsave
435.7 521.434375 m
455.7 521.434375 l
stroke
grestore
0.000 setgray
gsave
463.700000 517.934375 translate
0.000000 rotate
0.000000 0.000000 m /v glyphshow
5.917969 0.000000 m /a glyphshow
12.045898 0.000000 m /l glyphshow
14.824219 0.000000 m /A glyphshow
21.665039 0.000000 m /u glyphshow
28.002930 0.000000 m /c glyphshow
grestore
gsave
807.1 310.4 m
1137.7 310.4 l
1137.7 549.2 l
807.1 549.2 l
cl
1.000 setgray
fill
grestore
0.800 setlinewidth
0 setlinecap
gsave
/o {
gsave
newpath
translate
0.8 setlinewidth
1 setlinejoin
0 setlinecap
0 0 m
0 -3.5 l

gsave
0.000 setgray
fill
grestore
stroke
grestore
} bind def
811.582 310.4 o
grestore
gsave
808.402131 295.806250 translate
0.000000 rotate
0.000000 0.000000 m /zero glyphshow
grestore
gsave
/o {
gsave
newpath
translate
0.8 setlinewidth
1 setlinejoin
0 setlinecap
0 0 m
0 -3.5 l

gsave
0.000 setgray
fill
grestore
stroke
grestore
} bind def
864.309 310.4 o
grestore
gsave
857.949716 295.806250 translate
0.000000 rotate
0.000000 0.000000 m /one glyphshow
6.362305 0.000000 m /zero glyphshow
grestore
gsave
/o {
gsave
newpath
translate
0.8 setlinewidth
1 setlinejoin
0 setlinecap
0 0 m
0 -3.5 l

gsave
0.000 setgray
fill
grestore
stroke
grestore
} bind def
917.036 310.4 o
grestore
gsave
910.676989 295.806250 translate
0.000000 rotate
0.000000 0.000000 m /two glyphshow
6.362305 0.000000 m /zero glyphshow
grestore
gsave
/o {
gsave
newpath
translate
0.8 setlinewidth
1 setlinejoin
0 setlinecap
0 0 m
0 -3.5 l

gsave
0.000 setgray
fill
grestore
stroke
grestore
} bind def
969.764 310.4 o
grestore
gsave
963.404261 295.806250 translate
0.000000 rotate
0.000000 0.000000 m /three glyphshow
6.362305 0.000000 m /zero glyphshow
grestore
gsave
/o {
gsave
newpath
translate
0.8 setlinewidth
1 setlinejoin
0 setlinecap
0 0 m
0 -3.5 l

gsave
0.000 setgray
fill
grestore
stroke
grestore
} bind def
1022.49 310.4 o
grestore
gsave
1016.131534 295.806250 translate
0.000000 rotate
0.000000 0.000000 m /four glyphshow
6.362305 0.000000 m /zero glyphshow
grestore
gsave
/o {
gsave
newpath
translate
0.8 setlinewidth
1 setlinejoin
0 setlinecap
0 0 m
0 -3.5 l

gsave
0.000 setgray
fill
grestore
stroke
grestore
} bind def
1075.22 310.4 o
grestore
gsave
1068.858807 295.806250 translate
0.000000 rotate
0.000000 0.000000 m /five glyphshow
6.362305 0.000000 m /zero glyphshow
grestore
gsave
/o {
gsave
newpath
translate
0.8 setlinewidth
1 setlinejoin
0 setlinecap
0 0 m
0 -3.5 l

gsave
0.000 setgray
fill
grestore
stroke
grestore
} bind def
1127.95 310.4 o
grestore
gsave
1121.586080 295.806250 translate
0.000000 rotate
0.000000 0.000000 m /six glyphshow
6.362305 0.000000 m /zero glyphshow
grestore
gsave
/o {
gsave
newpath
translate
0.8 setlinewidth
1 setlinejoin
0 setlinecap
0 0 m
-3.5 0 l

gsave
0.000 setgray
fill
grestore
stroke
grestore
} bind def
807.1 341.659 o
grestore
gsave
771.475000 337.862304 translate
0.000000 rotate
0.000000 0.000000 m /zero glyphshow
6.362305 0.000000 m /period glyphshow
9.541016 0.000000 m /eight glyphshow
15.903320 0.000000 m /four glyphshow
22.265625 0.000000 m /zero glyphshow
grestore
gsave
/o {
gsave
newpath
translate
0.8 setlinewidth
1 setlinejoin
0 setlinecap
0 0 m
-3.5 0 l

gsave
0.000 setgray
fill
grestore
stroke
grestore
} bind def
807.1 381.874 o
grestore
gsave
771.475000 378.076719 translate
0.000000 rotate
0.000000 0.000000 m /zero glyphshow
6.362305 0.000000 m /period glyphshow
9.541016 0.000000 m /eight glyphshow
15.903320 0.000000 m /four glyphshow
22.265625 0.000000 m /five glyphshow
grestore
gsave
/o {
gsave
newpath
translate
0.8 setlinewidth
1 setlinejoin
0 setlinecap
0 0 m
-3.5 0 l

gsave
0.000 setgray
fill
grestore
stroke
grestore
} bind def
807.1 422.088 o
grestore
gsave
771.475000 418.291133 translate
0.000000 rotate
0.000000 0.000000 m /zero glyphshow
6.362305 0.000000 m /period glyphshow
9.541016 0.000000 m /eight glyphshow
15.903320 0.000000 m /five glyphshow
22.265625 0.000000 m /zero glyphshow
grestore
gsave
/o {
gsave
newpath
translate
0.8 setlinewidth
1 setlinejoin
0 setlinecap
0 0 m
-3.5 0 l

gsave
0.000 setgray
fill
grestore
stroke
grestore
} bind def
807.1 462.302 o
grestore
gsave
771.475000 458.505547 translate
0.000000 rotate
0.000000 0.000000 m /zero glyphshow
6.362305 0.000000 m /period glyphshow
9.541016 0.000000 m /eight glyphshow
15.903320 0.000000 m /five glyphshow
22.265625 0.000000 m /five glyphshow
grestore
gsave
/o {
gsave
newpath
translate
0.8 setlinewidth
1 setlinejoin
0 setlinecap
0 0 m
-3.5 0 l

gsave
0.000 setgray
fill
grestore
stroke
grestore
} bind def
807.1 502.517 o
grestore
gsave
771.475000 498.719962 translate
0.000000 rotate
0.000000 0.000000 m /zero glyphshow
6.362305 0.000000 m /period glyphshow
9.541016 0.000000 m /eight glyphshow
15.903320 0.000000 m /six glyphshow
22.265625 0.000000 m /zero glyphshow
grestore
gsave
/o {
gsave
newpath
translate
0.8 setlinewidth
1 setlinejoin
0 setlinecap
0 0 m
-3.5 0 l

gsave
0.000 setgray
fill
grestore
stroke
grestore
} bind def
807.1 542.731 o
grestore
gsave
771.475000 538.934376 translate
0.000000 rotate
0.000000 0.000000 m /zero glyphshow
6.362305 0.000000 m /period glyphshow
9.541016 0.000000 m /eight glyphshow
15.903320 0.000000 m /six glyphshow
22.265625 0.000000 m /five glyphshow
grestore
1.500 setlinewidth
2 setlinecap
0.122 0.467 0.706 setrgbcolor
gsave
330.6 238.8 807.1 310.4 clipbox
822.127273 368.84433 m
827.4 388.120367 l
832.672727 392.918764 l
837.945455 402.783312 l
843.218182 413.637721 l
848.490909 418.254106 l
853.763636 426.084775 l
859.036364 431.059677 l
864.309091 434.398685 l
869.581818 439.74274 l
874.854545 444.075984 l
880.127273 450.326588 l
885.4 453.614033 l
890.672727 457.684383 l
895.945455 460.198965 l
901.218182 463.220924 l
906.490909 467.955825 l
911.763636 469.411596 l
917.036364 473.948233 l
922.309091 476.669611 l
927.581818 477.339831 l
932.854545 480.246082 l
938.127273 485.741912 l
943.4 487.014322 l
948.672727 487.767206 l
953.945455 487.341792 l
959.218182 492.836921 l
964.490909 495.672548 l
969.763636 496.734869 l
975.036364 499.026081 l
980.309091 501.60146 l
985.581818 503.192701 l
990.854545 505.778717 l
996.127273 507.010307 l
1001.4 508.67865 l
1006.672727 510.46146 l
1011.945455 510.497473 l
1017.218182 513.681845 l
1022.490909 513.185969 l
1027.763636 513.573588 l
1033.036364 516.738197 l
1038.309091 518.062494 l
1043.581818 520.257652 l
1048.854545 520.933488 l
1054.127273 523.327017 l
1059.4 524.448839 l
1064.672727 525.295564 l
1069.945455 527.365834 l
1075.218182 527.109419 l
1080.490909 529.538368 l
1085.763636 530.096013 l
1091.036364 530.207833 l
1096.309091 532.628359 l
1101.581818 531.968937 l
1106.854545 533.963509 l
1112.127273 534.777784 l
1117.4 535.719322 l
1122.672727 538.345455 l
stroke
grestore
1.000 0.498 0.055 setrgbcolor
gsave
330.6 238.8 807.1 310.4 clipbox
822.127273 321.254545 m
827.4 334.471803 l
832.672727 332.121781 l
837.945455 340.372721 l
843.218182 347.657907 l
848.490909 350.86259 l
853.763636 354.446403 l
859.036364 356.617734 l
864.309091 356.623318 l
869.581818 362.699988 l
874.854545 359.670764 l
880.127273 365.067644 l
885.4 367.429716 l
890.672727 368.675263 l
895.945455 369.273643 l
901.218182 369.271879 l
906.490909 372.17267 l
911.763636 369.121403 l
917.036364 368.150358 l
922.309091 371.232191 l
927.581818 372.229686 l
932.854545 373.51491 l
938.127273 376.150308 l
943.4 374.891536 l
948.672727 374.107117 l
953.945455 373.801462 l
959.218182 376.345752 l
964.490909 376.385428 l
969.763636 376.105929 l
975.036364 377.487258 l
980.309091 377.787917 l
985.581818 376.743986 l
990.854545 377.32767 l
996.127273 377.707683 l
1001.4 377.730313 l
1006.672727 378.08358 l
1011.945455 379.909285 l
1017.218182 380.380701 l
1022.490909 379.876663 l
1027.763636 380.55704 l
1033.036364 381.541017 l
1038.309091 381.432274 l
1043.581818 379.959836 l
1048.854545 380.863284 l
1054.127273 380.765709 l
1059.4 381.818458 l
1064.672727 380.9203 l
1069.945455 381.225662 l
1075.218182 380.465931 l
1080.490909 380.827428 l
1085.763636 382.204348 l
1091.036364 384.136151 l
1096.309091 381.94072 l
1101.581818 382.121175 l
1106.854545 383.230352 l
1112.127273 383.326751 l
1117.4 384.605215 l
1122.672727 383.159522 l
stroke
grestore
0.800 setlinewidth
0 setlinejoin
[] 0 setdash
0.000 setgray
gsave
807.1 310.4 m
807.1 549.2 l
stroke
grestore
gsave
1137.7 310.4 m
1137.7 549.2 l
stroke
grestore
gsave
807.1 310.4 m
1137.7 310.4 l
stroke
grestore
gsave
807.1 549.2 m
1137.7 549.2 l
stroke
grestore
/DejaVuSans findfont
12.000 scalefont
setfont
gsave
939.689063 555.200000 translate
0.000000 rotate
0.000000 0.000000 m /zero glyphshow
7.634766 0.000000 m /period glyphshow
11.449219 0.000000 m /four glyphshow
19.083984 0.000000 m /space glyphshow
22.898438 0.000000 m /hyphen glyphshow
27.228516 0.000000 m /space glyphshow
31.042969 0.000000 m /zero glyphshow
38.677734 0.000000 m /period glyphshow
42.492188 0.000000 m /eight glyphshow
50.126953 0.000000 m /four glyphshow
57.761719 0.000000 m /five glyphshow
grestore
1.000 setlinewidth
0 setlinecap
0.800 setgray
gsave
814.1 511.85625 m
879.615625 511.85625 l
880.948958 511.85625 881.615625 512.522917 881.615625 513.85625 c
881.615625 542.2 l
881.615625 543.533333 880.948958 544.2 879.615625 544.2 c
814.1 544.2 l
812.766667 544.2 812.1 543.533333 812.1 542.2 c
812.1 513.85625 l
812.1 512.522917 812.766667 511.85625 814.1 511.85625 c
cl
gsave
1.000 setgray
fill
grestore
stroke
grestore
1.500 setlinewidth
1 setlinejoin
2 setlinecap
[] 0 setdash
0.122 0.467 0.706 setrgbcolor
gsave
816.1 536.10625 m
836.1 536.10625 l
stroke
grestore
0.000 setgray
/DejaVuSans findfont
10.000 scalefont
setfont
gsave
844.100000 532.606250 translate
0.000000 rotate
0.000000 0.000000 m /a glyphshow
6.127930 0.000000 m /u glyphshow
12.465820 0.000000 m /c glyphshow
grestore
1.000 0.498 0.055 setrgbcolor
gsave
816.1 521.434375 m
836.1 521.434375 l
stroke
grestore
0.000 setgray
gsave
844.100000 517.934375 translate
0.000000 rotate
0.000000 0.000000 m /v glyphshow
5.917969 0.000000 m /a glyphshow
12.045898 0.000000 m /l glyphshow
14.824219 0.000000 m /A glyphshow
21.665039 0.000000 m /u glyphshow
28.002930 0.000000 m /c glyphshow
grestore
gsave
46.3 27.8 m
376.9 27.8 l
376.9 266.6 l
46.3 266.6 l
cl
1.000 setgray
fill
grestore
0.800 setlinewidth
0 setlinecap
gsave
/o {
gsave
newpath
translate
0.8 setlinewidth
1 setlinejoin
0 setlinecap
0 0 m
0 -3.5 l

gsave
0.000 setgray
fill
grestore
stroke
grestore
} bind def
50.7818 27.8 o
grestore
gsave
47.602131 13.206250 translate
0.000000 rotate
0.000000 0.000000 m /zero glyphshow
grestore
gsave
/o {
gsave
newpath
translate
0.8 setlinewidth
1 setlinejoin
0 setlinecap
0 0 m
0 -3.5 l

gsave
0.000 setgray
fill
grestore
stroke
grestore
} bind def
103.509 27.8 o
grestore
gsave
97.149716 13.206250 translate
0.000000 rotate
0.000000 0.000000 m /one glyphshow
6.362305 0.000000 m /zero glyphshow
grestore
gsave
/o {
gsave
newpath
translate
0.8 setlinewidth
1 setlinejoin
0 setlinecap
0 0 m
0 -3.5 l

gsave
0.000 setgray
fill
grestore
stroke
grestore
} bind def
156.236 27.8 o
grestore
gsave
149.876989 13.206250 translate
0.000000 rotate
0.000000 0.000000 m /two glyphshow
6.362305 0.000000 m /zero glyphshow
grestore
gsave
/o {
gsave
newpath
translate
0.8 setlinewidth
1 setlinejoin
0 setlinecap
0 0 m
0 -3.5 l

gsave
0.000 setgray
fill
grestore
stroke
grestore
} bind def
208.964 27.8 o
grestore
gsave
202.604261 13.206250 translate
0.000000 rotate
0.000000 0.000000 m /three glyphshow
6.362305 0.000000 m /zero glyphshow
grestore
gsave
/o {
gsave
newpath
translate
0.8 setlinewidth
1 setlinejoin
0 setlinecap
0 0 m
0 -3.5 l

gsave
0.000 setgray
fill
grestore
stroke
grestore
} bind def
261.691 27.8 o
grestore
gsave
255.331534 13.206250 translate
0.000000 rotate
0.000000 0.000000 m /four glyphshow
6.362305 0.000000 m /zero glyphshow
grestore
gsave
/o {
gsave
newpath
translate
0.8 setlinewidth
1 setlinejoin
0 setlinecap
0 0 m
0 -3.5 l

gsave
0.000 setgray
fill
grestore
stroke
grestore
} bind def
314.418 27.8 o
grestore
gsave
308.058807 13.206250 translate
0.000000 rotate
0.000000 0.000000 m /five glyphshow
6.362305 0.000000 m /zero glyphshow
grestore
gsave
/o {
gsave
newpath
translate
0.8 setlinewidth
1 setlinejoin
0 setlinecap
0 0 m
0 -3.5 l

gsave
0.000 setgray
fill
grestore
stroke
grestore
} bind def
367.145 27.8 o
grestore
gsave
360.786080 13.206250 translate
0.000000 rotate
0.000000 0.000000 m /six glyphshow
6.362305 0.000000 m /zero glyphshow
grestore
gsave
/o {
gsave
newpath
translate
0.8 setlinewidth
1 setlinejoin
0 setlinecap
0 0 m
-3.5 0 l

gsave
0.000 setgray
fill
grestore
stroke
grestore
} bind def
46.3 53.8676 o
grestore
gsave
10.675000 50.070751 translate
0.000000 rotate
0.000000 0.000000 m /zero glyphshow
6.362305 0.000000 m /period glyphshow
9.541016 0.000000 m /eight glyphshow
15.903320 0.000000 m /three glyphshow
22.265625 0.000000 m /five glyphshow
grestore
gsave
/o {
gsave
newpath
translate
0.8 setlinewidth
1 setlinejoin
0 setlinecap
0 0 m
-3.5 0 l

gsave
0.000 setgray
fill
grestore
stroke
grestore
} bind def
46.3 92.9451 o
grestore
gsave
10.675000 89.148257 translate
0.000000 rotate
0.000000 0.000000 m /zero glyphshow
6.362305 0.000000 m /period glyphshow
9.541016 0.000000 m /eight glyphshow
15.903320 0.000000 m /four glyphshow
22.265625 0.000000 m /zero glyphshow
grestore
gsave
/o {
gsave
newpath
translate
0.8 setlinewidth
1 setlinejoin
0 setlinecap
0 0 m
-3.5 0 l

gsave
0.000 setgray
fill
grestore
stroke
grestore
} bind def
46.3 132.023 o
grestore
gsave
10.675000 128.225763 translate
0.000000 rotate
0.000000 0.000000 m /zero glyphshow
6.362305 0.000000 m /period glyphshow
9.541016 0.000000 m /eight glyphshow
15.903320 0.000000 m /four glyphshow
22.265625 0.000000 m /five glyphshow
grestore
gsave
/o {
gsave
newpath
translate
0.8 setlinewidth
1 setlinejoin
0 setlinecap
0 0 m
-3.5 0 l

gsave
0.000 setgray
fill
grestore
stroke
grestore
} bind def
46.3 171.1 o
grestore
gsave
10.675000 167.303269 translate
0.000000 rotate
0.000000 0.000000 m /zero glyphshow
6.362305 0.000000 m /period glyphshow
9.541016 0.000000 m /eight glyphshow
15.903320 0.000000 m /five glyphshow
22.265625 0.000000 m /zero glyphshow
grestore
gsave
/o {
gsave
newpath
translate
0.8 setlinewidth
1 setlinejoin
0 setlinecap
0 0 m
-3.5 0 l

gsave
0.000 setgray
fill
grestore
stroke
grestore
} bind def
46.3 210.178 o
grestore
gsave
10.675000 206.380775 translate
0.000000 rotate
0.000000 0.000000 m /zero glyphshow
6.362305 0.000000 m /period glyphshow
9.541016 0.000000 m /eight glyphshow
15.903320 0.000000 m /five glyphshow
22.265625 0.000000 m /five glyphshow
grestore
gsave
/o {
gsave
newpath
translate
0.8 setlinewidth
1 setlinejoin
0 setlinecap
0 0 m
-3.5 0 l

gsave
0.000 setgray
fill
grestore
stroke
grestore
} bind def
46.3 249.255 o
grestore
gsave
10.675000 245.458281 translate
0.000000 rotate
0.000000 0.000000 m /zero glyphshow
6.362305 0.000000 m /period glyphshow
9.541016 0.000000 m /eight glyphshow
15.903320 0.000000 m /six glyphshow
22.265625 0.000000 m /zero glyphshow
grestore
1.500 setlinewidth
2 setlinecap
0.122 0.467 0.706 setrgbcolor
gsave
330.6 238.8 46.3 27.8 clipbox
61.327273 95.35016 m
66.6 110.570517 l
71.872727 123.183685 l
77.145455 131.524414 l
82.418182 140.061002 l
87.690909 145.807711 l
92.963636 154.343931 l
98.236364 158.039548 l
103.509091 165.400037 l
108.781818 168.7957 l
114.054545 174.177553 l
119.327273 176.903528 l
124.6 180.393369 l
129.872727 179.849811 l
135.145455 184.20945 l
140.418182 186.115366 l
145.690909 191.649164 l
150.963636 193.569508 l
156.236364 198.295104 l
161.509091 199.712657 l
166.781818 198.870667 l
172.054545 201.357654 l
177.327273 204.453836 l
182.6 207.735174 l
187.872727 209.344441 l
193.145455 212.096072 l
198.418182 213.555389 l
203.690909 216.199148 l
208.963636 216.27512 l
214.236364 220.13968 l
219.509091 220.922593 l
224.781818 223.721339 l
230.054545 223.7907 l
235.327273 226.747372 l
240.6 227.814079 l
245.872727 231.114934 l
251.145455 232.237832 l
256.418182 233.058836 l
261.690909 233.955706 l
266.963636 235.183329 l
272.236364 237.02938 l
277.509091 239.784368 l
282.781818 238.82417 l
288.054545 241.198983 l
293.327273 240.514551 l
298.6 241.976806 l
303.872727 244.782163 l
309.145455 245.456364 l
314.418182 245.950446 l
319.690909 247.21511 l
324.963636 249.417936 l
330.236364 249.038652 l
335.509091 251.150291 l
340.781818 252.531065 l
346.054545 254.13561 l
351.327273 253.995838 l
356.6 255.745455 l
361.872727 255.155411 l
stroke
grestore
1.000 0.498 0.055 setrgbcolor
gsave
330.6 238.8 46.3 27.8 clipbox
61.327273 38.654545 m
66.6 47.871989 l
71.872727 56.065019 l
77.145455 64.61932 l
82.418182 72.260874 l
87.690909 74.259724 l
92.963636 79.857304 l
98.236364 82.21914 l
103.509091 88.23968 l
108.781818 90.920521 l
114.054545 95.354604 l
119.327273 96.835678 l
124.6 100.151959 l
129.872727 98.15825 l
135.145455 101.809528 l
140.418182 102.224206 l
145.690909 104.873347 l
150.963636 106.77938 l
156.236364 110.608296 l
161.509091 111.453359 l
166.781818 109.204617 l
172.054545 110.631143 l
177.327273 112.592866 l
182.6 114.813049 l
187.872727 115.309977 l
193.145455 118.749633 l
198.418182 119.156886 l
203.690909 121.818021 l
208.963636 119.553857 l
214.236364 122.081907 l
219.509091 122.817018 l
224.781818 123.269965 l
230.054545 123.877988 l
235.327273 124.261536 l
240.6 126.220118 l
245.872727 128.882967 l
251.145455 128.458008 l
256.418182 126.866124 l
261.690909 127.147717 l
266.963636 128.523979 l
272.236364 127.700906 l
277.509091 130.958641 l
282.781818 131.233665 l
288.054545 132.485409 l
293.327273 131.120856 l
298.6 131.518684 l
303.872727 133.936782 l
309.145455 131.868533 l
314.418182 134.102996 l
319.690909 133.922502 l
324.963636 135.480686 l
330.236364 135.109703 l
335.509091 136.589349 l
340.781818 135.973616 l
346.054545 137.392431 l
351.327273 135.882512 l
356.6 136.886935 l
361.872727 135.635476 l
stroke
grestore
0.800 setlinewidth
0 setlinejoin
[] 0 setdash
0.000 setgray
gsave
46.3 27.8 m
46.3 266.6 l
stroke
grestore
gsave
376.9 27.8 m
376.9 266.6 l
stroke
grestore
gsave
46.3 27.8 m
376.9 27.8 l
stroke
grestore
gsave
46.3 266.6 m
376.9 266.6 l
stroke
grestore
/DejaVuSans findfont
12.000 scalefont
setfont
gsave
178.889062 272.600000 translate
0.000000 rotate
0.000000 0.000000 m /zero glyphshow
7.634766 0.000000 m /period glyphshow
11.449219 0.000000 m /five glyphshow
19.083984 0.000000 m /space glyphshow
22.898438 0.000000 m /hyphen glyphshow
27.228516 0.000000 m /space glyphshow
31.042969 0.000000 m /zero glyphshow
38.677734 0.000000 m /period glyphshow
42.492188 0.000000 m /eight glyphshow
50.126953 0.000000 m /four glyphshow
57.761719 0.000000 m /six glyphshow
grestore
1.000 setlinewidth
0 setlinecap
0.800 setgray
gsave
53.3 229.25625 m
118.815625 229.25625 l
120.148958 229.25625 120.815625 229.922917 120.815625 231.25625 c
120.815625 259.6 l
120.815625 260.933333 120.148958 261.6 118.815625 261.6 c
53.3 261.6 l
51.966667 261.6 51.3 260.933333 51.3 259.6 c
51.3 231.25625 l
51.3 229.922917 51.966667 229.25625 53.3 229.25625 c
cl
gsave
1.000 setgray
fill
grestore
stroke
grestore
1.500 setlinewidth
1 setlinejoin
2 setlinecap
[] 0 setdash
0.122 0.467 0.706 setrgbcolor
gsave
55.3 253.50625 m
75.3 253.50625 l
stroke
grestore
0.000 setgray
/DejaVuSans findfont
10.000 scalefont
setfont
gsave
83.300000 250.006250 translate
0.000000 rotate
0.000000 0.000000 m /a glyphshow
6.127930 0.000000 m /u glyphshow
12.465820 0.000000 m /c glyphshow
grestore
1.000 0.498 0.055 setrgbcolor
gsave
55.3 238.834375 m
75.3 238.834375 l
stroke
grestore
0.000 setgray
gsave
83.300000 235.334375 translate
0.000000 rotate
0.000000 0.000000 m /v glyphshow
5.917969 0.000000 m /a glyphshow
12.045898 0.000000 m /l glyphshow
14.824219 0.000000 m /A glyphshow
21.665039 0.000000 m /u glyphshow
28.002930 0.000000 m /c glyphshow
grestore
gsave
426.7 27.8 m
757.3 27.8 l
757.3 266.6 l
426.7 266.6 l
cl
1.000 setgray
fill
grestore
0.800 setlinewidth
0 setlinecap
gsave
/o {
gsave
newpath
translate
0.8 setlinewidth
1 setlinejoin
0 setlinecap
0 0 m
0 -3.5 l

gsave
0.000 setgray
fill
grestore
stroke
grestore
} bind def
431.182 27.8 o
grestore
gsave
428.002131 13.206250 translate
0.000000 rotate
0.000000 0.000000 m /zero glyphshow
grestore
gsave
/o {
gsave
newpath
translate
0.8 setlinewidth
1 setlinejoin
0 setlinecap
0 0 m
0 -3.5 l

gsave
0.000 setgray
fill
grestore
stroke
grestore
} bind def
483.909 27.8 o
grestore
gsave
477.549716 13.206250 translate
0.000000 rotate
0.000000 0.000000 m /one glyphshow
6.362305 0.000000 m /zero glyphshow
grestore
gsave
/o {
gsave
newpath
translate
0.8 setlinewidth
1 setlinejoin
0 setlinecap
0 0 m
0 -3.5 l

gsave
0.000 setgray
fill
grestore
stroke
grestore
} bind def
536.636 27.8 o
grestore
gsave
530.276989 13.206250 translate
0.000000 rotate
0.000000 0.000000 m /two glyphshow
6.362305 0.000000 m /zero glyphshow
grestore
gsave
/o {
gsave
newpath
translate
0.8 setlinewidth
1 setlinejoin
0 setlinecap
0 0 m
0 -3.5 l

gsave
0.000 setgray
fill
grestore
stroke
grestore
} bind def
589.364 27.8 o
grestore
gsave
583.004261 13.206250 translate
0.000000 rotate
0.000000 0.000000 m /three glyphshow
6.362305 0.000000 m /zero glyphshow
grestore
gsave
/o {
gsave
newpath
translate
0.8 setlinewidth
1 setlinejoin
0 setlinecap
0 0 m
0 -3.5 l

gsave
0.000 setgray
fill
grestore
stroke
grestore
} bind def
642.091 27.8 o
grestore
gsave
635.731534 13.206250 translate
0.000000 rotate
0.000000 0.000000 m /four glyphshow
6.362305 0.000000 m /zero glyphshow
grestore
gsave
/o {
gsave
newpath
translate
0.8 setlinewidth
1 setlinejoin
0 setlinecap
0 0 m
0 -3.5 l

gsave
0.000 setgray
fill
grestore
stroke
grestore
} bind def
694.818 27.8 o
grestore
gsave
688.458807 13.206250 translate
0.000000 rotate
0.000000 0.000000 m /five glyphshow
6.362305 0.000000 m /zero glyphshow
grestore
gsave
/o {
gsave
newpath
translate
0.8 setlinewidth
1 setlinejoin
0 setlinecap
0 0 m
0 -3.5 l

gsave
0.000 setgray
fill
grestore
stroke
grestore
} bind def
747.545 27.8 o
grestore
gsave
741.186080 13.206250 translate
0.000000 rotate
0.000000 0.000000 m /six glyphshow
6.362305 0.000000 m /zero glyphshow
grestore
gsave
/o {
gsave
newpath
translate
0.8 setlinewidth
1 setlinejoin
0 setlinecap
0 0 m
-3.5 0 l

gsave
0.000 setgray
fill
grestore
stroke
grestore
} bind def
426.7 43.0271 o
grestore
gsave
391.075000 39.230239 translate
0.000000 rotate
0.000000 0.000000 m /zero glyphshow
6.362305 0.000000 m /period glyphshow
9.541016 0.000000 m /eight glyphshow
15.903320 0.000000 m /three glyphshow
22.265625 0.000000 m /zero glyphshow
grestore
gsave
/o {
gsave
newpath
translate
0.8 setlinewidth
1 setlinejoin
0 setlinecap
0 0 m
-3.5 0 l

gsave
0.000 setgray
fill
grestore
stroke
grestore
} bind def
426.7 82.7117 o
grestore
gsave
391.075000 78.914800 translate
0.000000 rotate
0.000000 0.000000 m /zero glyphshow
6.362305 0.000000 m /period glyphshow
9.541016 0.000000 m /eight glyphshow
15.903320 0.000000 m /three glyphshow
22.265625 0.000000 m /five glyphshow
grestore
gsave
/o {
gsave
newpath
translate
0.8 setlinewidth
1 setlinejoin
0 setlinecap
0 0 m
-3.5 0 l

gsave
0.000 setgray
fill
grestore
stroke
grestore
} bind def
426.7 122.396 o
grestore
gsave
391.075000 118.599360 translate
0.000000 rotate
0.000000 0.000000 m /zero glyphshow
6.362305 0.000000 m /period glyphshow
9.541016 0.000000 m /eight glyphshow
15.903320 0.000000 m /four glyphshow
22.265625 0.000000 m /zero glyphshow
grestore
gsave
/o {
gsave
newpath
translate
0.8 setlinewidth
1 setlinejoin
0 setlinecap
0 0 m
-3.5 0 l

gsave
0.000 setgray
fill
grestore
stroke
grestore
} bind def
426.7 162.081 o
grestore
gsave
391.075000 158.283921 translate
0.000000 rotate
0.000000 0.000000 m /zero glyphshow
6.362305 0.000000 m /period glyphshow
9.541016 0.000000 m /eight glyphshow
15.903320 0.000000 m /four glyphshow
22.265625 0.000000 m /five glyphshow
grestore
gsave
/o {
gsave
newpath
translate
0.8 setlinewidth
1 setlinejoin
0 setlinecap
0 0 m
-3.5 0 l

gsave
0.000 setgray
fill
grestore
stroke
grestore
} bind def
426.7 201.765 o
grestore
gsave
391.075000 197.968482 translate
0.000000 rotate
0.000000 0.000000 m /zero glyphshow
6.362305 0.000000 m /period glyphshow
9.541016 0.000000 m /eight glyphshow
15.903320 0.000000 m /five glyphshow
22.265625 0.000000 m /zero glyphshow
grestore
gsave
/o {
gsave
newpath
translate
0.8 setlinewidth
1 setlinejoin
0 setlinecap
0 0 m
-3.5 0 l

gsave
0.000 setgray
fill
grestore
stroke
grestore
} bind def
426.7 241.45 o
grestore
gsave
391.075000 237.653043 translate
0.000000 rotate
0.000000 0.000000 m /zero glyphshow
6.362305 0.000000 m /period glyphshow
9.541016 0.000000 m /eight glyphshow
15.903320 0.000000 m /five glyphshow
22.265625 0.000000 m /five glyphshow
grestore
1.500 setlinewidth
2 setlinecap
0.122 0.467 0.706 setrgbcolor
gsave
330.6 238.8 426.7 27.8 clipbox
441.727273 85.6475 m
447 98.292021 l
452.272727 108.515246 l
457.545455 118.727015 l
462.818182 130.256609 l
468.090909 138.655989 l
473.363636 143.867878 l
478.636364 151.1307 l
483.909091 159.575797 l
489.181818 163.447642 l
494.454545 169.204554 l
499.727273 171.124039 l
505 176.530941 l
510.272727 184.820134 l
515.545455 187.329292 l
520.818182 189.493129 l
526.090909 192.583167 l
531.363636 194.518104 l
536.636364 198.886752 l
541.909091 201.410989 l
547.181818 204.657676 l
552.454545 205.885561 l
557.727273 209.050621 l
563 210.338607 l
568.272727 213.349948 l
573.545455 212.937545 l
578.818182 215.225636 l
584.090909 217.170004 l
589.363636 219.957081 l
594.636364 222.098433 l
599.909091 225.555425 l
605.181818 225.72369 l
610.454545 226.508428 l
615.727273 229.437608 l
621 229.914056 l
626.272727 229.913363 l
631.545455 231.307168 l
636.818182 232.707313 l
642.090909 233.654615 l
647.363636 233.52434 l
652.636364 234.938019 l
657.909091 238.871459 l
663.181818 238.040313 l
668.454545 238.007544 l
673.727273 240.343642 l
679 241.98979 l
684.272727 241.309059 l
689.545455 244.760776 l
694.818182 245.300523 l
700.090909 246.195235 l
705.363636 248.438516 l
710.636364 249.062448 l
715.909091 249.926203 l
721.181818 250.63933 l
726.454545 251.873609 l
731.727273 252.816647 l
737 254.24402 l
742.272727 255.745455 l
stroke
grestore
1.000 0.498 0.055 setrgbcolor
gsave
330.6 238.8 426.7 27.8 clipbox
441.727273 38.654545 m
447 49.584807 l
452.272727 58.376406 l
457.545455 66.724554 l
462.818182 74.211901 l
468.090909 77.968335 l
473.363636 83.368065 l
478.636364 87.820855 l
483.909091 93.155908 l
489.181818 96.685541 l
494.454545 100.970406 l
499.727273 102.931281 l
505 105.702202 l
510.272727 113.669544 l
515.545455 115.454372 l
520.818182 116.301832 l
526.090909 116.073581 l
531.363636 117.842458 l
536.636364 121.840195 l
541.909091 122.980583 l
547.181818 125.270639 l
552.454545 124.060645 l
557.727273 126.143621 l
563 125.373308 l
568.272727 128.14858 l
573.545455 129.264316 l
578.818182 128.931364 l
584.090909 129.604808 l
589.363636 131.281166 l
594.636364 132.834262 l
599.909091 134.367057 l
605.181818 133.65591 l
610.454545 133.856029 l
615.727273 137.115936 l
621 138.0011 l
626.272727 138.601457 l
631.545455 139.816671 l
636.818182 139.841324 l
642.090909 139.044618 l
647.363636 139.388301 l
652.636364 140.591334 l
657.909091 142.493044 l
663.181818 141.81844 l
668.454545 140.692844 l
673.727273 142.358761 l
679 144.407224 l
684.272727 142.624136 l
689.545455 144.78078 l
694.818182 143.070488 l
700.090909 143.436503 l
705.363636 144.67724 l
710.636364 145.545872 l
715.909091 146.643916 l
721.181818 147.11028 l
726.454545 147.96296 l
731.727273 147.620148 l
737 148.291271 l
742.272727 149.669481 l
stroke
grestore
0.800 setlinewidth
0 setlinejoin
[] 0 setdash
0.000 setgray
gsave
426.7 27.8 m
426.7 266.6 l
stroke
grestore
gsave
757.3 27.8 m
757.3 266.6 l
stroke
grestore
gsave
426.7 27.8 m
757.3 27.8 l
stroke
grestore
gsave
426.7 266.6 m
757.3 266.6 l
stroke
grestore
/DejaVuSans findfont
12.000 scalefont
setfont
gsave
559.289062 272.600000 translate
0.000000 rotate
0.000000 0.000000 m /zero glyphshow
7.634766 0.000000 m /period glyphshow
11.449219 0.000000 m /six glyphshow
19.083984 0.000000 m /space glyphshow
22.898438 0.000000 m /hyphen glyphshow
27.228516 0.000000 m /space glyphshow
31.042969 0.000000 m /zero glyphshow
38.677734 0.000000 m /period glyphshow
42.492188 0.000000 m /eight glyphshow
50.126953 0.000000 m /four glyphshow
57.761719 0.000000 m /three glyphshow
grestore
1.000 setlinewidth
0 setlinecap
0.800 setgray
gsave
433.7 229.25625 m
499.215625 229.25625 l
500.548958 229.25625 501.215625 229.922917 501.215625 231.25625 c
501.215625 259.6 l
501.215625 260.933333 500.548958 261.6 499.215625 261.6 c
433.7 261.6 l
432.366667 261.6 431.7 260.933333 431.7 259.6 c
431.7 231.25625 l
431.7 229.922917 432.366667 229.25625 433.7 229.25625 c
cl
gsave
1.000 setgray
fill
grestore
stroke
grestore
1.500 setlinewidth
1 setlinejoin
2 setlinecap
[] 0 setdash
0.122 0.467 0.706 setrgbcolor
gsave
435.7 253.50625 m
455.7 253.50625 l
stroke
grestore
0.000 setgray
/DejaVuSans findfont
10.000 scalefont
setfont
gsave
463.700000 250.006250 translate
0.000000 rotate
0.000000 0.000000 m /a glyphshow
6.127930 0.000000 m /u glyphshow
12.465820 0.000000 m /c glyphshow
grestore
1.000 0.498 0.055 setrgbcolor
gsave
435.7 238.834375 m
455.7 238.834375 l
stroke
grestore
0.000 setgray
gsave
463.700000 235.334375 translate
0.000000 rotate
0.000000 0.000000 m /v glyphshow
5.917969 0.000000 m /a glyphshow
12.045898 0.000000 m /l glyphshow
14.824219 0.000000 m /A glyphshow
21.665039 0.000000 m /u glyphshow
28.002930 0.000000 m /c glyphshow
grestore
gsave
807.1 27.8 m
1137.7 27.8 l
1137.7 266.6 l
807.1 266.6 l
cl
1.000 setgray
fill
grestore
0.800 setlinewidth
0 setlinecap
gsave
/o {
gsave
newpath
translate
0.8 setlinewidth
1 setlinejoin
0 setlinecap
0 0 m
0 -3.5 l

gsave
0.000 setgray
fill
grestore
stroke
grestore
} bind def
811.582 27.8 o
grestore
gsave
808.402131 13.206250 translate
0.000000 rotate
0.000000 0.000000 m /zero glyphshow
grestore
gsave
/o {
gsave
newpath
translate
0.8 setlinewidth
1 setlinejoin
0 setlinecap
0 0 m
0 -3.5 l

gsave
0.000 setgray
fill
grestore
stroke
grestore
} bind def
864.309 27.8 o
grestore
gsave
857.949716 13.206250 translate
0.000000 rotate
0.000000 0.000000 m /one glyphshow
6.362305 0.000000 m /zero glyphshow
grestore
gsave
/o {
gsave
newpath
translate
0.8 setlinewidth
1 setlinejoin
0 setlinecap
0 0 m
0 -3.5 l

gsave
0.000 setgray
fill
grestore
stroke
grestore
} bind def
917.036 27.8 o
grestore
gsave
910.676989 13.206250 translate
0.000000 rotate
0.000000 0.000000 m /two glyphshow
6.362305 0.000000 m /zero glyphshow
grestore
gsave
/o {
gsave
newpath
translate
0.8 setlinewidth
1 setlinejoin
0 setlinecap
0 0 m
0 -3.5 l

gsave
0.000 setgray
fill
grestore
stroke
grestore
} bind def
969.764 27.8 o
grestore
gsave
963.404261 13.206250 translate
0.000000 rotate
0.000000 0.000000 m /three glyphshow
6.362305 0.000000 m /zero glyphshow
grestore
gsave
/o {
gsave
newpath
translate
0.8 setlinewidth
1 setlinejoin
0 setlinecap
0 0 m
0 -3.5 l

gsave
0.000 setgray
fill
grestore
stroke
grestore
} bind def
1022.49 27.8 o
grestore
gsave
1016.131534 13.206250 translate
0.000000 rotate
0.000000 0.000000 m /four glyphshow
6.362305 0.000000 m /zero glyphshow
grestore
gsave
/o {
gsave
newpath
translate
0.8 setlinewidth
1 setlinejoin
0 setlinecap
0 0 m
0 -3.5 l

gsave
0.000 setgray
fill
grestore
stroke
grestore
} bind def
1075.22 27.8 o
grestore
gsave
1068.858807 13.206250 translate
0.000000 rotate
0.000000 0.000000 m /five glyphshow
6.362305 0.000000 m /zero glyphshow
grestore
gsave
/o {
gsave
newpath
translate
0.8 setlinewidth
1 setlinejoin
0 setlinecap
0 0 m
0 -3.5 l

gsave
0.000 setgray
fill
grestore
stroke
grestore
} bind def
1127.95 27.8 o
grestore
gsave
1121.586080 13.206250 translate
0.000000 rotate
0.000000 0.000000 m /six glyphshow
6.362305 0.000000 m /zero glyphshow
grestore
gsave
/o {
gsave
newpath
translate
0.8 setlinewidth
1 setlinejoin
0 setlinecap
0 0 m
-3.5 0 l

gsave
0.000 setgray
fill
grestore
stroke
grestore
} bind def
807.1 28.3653 o
grestore
gsave
771.475000 24.568440 translate
0.000000 rotate
0.000000 0.000000 m /zero glyphshow
6.362305 0.000000 m /period glyphshow
9.541016 0.000000 m /eight glyphshow
15.903320 0.000000 m /two glyphshow
22.265625 0.000000 m /zero glyphshow
grestore
gsave
/o {
gsave
newpath
translate
0.8 setlinewidth
1 setlinejoin
0 setlinecap
0 0 m
-3.5 0 l

gsave
0.000 setgray
fill
grestore
stroke
grestore
} bind def
807.1 78.9168 o
grestore
gsave
771.475000 75.119940 translate
0.000000 rotate
0.000000 0.000000 m /zero glyphshow
6.362305 0.000000 m /period glyphshow
9.541016 0.000000 m /eight glyphshow
15.903320 0.000000 m /two glyphshow
22.265625 0.000000 m /five glyphshow
grestore
gsave
/o {
gsave
newpath
translate
0.8 setlinewidth
1 setlinejoin
0 setlinecap
0 0 m
-3.5 0 l

gsave
0.000 setgray
fill
grestore
stroke
grestore
} bind def
807.1 129.468 o
grestore
gsave
771.475000 125.671439 translate
0.000000 rotate
0.000000 0.000000 m /zero glyphshow
6.362305 0.000000 m /period glyphshow
9.541016 0.000000 m /eight glyphshow
15.903320 0.000000 m /three glyphshow
22.265625 0.000000 m /zero glyphshow
grestore
gsave
/o {
gsave
newpath
translate
0.8 setlinewidth
1 setlinejoin
0 setlinecap
0 0 m
-3.5 0 l

gsave
0.000 setgray
fill
grestore
stroke
grestore
} bind def
807.1 180.02 o
grestore
gsave
771.475000 176.222938 translate
0.000000 rotate
0.000000 0.000000 m /zero glyphshow
6.362305 0.000000 m /period glyphshow
9.541016 0.000000 m /eight glyphshow
15.903320 0.000000 m /three glyphshow
22.265625 0.000000 m /five glyphshow
grestore
gsave
/o {
gsave
newpath
translate
0.8 setlinewidth
1 setlinejoin
0 setlinecap
0 0 m
-3.5 0 l

gsave
0.000 setgray
fill
grestore
stroke
grestore
} bind def
807.1 230.571 o
grestore
gsave
771.475000 226.774438 translate
0.000000 rotate
0.000000 0.000000 m /zero glyphshow
6.362305 0.000000 m /period glyphshow
9.541016 0.000000 m /eight glyphshow
15.903320 0.000000 m /four glyphshow
22.265625 0.000000 m /zero glyphshow
grestore
1.500 setlinewidth
2 setlinecap
0.122 0.467 0.706 setrgbcolor
gsave
330.6 238.8 807.1 27.8 clipbox
822.127273 86.892054 m
827.4 101.859822 l
832.672727 112.263984 l
837.945455 123.482073 l
843.218182 130.943423 l
848.490909 136.938933 l
853.763636 142.359495 l
859.036364 149.122167 l
864.309091 150.350522 l
869.581818 155.270729 l
874.854545 160.071684 l
880.127273 161.928538 l
885.4 165.992806 l
890.672727 168.625916 l
895.945455 173.081401 l
901.218182 175.795822 l
906.490909 177.853782 l
911.763636 181.168196 l
917.036364 183.210069 l
922.309091 185.679539 l
927.581818 187.02701 l
932.854545 189.90385 l
938.127273 192.226037 l
943.4 193.87174 l
948.672727 196.635301 l
953.945455 198.716812 l
959.218182 201.479083 l
964.490909 203.729258 l
969.763636 204.813791 l
975.036364 206.578609 l
980.309091 209.439839 l
985.581818 211.905101 l
990.854545 214.064258 l
996.127273 215.175262 l
1001.4 215.688581 l
1006.672727 217.152453 l
1011.945455 220.261417 l
1017.218182 222.249603 l
1022.490909 224.629821 l
1027.763636 227.7284 l
1033.036364 229.936494 l
1038.309091 232.021195 l
1043.581818 233.292445 l
1048.854545 234.749462 l
1054.127273 235.249275 l
1059.4 236.836607 l
1064.672727 236.95104 l
1069.945455 239.095876 l
1075.218182 239.91211 l
1080.490909 242.860691 l
1085.763636 245.642713 l
1091.036364 246.736206 l
1096.309091 247.780016 l
1101.581818 250.173604 l
1106.854545 251.788696 l
1112.127273 253.570551 l
1117.4 254.474068 l
1122.672727 255.745455 l
stroke
grestore
1.000 0.498 0.055 setrgbcolor
gsave
330.6 238.8 807.1 27.8 clipbox
822.127273 38.654545 m
827.4 49.356299 l
832.672727 61.170826 l
837.945455 71.144401 l
843.218182 76.239806 l
848.490909 81.119454 l
853.763636 84.374277 l
859.036364 91.582915 l
864.309091 92.089796 l
869.581818 94.954483 l
874.854545 98.558063 l
880.127273 100.384606 l
885.4 103.497562 l
890.672727 106.507811 l
895.945455 111.324284 l
901.218182 113.775561 l
906.490909 114.291308 l
911.763636 117.045161 l
917.036364 116.340258 l
922.309091 117.818782 l
927.581818 119.427352 l
932.854545 120.468452 l
938.127273 122.654836 l
943.4 123.782755 l
948.672727 125.532823 l
953.945455 126.9829 l
959.218182 130.505941 l
964.490909 130.662217 l
969.763636 130.957405 l
975.036364 132.725575 l
980.309091 136.179899 l
985.581818 137.709407 l
990.854545 138.660362 l
996.127273 139.116628 l
1001.4 139.910569 l
1006.672727 141.631081 l
1011.945455 143.242606 l
1017.218182 145.3418 l
1022.490909 147.254055 l
1027.763636 149.642895 l
1033.036364 150.938913 l
1038.309091 152.667923 l
1043.581818 153.204728 l
1048.854545 153.994974 l
1054.127273 153.455952 l
1059.4 154.631161 l
1064.672727 154.13758 l
1069.945455 155.256264 l
1075.218182 156.691194 l
1080.490909 158.421681 l
1085.763636 160.328394 l
1091.036364 161.15189 l
1096.309091 161.567886 l
1101.581818 163.760551 l
1106.854545 164.646853 l
1112.127273 166.604549 l
1117.4 167.814486 l
1122.672727 169.391284 l
stroke
grestore
0.800 setlinewidth
0 setlinejoin
[] 0 setdash
0.000 setgray
gsave
807.1 27.8 m
807.1 266.6 l
stroke
grestore
gsave
1137.7 27.8 m
1137.7 266.6 l
stroke
grestore
gsave
807.1 27.8 m
1137.7 27.8 l
stroke
grestore
gsave
807.1 266.6 m
1137.7 266.6 l
stroke
grestore
/DejaVuSans findfont
12.000 scalefont
setfont
gsave
939.689063 272.600000 translate
0.000000 rotate
0.000000 0.000000 m /zero glyphshow
7.634766 0.000000 m /period glyphshow
11.449219 0.000000 m /eight glyphshow
19.083984 0.000000 m /space glyphshow
22.898438 0.000000 m /hyphen glyphshow
27.228516 0.000000 m /space glyphshow
31.042969 0.000000 m /zero glyphshow
38.677734 0.000000 m /period glyphshow
42.492188 0.000000 m /eight glyphshow
50.126953 0.000000 m /three glyphshow
57.761719 0.000000 m /four glyphshow
grestore
1.000 setlinewidth
0 setlinecap
0.800 setgray
gsave
814.1 229.25625 m
879.615625 229.25625 l
880.948958 229.25625 881.615625 229.922917 881.615625 231.25625 c
881.615625 259.6 l
881.615625 260.933333 880.948958 261.6 879.615625 261.6 c
814.1 261.6 l
812.766667 261.6 812.1 260.933333 812.1 259.6 c
812.1 231.25625 l
812.1 229.922917 812.766667 229.25625 814.1 229.25625 c
cl
gsave
1.000 setgray
fill
grestore
stroke
grestore
1.500 setlinewidth
1 setlinejoin
2 setlinecap
[] 0 setdash
0.122 0.467 0.706 setrgbcolor
gsave
816.1 253.50625 m
836.1 253.50625 l
stroke
grestore
0.000 setgray
/DejaVuSans findfont
10.000 scalefont
setfont
gsave
844.100000 250.006250 translate
0.000000 rotate
0.000000 0.000000 m /a glyphshow
6.127930 0.000000 m /u glyphshow
12.465820 0.000000 m /c glyphshow
grestore
1.000 0.498 0.055 setrgbcolor
gsave
816.1 238.834375 m
836.1 238.834375 l
stroke
grestore
0.000 setgray
gsave
844.100000 235.334375 translate
0.000000 rotate
0.000000 0.000000 m /v glyphshow
5.917969 0.000000 m /a glyphshow
12.045898 0.000000 m /l glyphshow
14.824219 0.000000 m /A glyphshow
21.665039 0.000000 m /u glyphshow
28.002930 0.000000 m /c glyphshow
grestore

end
showpage
