%!PS-Adobe-3.0 EPSF-3.0
%%Title: imgNets/opti_3_400_100_30.eps
%%Creator: matplotlib version 2.0.2, http://matplotlib.org/
%%CreationDate: Thu Apr 19 17:17:58 2018
%%Orientation: portrait
%%BoundingBox: -270 108 882 684
%%EndComments
%%BeginProlog
/mpldict 8 dict def
mpldict begin
/m { moveto } bind def
/l { lineto } bind def
/r { rlineto } bind def
/c { curveto } bind def
/cl { closepath } bind def
/box {
m
1 index 0 r
0 exch r
neg 0 r
cl
} bind def
/clipbox {
box
clip
newpath
} bind def
%!PS-Adobe-3.0 Resource-Font
%%Title: DejaVu Sans
%%Copyright: Copyright (c) 2003 by Bitstream, Inc. All Rights Reserved. Copyright (c) 2006 by Tavmjong Bah. All Rights Reserved. DejaVu changes are in public domain 
%%Creator: Converted from TrueType to type 3 by PPR
25 dict begin
/_d{bind def}bind def
/_m{moveto}_d
/_l{lineto}_d
/_cl{closepath eofill}_d
/_c{curveto}_d
/_sc{7 -1 roll{setcachedevice}{pop pop pop pop pop pop}ifelse}_d
/_e{exec}_d
/FontName /DejaVuSans def
/PaintType 0 def
/FontMatrix[.001 0 0 .001 0 0]def
/FontBBox[-1021 -463 1793 1232]def
/FontType 3 def
/Encoding [ /space /hyphen /period /zero /one /two /three /four /five /six /seven /eight /nine /A /D /G /M /R /S /a /c /d /e /g /l /m /o /p /r /t /u /v /x ] def
/FontInfo 10 dict dup begin
/FamilyName (DejaVu Sans) def
/FullName (DejaVu Sans) def
/Notice (Copyright (c) 2003 by Bitstream, Inc. All Rights Reserved. Copyright (c) 2006 by Tavmjong Bah. All Rights Reserved. DejaVu changes are in public domain ) def
/Weight (Book) def
/Version (Version 2.35) def
/ItalicAngle 0.0 def
/isFixedPitch false def
/UnderlinePosition -130 def
/UnderlineThickness 90 def
end readonly def
/CharStrings 33 dict dup begin
/space{318 0 0 0 0 0 _sc
}_d
/hyphen{361 0 49 234 312 314 _sc
49 314 _m
312 314 _l
312 234 _l
49 234 _l
49 314 _l
_cl}_d
/period{318 0 107 0 210 124 _sc
107 124 _m
210 124 _l
210 0 _l
107 0 _l
107 124 _l
_cl}_d
/zero{636 0 66 -13 570 742 _sc
318 664 _m
267 664 229 639 203 589 _c
177 539 165 464 165 364 _c
165 264 177 189 203 139 _c
229 89 267 64 318 64 _c
369 64 407 89 433 139 _c
458 189 471 264 471 364 _c
471 464 458 539 433 589 _c
407 639 369 664 318 664 _c
318 742 _m
399 742 461 709 505 645 _c
548 580 570 486 570 364 _c
570 241 548 147 505 83 _c
461 19 399 -13 318 -13 _c
236 -13 173 19 130 83 _c
87 147 66 241 66 364 _c
66 486 87 580 130 645 _c
173 709 236 742 318 742 _c
_cl}_d
/one{636 0 110 0 544 729 _sc
124 83 _m
285 83 _l
285 639 _l
110 604 _l
110 694 _l
284 729 _l
383 729 _l
383 83 _l
544 83 _l
544 0 _l
124 0 _l
124 83 _l
_cl}_d
/two{{636 0 73 0 536 742 _sc
192 83 _m
536 83 _l
536 0 _l
73 0 _l
73 83 _l
110 121 161 173 226 239 _c
290 304 331 346 348 365 _c
380 400 402 430 414 455 _c
426 479 433 504 433 528 _c
433 566 419 598 392 622 _c
365 646 330 659 286 659 _c
255 659 222 653 188 643 _c
154 632 117 616 78 594 _c
78 694 _l
118 710 155 722 189 730 _c
223 738 255 742 284 742 _c
}_e{359 742 419 723 464 685 _c
509 647 532 597 532 534 _c
532 504 526 475 515 449 _c
504 422 484 390 454 354 _c
446 344 420 317 376 272 _c
332 227 271 164 192 83 _c
_cl}_e}_d
/three{{636 0 76 -13 556 742 _sc
406 393 _m
453 383 490 362 516 330 _c
542 298 556 258 556 212 _c
556 140 531 84 482 45 _c
432 6 362 -13 271 -13 _c
240 -13 208 -10 176 -4 _c
144 1 110 10 76 22 _c
76 117 _l
103 101 133 89 166 81 _c
198 73 232 69 268 69 _c
330 69 377 81 409 105 _c
441 129 458 165 458 212 _c
458 254 443 288 413 312 _c
383 336 341 349 287 349 _c
}_e{202 349 _l
202 430 _l
291 430 _l
339 430 376 439 402 459 _c
428 478 441 506 441 543 _c
441 580 427 609 401 629 _c
374 649 336 659 287 659 _c
260 659 231 656 200 650 _c
169 644 135 635 98 623 _c
98 711 _l
135 721 170 729 203 734 _c
235 739 266 742 296 742 _c
370 742 429 725 473 691 _c
517 657 539 611 539 553 _c
539 513 527 479 504 451 _c
481 423 448 403 406 393 _c
_cl}_e}_d
/four{636 0 49 0 580 729 _sc
378 643 _m
129 254 _l
378 254 _l
378 643 _l
352 729 _m
476 729 _l
476 254 _l
580 254 _l
580 172 _l
476 172 _l
476 0 _l
378 0 _l
378 172 _l
49 172 _l
49 267 _l
352 729 _l
_cl}_d
/five{{636 0 77 -13 549 729 _sc
108 729 _m
495 729 _l
495 646 _l
198 646 _l
198 467 _l
212 472 227 476 241 478 _c
255 480 270 482 284 482 _c
365 482 429 459 477 415 _c
525 370 549 310 549 234 _c
549 155 524 94 475 51 _c
426 8 357 -13 269 -13 _c
238 -13 207 -10 175 -6 _c
143 -1 111 6 77 17 _c
77 116 _l
106 100 136 88 168 80 _c
199 72 232 69 267 69 _c
}_e{323 69 368 83 401 113 _c
433 143 450 183 450 234 _c
450 284 433 324 401 354 _c
368 384 323 399 267 399 _c
241 399 214 396 188 390 _c
162 384 135 375 108 363 _c
108 729 _l
_cl}_e}_d
/six{{636 0 70 -13 573 742 _sc
330 404 _m
286 404 251 388 225 358 _c
199 328 186 286 186 234 _c
186 181 199 139 225 109 _c
251 79 286 64 330 64 _c
374 64 409 79 435 109 _c
461 139 474 181 474 234 _c
474 286 461 328 435 358 _c
409 388 374 404 330 404 _c
526 713 _m
526 623 _l
501 635 476 644 451 650 _c
425 656 400 659 376 659 _c
310 659 260 637 226 593 _c
}_e{192 549 172 482 168 394 _c
187 422 211 444 240 459 _c
269 474 301 482 336 482 _c
409 482 467 459 509 415 _c
551 371 573 310 573 234 _c
573 159 550 99 506 54 _c
462 9 403 -13 330 -13 _c
246 -13 181 19 137 83 _c
92 147 70 241 70 364 _c
70 479 97 571 152 639 _c
206 707 280 742 372 742 _c
396 742 421 739 447 735 _c
472 730 498 723 526 713 _c
_cl}_e}_d
/seven{636 0 82 0 551 729 _sc
82 729 _m
551 729 _l
551 687 _l
286 0 _l
183 0 _l
432 646 _l
82 646 _l
82 729 _l
_cl}_d
/eight{{636 0 68 -13 568 742 _sc
318 346 _m
271 346 234 333 207 308 _c
180 283 167 249 167 205 _c
167 161 180 126 207 101 _c
234 76 271 64 318 64 _c
364 64 401 76 428 102 _c
455 127 469 161 469 205 _c
469 249 455 283 429 308 _c
402 333 365 346 318 346 _c
219 388 _m
177 398 144 418 120 447 _c
96 476 85 511 85 553 _c
85 611 105 657 147 691 _c
188 725 245 742 318 742 _c
}_e{390 742 447 725 489 691 _c
530 657 551 611 551 553 _c
551 511 539 476 515 447 _c
491 418 459 398 417 388 _c
464 377 501 355 528 323 _c
554 291 568 251 568 205 _c
568 134 546 80 503 43 _c
459 5 398 -13 318 -13 _c
237 -13 175 5 132 43 _c
89 80 68 134 68 205 _c
68 251 81 291 108 323 _c
134 355 171 377 219 388 _c
183 544 _m
183 506 194 476 218 455 _c
}_e{242 434 275 424 318 424 _c
360 424 393 434 417 455 _c
441 476 453 506 453 544 _c
453 582 441 611 417 632 _c
393 653 360 664 318 664 _c
275 664 242 653 218 632 _c
194 611 183 582 183 544 _c
_cl}_e}_d
/nine{{636 0 63 -13 566 742 _sc
110 15 _m
110 105 _l
134 93 159 84 185 78 _c
210 72 235 69 260 69 _c
324 69 374 90 408 134 _c
442 178 462 244 468 334 _c
448 306 424 284 396 269 _c
367 254 335 247 300 247 _c
226 247 168 269 126 313 _c
84 357 63 417 63 494 _c
63 568 85 628 129 674 _c
173 719 232 742 306 742 _c
390 742 455 709 499 645 _c
543 580 566 486 566 364 _c
}_e{566 248 538 157 484 89 _c
429 21 356 -13 264 -13 _c
239 -13 214 -10 189 -6 _c
163 -2 137 5 110 15 _c
306 324 _m
350 324 385 339 411 369 _c
437 399 450 441 450 494 _c
450 546 437 588 411 618 _c
385 648 350 664 306 664 _c
262 664 227 648 201 618 _c
175 588 162 546 162 494 _c
162 441 175 399 201 369 _c
227 339 262 324 306 324 _c
_cl}_e}_d
/A{684 0 8 0 676 729 _sc
342 632 _m
208 269 _l
476 269 _l
342 632 _l
286 729 _m
398 729 _l
676 0 _l
573 0 _l
507 187 _l
178 187 _l
112 0 _l
8 0 _l
286 729 _l
_cl}_d
/D{770 0 98 0 711 729 _sc
197 648 _m
197 81 _l
316 81 _l
416 81 490 103 537 149 _c
583 195 607 267 607 365 _c
607 463 583 534 537 580 _c
490 625 416 648 316 648 _c
197 648 _l
98 729 _m
301 729 _l
442 729 546 699 612 641 _c
678 582 711 490 711 365 _c
711 239 677 147 611 88 _c
545 29 441 0 301 0 _c
98 0 _l
98 729 _l
_cl}_d
/G{{775 0 56 -13 693 742 _sc
595 104 _m
595 300 _l
434 300 _l
434 381 _l
693 381 _l
693 68 _l
655 40 613 20 567 7 _c
521 -6 472 -13 420 -13 _c
306 -13 216 20 152 86 _c
88 152 56 245 56 364 _c
56 482 88 575 152 642 _c
216 708 306 742 420 742 _c
467 742 512 736 555 724 _c
598 712 638 695 674 673 _c
674 568 _l
637 598 598 621 557 637 _c
516 653 473 661 428 661 _c
}_e{338 661 271 636 227 586 _c
182 536 160 462 160 364 _c
160 265 182 191 227 141 _c
271 91 338 67 428 67 _c
462 67 493 70 521 76 _c
549 82 573 91 595 104 _c
_cl}_e}_d
/M{863 0 98 0 765 729 _sc
98 729 _m
245 729 _l
431 233 _l
618 729 _l
765 729 _l
765 0 _l
669 0 _l
669 640 _l
481 140 _l
382 140 _l
194 640 _l
194 0 _l
98 0 _l
98 729 _l
_cl}_d
/R{{695 0 98 0 666 729 _sc
444 342 _m
465 334 486 319 506 296 _c
526 272 546 240 566 199 _c
666 0 _l
560 0 _l
467 187 _l
443 235 419 268 397 284 _c
374 300 343 308 304 308 _c
197 308 _l
197 0 _l
98 0 _l
98 729 _l
321 729 _l
404 729 466 711 507 677 _c
548 642 569 589 569 519 _c
569 473 558 434 537 404 _c
515 374 484 353 444 342 _c
197 648 _m
197 389 _l
321 389 _l
}_e{368 389 404 400 428 422 _c
452 444 465 476 465 519 _c
465 561 452 593 428 615 _c
404 637 368 648 321 648 _c
197 648 _l
_cl}_e}_d
/S{{635 0 66 -13 579 742 _sc
535 705 _m
535 609 _l
497 627 462 640 429 649 _c
395 657 363 662 333 662 _c
279 662 237 651 208 631 _c
179 610 165 580 165 542 _c
165 510 174 485 194 469 _c
213 452 250 439 304 429 _c
364 417 _l
437 403 491 378 526 343 _c
561 307 579 260 579 201 _c
579 130 555 77 508 41 _c
460 5 391 -13 300 -13 _c
265 -13 228 -9 189 -2 _c
}_e{150 5 110 16 69 32 _c
69 134 _l
109 111 148 94 186 83 _c
224 71 262 66 300 66 _c
356 66 399 77 430 99 _c
460 121 476 152 476 194 _c
476 230 465 258 443 278 _c
421 298 385 313 335 323 _c
275 335 _l
201 349 148 372 115 404 _c
82 435 66 478 66 534 _c
66 598 88 649 134 686 _c
179 723 242 742 322 742 _c
356 742 390 739 426 733 _c
461 727 497 717 535 705 _c
}_e{_cl}_e}_d
/a{{613 0 60 -13 522 560 _sc
343 275 _m
270 275 220 266 192 250 _c
164 233 150 205 150 165 _c
150 133 160 107 181 89 _c
202 70 231 61 267 61 _c
317 61 357 78 387 114 _c
417 149 432 196 432 255 _c
432 275 _l
343 275 _l
522 312 _m
522 0 _l
432 0 _l
432 83 _l
411 49 385 25 355 10 _c
325 -5 287 -13 243 -13 _c
187 -13 142 2 109 33 _c
76 64 60 106 60 159 _c
}_e{60 220 80 266 122 298 _c
163 329 224 345 306 345 _c
432 345 _l
432 354 _l
432 395 418 427 391 450 _c
364 472 326 484 277 484 _c
245 484 215 480 185 472 _c
155 464 127 453 100 439 _c
100 522 _l
132 534 164 544 195 550 _c
226 556 256 560 286 560 _c
365 560 424 539 463 498 _c
502 457 522 395 522 312 _c
_cl}_e}_d
/c{{550 0 55 -13 488 560 _sc
488 526 _m
488 442 _l
462 456 437 466 411 473 _c
385 480 360 484 334 484 _c
276 484 230 465 198 428 _c
166 391 150 339 150 273 _c
150 206 166 154 198 117 _c
230 80 276 62 334 62 _c
360 62 385 65 411 72 _c
437 79 462 90 488 104 _c
488 21 _l
462 9 436 0 410 -5 _c
383 -10 354 -13 324 -13 _c
242 -13 176 12 128 64 _c
}_e{79 115 55 185 55 273 _c
55 362 79 432 128 483 _c
177 534 244 560 330 560 _c
358 560 385 557 411 551 _c
437 545 463 537 488 526 _c
_cl}_e}_d
/d{{635 0 55 -13 544 760 _sc
454 464 _m
454 760 _l
544 760 _l
544 0 _l
454 0 _l
454 82 _l
435 49 411 25 382 10 _c
353 -5 319 -13 279 -13 _c
213 -13 159 13 117 65 _c
75 117 55 187 55 273 _c
55 359 75 428 117 481 _c
159 533 213 560 279 560 _c
319 560 353 552 382 536 _c
411 520 435 496 454 464 _c
148 273 _m
148 207 161 155 188 117 _c
215 79 253 61 301 61 _c
}_e{348 61 385 79 413 117 _c
440 155 454 207 454 273 _c
454 339 440 390 413 428 _c
385 466 348 485 301 485 _c
253 485 215 466 188 428 _c
161 390 148 339 148 273 _c
_cl}_e}_d
/e{{615 0 55 -13 562 560 _sc
562 296 _m
562 252 _l
149 252 _l
153 190 171 142 205 110 _c
238 78 284 62 344 62 _c
378 62 412 66 444 74 _c
476 82 509 95 541 113 _c
541 28 _l
509 14 476 3 442 -3 _c
408 -9 373 -13 339 -13 _c
251 -13 182 12 131 62 _c
80 112 55 181 55 268 _c
55 357 79 428 127 481 _c
175 533 241 560 323 560 _c
397 560 455 536 498 489 _c
}_e{540 441 562 377 562 296 _c
472 322 _m
471 371 457 410 431 440 _c
404 469 368 484 324 484 _c
274 484 234 469 204 441 _c
174 413 156 373 152 322 _c
472 322 _l
_cl}_e}_d
/g{{635 0 55 -207 544 560 _sc
454 280 _m
454 344 440 395 414 431 _c
387 467 349 485 301 485 _c
253 485 215 467 188 431 _c
161 395 148 344 148 280 _c
148 215 161 165 188 129 _c
215 93 253 75 301 75 _c
349 75 387 93 414 129 _c
440 165 454 215 454 280 _c
544 68 _m
544 -24 523 -93 482 -139 _c
440 -184 377 -207 292 -207 _c
260 -207 231 -204 203 -200 _c
175 -195 147 -188 121 -178 _c
}_e{121 -91 _l
147 -105 173 -115 199 -122 _c
225 -129 251 -133 278 -133 _c
336 -133 380 -117 410 -87 _c
439 -56 454 -10 454 52 _c
454 96 _l
435 64 411 40 382 24 _c
353 8 319 0 279 0 _c
211 0 157 25 116 76 _c
75 127 55 195 55 280 _c
55 364 75 432 116 483 _c
157 534 211 560 279 560 _c
319 560 353 552 382 536 _c
411 520 435 496 454 464 _c
454 547 _l
544 547 _l
}_e{544 68 _l
_cl}_e}_d
/l{278 0 94 0 184 760 _sc
94 760 _m
184 760 _l
184 0 _l
94 0 _l
94 760 _l
_cl}_d
/m{{974 0 91 0 889 560 _sc
520 442 _m
542 482 569 511 600 531 _c
631 550 668 560 711 560 _c
767 560 811 540 842 500 _c
873 460 889 403 889 330 _c
889 0 _l
799 0 _l
799 327 _l
799 379 789 418 771 444 _c
752 469 724 482 686 482 _c
639 482 602 466 575 435 _c
548 404 535 362 535 309 _c
535 0 _l
445 0 _l
445 327 _l
445 379 435 418 417 444 _c
398 469 369 482 331 482 _c
}_e{285 482 248 466 221 435 _c
194 404 181 362 181 309 _c
181 0 _l
91 0 _l
91 547 _l
181 547 _l
181 462 _l
201 495 226 520 255 536 _c
283 552 317 560 357 560 _c
397 560 430 550 458 530 _c
486 510 506 480 520 442 _c
_cl}_e}_d
/o{612 0 55 -13 557 560 _sc
306 484 _m
258 484 220 465 192 427 _c
164 389 150 338 150 273 _c
150 207 163 156 191 118 _c
219 80 257 62 306 62 _c
354 62 392 80 420 118 _c
448 156 462 207 462 273 _c
462 337 448 389 420 427 _c
392 465 354 484 306 484 _c
306 560 _m
384 560 445 534 490 484 _c
534 433 557 363 557 273 _c
557 183 534 113 490 63 _c
445 12 384 -13 306 -13 _c
227 -13 165 12 121 63 _c
77 113 55 183 55 273 _c
55 363 77 433 121 484 _c
165 534 227 560 306 560 _c
_cl}_d
/p{{635 0 91 -207 580 560 _sc
181 82 _m
181 -207 _l
91 -207 _l
91 547 _l
181 547 _l
181 464 _l
199 496 223 520 252 536 _c
281 552 316 560 356 560 _c
422 560 476 533 518 481 _c
559 428 580 359 580 273 _c
580 187 559 117 518 65 _c
476 13 422 -13 356 -13 _c
316 -13 281 -5 252 10 _c
223 25 199 49 181 82 _c
487 273 _m
487 339 473 390 446 428 _c
418 466 381 485 334 485 _c
}_e{286 485 249 466 222 428 _c
194 390 181 339 181 273 _c
181 207 194 155 222 117 _c
249 79 286 61 334 61 _c
381 61 418 79 446 117 _c
473 155 487 207 487 273 _c
_cl}_e}_d
/r{411 0 91 0 411 560 _sc
411 463 _m
401 469 390 473 378 476 _c
366 478 353 480 339 480 _c
288 480 249 463 222 430 _c
194 397 181 350 181 288 _c
181 0 _l
91 0 _l
91 547 _l
181 547 _l
181 462 _l
199 495 224 520 254 536 _c
284 552 321 560 365 560 _c
371 560 378 559 386 559 _c
393 558 401 557 411 555 _c
411 463 _l
_cl}_d
/t{392 0 27 0 368 702 _sc
183 702 _m
183 547 _l
368 547 _l
368 477 _l
183 477 _l
183 180 _l
183 135 189 106 201 94 _c
213 81 238 75 276 75 _c
368 75 _l
368 0 _l
276 0 _l
206 0 158 13 132 39 _c
106 65 93 112 93 180 _c
93 477 _l
27 477 _l
27 547 _l
93 547 _l
93 702 _l
183 702 _l
_cl}_d
/u{634 0 85 -13 543 560 _sc
85 216 _m
85 547 _l
175 547 _l
175 219 _l
175 167 185 129 205 103 _c
225 77 255 64 296 64 _c
344 64 383 79 411 110 _c
439 141 453 183 453 237 _c
453 547 _l
543 547 _l
543 0 _l
453 0 _l
453 84 _l
431 50 405 26 377 10 _c
348 -5 315 -13 277 -13 _c
214 -13 166 6 134 45 _c
101 83 85 140 85 216 _c
311 560 _m
311 560 _l
_cl}_d
/v{592 0 30 0 562 547 _sc
30 547 _m
125 547 _l
296 88 _l
467 547 _l
562 547 _l
357 0 _l
235 0 _l
30 547 _l
_cl}_d
/x{592 0 29 0 559 547 _sc
549 547 _m
351 281 _l
559 0 _l
453 0 _l
294 215 _l
135 0 _l
29 0 _l
241 286 _l
47 547 _l
153 547 _l
298 352 _l
443 547 _l
549 547 _l
_cl}_d
end readonly def

/BuildGlyph
 {exch begin
 CharStrings exch
 2 copy known not{pop /.notdef}if
 true 3 1 roll get exec
 end}_d

/BuildChar {
 1 index /Encoding get exch get
 1 index /BuildGlyph get exec
}_d

FontName currentdict end definefont pop
end
%%EndProlog
mpldict begin
-270 108 translate
1152 576 0 0 clipbox
gsave
0 0 m
1152 0 l
1152 576 l
0 576 l
cl
1.000 setgray
fill
grestore
gsave
40.05 310.4 m
376.9 310.4 l
376.9 549.2 l
40.05 549.2 l
cl
1.000 setgray
fill
grestore
0.800 setlinewidth
1 setlinejoin
0 setlinecap
[] 0 setdash
0.000 setgray
gsave
/o {
gsave
newpath
translate
0.8 setlinewidth
1 setlinejoin
0 setlinecap
0 0 m
0 -3.5 l

gsave
0.000 setgray
fill
grestore
stroke
grestore
} bind def
47.4074 310.4 o
grestore
/DejaVuSans findfont
10.000 scalefont
setfont
gsave
44.227721 295.806250 translate
0.000000 rotate
0.000000 0.000000 m /zero glyphshow
grestore
gsave
/o {
gsave
newpath
translate
0.8 setlinewidth
1 setlinejoin
0 setlinecap
0 0 m
0 -3.5 l

gsave
0.000 setgray
fill
grestore
stroke
grestore
} bind def
87.1772 310.4 o
grestore
gsave
80.817809 295.806250 translate
0.000000 rotate
0.000000 0.000000 m /one glyphshow
6.362305 0.000000 m /zero glyphshow
grestore
gsave
/o {
gsave
newpath
translate
0.8 setlinewidth
1 setlinejoin
0 setlinecap
0 0 m
0 -3.5 l

gsave
0.000 setgray
fill
grestore
stroke
grestore
} bind def
126.947 310.4 o
grestore
gsave
120.587585 295.806250 translate
0.000000 rotate
0.000000 0.000000 m /two glyphshow
6.362305 0.000000 m /zero glyphshow
grestore
gsave
/o {
gsave
newpath
translate
0.8 setlinewidth
1 setlinejoin
0 setlinecap
0 0 m
0 -3.5 l

gsave
0.000 setgray
fill
grestore
stroke
grestore
} bind def
166.717 310.4 o
grestore
gsave
160.357361 295.806250 translate
0.000000 rotate
0.000000 0.000000 m /three glyphshow
6.362305 0.000000 m /zero glyphshow
grestore
gsave
/o {
gsave
newpath
translate
0.8 setlinewidth
1 setlinejoin
0 setlinecap
0 0 m
0 -3.5 l

gsave
0.000 setgray
fill
grestore
stroke
grestore
} bind def
206.487 310.4 o
grestore
gsave
200.127136 295.806250 translate
0.000000 rotate
0.000000 0.000000 m /four glyphshow
6.362305 0.000000 m /zero glyphshow
grestore
gsave
/o {
gsave
newpath
translate
0.8 setlinewidth
1 setlinejoin
0 setlinecap
0 0 m
0 -3.5 l

gsave
0.000 setgray
fill
grestore
stroke
grestore
} bind def
246.256 310.4 o
grestore
gsave
239.896912 295.806250 translate
0.000000 rotate
0.000000 0.000000 m /five glyphshow
6.362305 0.000000 m /zero glyphshow
grestore
gsave
/o {
gsave
newpath
translate
0.8 setlinewidth
1 setlinejoin
0 setlinecap
0 0 m
0 -3.5 l

gsave
0.000 setgray
fill
grestore
stroke
grestore
} bind def
286.026 310.4 o
grestore
gsave
279.666688 295.806250 translate
0.000000 rotate
0.000000 0.000000 m /six glyphshow
6.362305 0.000000 m /zero glyphshow
grestore
gsave
/o {
gsave
newpath
translate
0.8 setlinewidth
1 setlinejoin
0 setlinecap
0 0 m
0 -3.5 l

gsave
0.000 setgray
fill
grestore
stroke
grestore
} bind def
325.796 310.4 o
grestore
gsave
319.436463 295.806250 translate
0.000000 rotate
0.000000 0.000000 m /seven glyphshow
6.362305 0.000000 m /zero glyphshow
grestore
gsave
/o {
gsave
newpath
translate
0.8 setlinewidth
1 setlinejoin
0 setlinecap
0 0 m
0 -3.5 l

gsave
0.000 setgray
fill
grestore
stroke
grestore
} bind def
365.566 310.4 o
grestore
gsave
359.206239 295.806250 translate
0.000000 rotate
0.000000 0.000000 m /eight glyphshow
6.362305 0.000000 m /zero glyphshow
grestore
gsave
/o {
gsave
newpath
translate
0.8 setlinewidth
1 setlinejoin
0 setlinecap
0 0 m
-3.5 0 l

gsave
0.000 setgray
fill
grestore
stroke
grestore
} bind def
40.05 316.852 o
grestore
gsave
10.784375 313.055476 translate
0.000000 rotate
0.000000 0.000000 m /zero glyphshow
6.362305 0.000000 m /period glyphshow
9.541016 0.000000 m /eight glyphshow
15.903320 0.000000 m /zero glyphshow
grestore
gsave
/o {
gsave
newpath
translate
0.8 setlinewidth
1 setlinejoin
0 setlinecap
0 0 m
-3.5 0 l

gsave
0.000 setgray
fill
grestore
stroke
grestore
} bind def
40.05 349.229 o
grestore
gsave
10.784375 345.432267 translate
0.000000 rotate
0.000000 0.000000 m /zero glyphshow
6.362305 0.000000 m /period glyphshow
9.541016 0.000000 m /eight glyphshow
15.903320 0.000000 m /one glyphshow
grestore
gsave
/o {
gsave
newpath
translate
0.8 setlinewidth
1 setlinejoin
0 setlinecap
0 0 m
-3.5 0 l

gsave
0.000 setgray
fill
grestore
stroke
grestore
} bind def
40.05 381.606 o
grestore
gsave
10.784375 377.809059 translate
0.000000 rotate
0.000000 0.000000 m /zero glyphshow
6.362305 0.000000 m /period glyphshow
9.541016 0.000000 m /eight glyphshow
15.903320 0.000000 m /two glyphshow
grestore
gsave
/o {
gsave
newpath
translate
0.8 setlinewidth
1 setlinejoin
0 setlinecap
0 0 m
-3.5 0 l

gsave
0.000 setgray
fill
grestore
stroke
grestore
} bind def
40.05 413.983 o
grestore
gsave
10.784375 410.185850 translate
0.000000 rotate
0.000000 0.000000 m /zero glyphshow
6.362305 0.000000 m /period glyphshow
9.541016 0.000000 m /eight glyphshow
15.903320 0.000000 m /three glyphshow
grestore
gsave
/o {
gsave
newpath
translate
0.8 setlinewidth
1 setlinejoin
0 setlinecap
0 0 m
-3.5 0 l

gsave
0.000 setgray
fill
grestore
stroke
grestore
} bind def
40.05 446.36 o
grestore
gsave
10.784375 442.562641 translate
0.000000 rotate
0.000000 0.000000 m /zero glyphshow
6.362305 0.000000 m /period glyphshow
9.541016 0.000000 m /eight glyphshow
15.903320 0.000000 m /four glyphshow
grestore
gsave
/o {
gsave
newpath
translate
0.8 setlinewidth
1 setlinejoin
0 setlinecap
0 0 m
-3.5 0 l

gsave
0.000 setgray
fill
grestore
stroke
grestore
} bind def
40.05 478.736 o
grestore
gsave
10.784375 474.939433 translate
0.000000 rotate
0.000000 0.000000 m /zero glyphshow
6.362305 0.000000 m /period glyphshow
9.541016 0.000000 m /eight glyphshow
15.903320 0.000000 m /five glyphshow
grestore
gsave
/o {
gsave
newpath
translate
0.8 setlinewidth
1 setlinejoin
0 setlinecap
0 0 m
-3.5 0 l

gsave
0.000 setgray
fill
grestore
stroke
grestore
} bind def
40.05 511.113 o
grestore
gsave
10.784375 507.316224 translate
0.000000 rotate
0.000000 0.000000 m /zero glyphshow
6.362305 0.000000 m /period glyphshow
9.541016 0.000000 m /eight glyphshow
15.903320 0.000000 m /six glyphshow
grestore
gsave
/o {
gsave
newpath
translate
0.8 setlinewidth
1 setlinejoin
0 setlinecap
0 0 m
-3.5 0 l

gsave
0.000 setgray
fill
grestore
stroke
grestore
} bind def
40.05 543.49 o
grestore
gsave
10.784375 539.693016 translate
0.000000 rotate
0.000000 0.000000 m /zero glyphshow
6.362305 0.000000 m /period glyphshow
9.541016 0.000000 m /eight glyphshow
15.903320 0.000000 m /seven glyphshow
grestore
1.500 setlinewidth
2 setlinecap
0.122 0.467 0.706 setrgbcolor
gsave
336.8 238.8 40.05 310.4 clipbox
55.361364 329.041035 m
59.338341 361.15436 l
63.315319 382.738994 l
67.292296 396.700298 l
71.269274 407.06967 l
75.246251 414.504055 l
79.223229 421.354351 l
83.200207 426.936726 l
87.177184 431.311124 l
91.154162 434.723286 l
95.131139 439.237289 l
99.108117 442.064448 l
103.085094 445.553378 l
107.062072 448.313854 l
111.03905 451.189178 l
115.016027 453.701372 l
118.993005 456.584304 l
122.969982 459.104692 l
126.94696 460.666191 l
130.923937 463.244264 l
134.900915 466.026258 l
138.877893 468.086817 l
142.85487 470.260074 l
146.831848 471.85637 l
150.808825 473.980048 l
154.785803 475.950146 l
158.76278 478.142768 l
162.739758 478.540283 l
166.716736 481.202559 l
170.693713 482.085767 l
174.670691 483.550283 l
178.647668 484.70253 l
182.624646 486.318953 l
186.601623 487.654927 l
190.578601 489.260178 l
194.555579 490.591457 l
198.532556 491.630768 l
202.509534 492.227029 l
206.486511 494.801951 l
210.463489 494.872808 l
214.440466 495.802747 l
218.417444 497.38598 l
222.394421 498.977473 l
226.371399 499.88396 l
230.348377 499.96112 l
234.325354 502.799386 l
238.302332 502.901389 l
242.279309 504.9428 l
246.256287 503.34283 l
250.233264 506.539878 l
254.210242 505.342096 l
258.18722 508.155519 l
262.164197 508.641191 l
266.141175 511.200899 l
270.118152 512.430653 l
274.09513 513.683034 l
278.072107 513.691815 l
282.049085 516.538253 l
286.026063 516.874887 l
290.00304 517.393293 l
293.980018 518.329426 l
297.956995 520.312804 l
301.933973 521.327902 l
305.91095 522.224608 l
309.887928 522.814827 l
313.864906 522.89979 l
317.841883 526.43745 l
321.818861 524.425316 l
325.795838 526.743024 l
329.772816 529.27891 l
333.749793 527.07592 l
337.726771 531.786823 l
341.703749 528.204628 l
345.680726 534.475377 l
349.657704 534.302843 l
353.634681 535.32733 l
357.611659 537.128089 l
361.588636 538.345455 l
stroke
grestore
1.000 0.498 0.055 setrgbcolor
gsave
336.8 238.8 40.05 310.4 clipbox
55.361364 321.254545 m
59.338341 349.870761 l
63.315319 368.82981 l
67.292296 380.87802 l
71.269274 390.285316 l
75.246251 396.68896 l
79.223229 402.807121 l
83.200207 407.330583 l
87.177184 411.178496 l
91.154162 413.156638 l
95.131139 416.731727 l
99.108117 418.970861 l
103.085094 421.662412 l
107.062072 424.114267 l
111.03905 425.566758 l
115.016027 427.422568 l
118.993005 429.675308 l
122.969982 430.602148 l
126.94696 432.346864 l
130.923937 433.10322 l
134.900915 435.574478 l
138.877893 436.261148 l
142.85487 437.529904 l
146.831848 438.216812 l
150.808825 439.525911 l
154.785803 440.064694 l
158.76278 442.360144 l
162.739758 441.574211 l
166.716736 443.56726 l
170.693713 444.236421 l
174.670691 445.013244 l
178.647668 445.408163 l
182.624646 446.658225 l
186.601623 445.741323 l
190.578601 447.20884 l
194.555579 448.745568 l
198.532556 447.926626 l
202.509534 448.388981 l
206.486511 450.592977 l
210.463489 449.818994 l
214.440466 449.626622 l
218.417444 451.211028 l
222.394421 452.36668 l
226.371399 451.788972 l
230.348377 449.955523 l
234.325354 454.018523 l
238.302332 453.209283 l
242.279309 453.318483 l
246.256287 452.361238 l
250.233264 454.085605 l
254.210242 452.890793 l
258.18722 453.239452 l
262.164197 452.556686 l
266.141175 452.952077 l
270.118152 452.076347 l
274.09513 456.966097 l
278.072107 453.68205 l
282.049085 455.357555 l
286.026063 455.446524 l
290.00304 454.659408 l
293.980018 455.202332 l
297.956995 456.294333 l
301.933973 455.828547 l
305.91095 456.326987 l
309.887928 454.713594 l
313.864906 455.336377 l
317.841883 456.716463 l
321.818861 456.748761 l
325.795838 453.888382 l
329.772816 456.663933 l
333.749793 454.381025 l
337.726771 456.015122 l
341.703749 453.230342 l
345.680726 458.745478 l
349.657704 456.062327 l
353.634681 455.336141 l
357.611659 455.21156 l
361.588636 456.565499 l
stroke
grestore
0.800 setlinewidth
0 setlinejoin
[] 0 setdash
0.000 setgray
gsave
40.05 310.4 m
40.05 549.2 l
stroke
grestore
gsave
376.9 310.4 m
376.9 549.2 l
stroke
grestore
gsave
40.05 310.4 m
376.9 310.4 l
stroke
grestore
gsave
40.05 549.2 m
376.9 549.2 l
stroke
grestore
/DejaVuSans findfont
12.000 scalefont
setfont
gsave
172.232812 555.200000 translate
0.000000 rotate
0.000000 0.000000 m /S glyphshow
7.617188 0.000000 m /G glyphshow
16.916016 0.000000 m /D glyphshow
26.156250 0.000000 m /space glyphshow
29.970703 0.000000 m /hyphen glyphshow
34.300781 0.000000 m /space glyphshow
38.115234 0.000000 m /zero glyphshow
45.750000 0.000000 m /period glyphshow
49.564453 0.000000 m /eight glyphshow
57.199219 0.000000 m /four glyphshow
64.833984 0.000000 m /four glyphshow
grestore
1.000 setlinewidth
0 setlinecap
0.800 setgray
gsave
47.05 511.85625 m
112.565625 511.85625 l
113.898958 511.85625 114.565625 512.522917 114.565625 513.85625 c
114.565625 542.2 l
114.565625 543.533333 113.898958 544.2 112.565625 544.2 c
47.05 544.2 l
45.716667 544.2 45.05 543.533333 45.05 542.2 c
45.05 513.85625 l
45.05 512.522917 45.716667 511.85625 47.05 511.85625 c
cl
gsave
1.000 setgray
fill
grestore
stroke
grestore
1.500 setlinewidth
1 setlinejoin
2 setlinecap
[] 0 setdash
0.122 0.467 0.706 setrgbcolor
gsave
49.05 536.10625 m
69.05 536.10625 l
stroke
grestore
0.000 setgray
/DejaVuSans findfont
10.000 scalefont
setfont
gsave
77.050000 532.606250 translate
0.000000 rotate
0.000000 0.000000 m /a glyphshow
6.127930 0.000000 m /u glyphshow
12.465820 0.000000 m /c glyphshow
grestore
1.000 0.498 0.055 setrgbcolor
gsave
49.05 521.434375 m
69.05 521.434375 l
stroke
grestore
0.000 setgray
gsave
77.050000 517.934375 translate
0.000000 rotate
0.000000 0.000000 m /v glyphshow
5.917969 0.000000 m /a glyphshow
12.045898 0.000000 m /l glyphshow
14.824219 0.000000 m /A glyphshow
21.665039 0.000000 m /u glyphshow
28.002930 0.000000 m /c glyphshow
grestore
gsave
420.45 310.4 m
757.3 310.4 l
757.3 549.2 l
420.45 549.2 l
cl
1.000 setgray
fill
grestore
0.800 setlinewidth
0 setlinecap
gsave
/o {
gsave
newpath
translate
0.8 setlinewidth
1 setlinejoin
0 setlinecap
0 0 m
0 -3.5 l

gsave
0.000 setgray
fill
grestore
stroke
grestore
} bind def
427.807 310.4 o
grestore
gsave
424.627721 295.806250 translate
0.000000 rotate
0.000000 0.000000 m /zero glyphshow
grestore
gsave
/o {
gsave
newpath
translate
0.8 setlinewidth
1 setlinejoin
0 setlinecap
0 0 m
0 -3.5 l

gsave
0.000 setgray
fill
grestore
stroke
grestore
} bind def
467.577 310.4 o
grestore
gsave
461.217809 295.806250 translate
0.000000 rotate
0.000000 0.000000 m /one glyphshow
6.362305 0.000000 m /zero glyphshow
grestore
gsave
/o {
gsave
newpath
translate
0.8 setlinewidth
1 setlinejoin
0 setlinecap
0 0 m
0 -3.5 l

gsave
0.000 setgray
fill
grestore
stroke
grestore
} bind def
507.347 310.4 o
grestore
gsave
500.987585 295.806250 translate
0.000000 rotate
0.000000 0.000000 m /two glyphshow
6.362305 0.000000 m /zero glyphshow
grestore
gsave
/o {
gsave
newpath
translate
0.8 setlinewidth
1 setlinejoin
0 setlinecap
0 0 m
0 -3.5 l

gsave
0.000 setgray
fill
grestore
stroke
grestore
} bind def
547.117 310.4 o
grestore
gsave
540.757361 295.806250 translate
0.000000 rotate
0.000000 0.000000 m /three glyphshow
6.362305 0.000000 m /zero glyphshow
grestore
gsave
/o {
gsave
newpath
translate
0.8 setlinewidth
1 setlinejoin
0 setlinecap
0 0 m
0 -3.5 l

gsave
0.000 setgray
fill
grestore
stroke
grestore
} bind def
586.887 310.4 o
grestore
gsave
580.527136 295.806250 translate
0.000000 rotate
0.000000 0.000000 m /four glyphshow
6.362305 0.000000 m /zero glyphshow
grestore
gsave
/o {
gsave
newpath
translate
0.8 setlinewidth
1 setlinejoin
0 setlinecap
0 0 m
0 -3.5 l

gsave
0.000 setgray
fill
grestore
stroke
grestore
} bind def
626.656 310.4 o
grestore
gsave
620.296912 295.806250 translate
0.000000 rotate
0.000000 0.000000 m /five glyphshow
6.362305 0.000000 m /zero glyphshow
grestore
gsave
/o {
gsave
newpath
translate
0.8 setlinewidth
1 setlinejoin
0 setlinecap
0 0 m
0 -3.5 l

gsave
0.000 setgray
fill
grestore
stroke
grestore
} bind def
666.426 310.4 o
grestore
gsave
660.066688 295.806250 translate
0.000000 rotate
0.000000 0.000000 m /six glyphshow
6.362305 0.000000 m /zero glyphshow
grestore
gsave
/o {
gsave
newpath
translate
0.8 setlinewidth
1 setlinejoin
0 setlinecap
0 0 m
0 -3.5 l

gsave
0.000 setgray
fill
grestore
stroke
grestore
} bind def
706.196 310.4 o
grestore
gsave
699.836463 295.806250 translate
0.000000 rotate
0.000000 0.000000 m /seven glyphshow
6.362305 0.000000 m /zero glyphshow
grestore
gsave
/o {
gsave
newpath
translate
0.8 setlinewidth
1 setlinejoin
0 setlinecap
0 0 m
0 -3.5 l

gsave
0.000 setgray
fill
grestore
stroke
grestore
} bind def
745.966 310.4 o
grestore
gsave
739.606239 295.806250 translate
0.000000 rotate
0.000000 0.000000 m /eight glyphshow
6.362305 0.000000 m /zero glyphshow
grestore
gsave
/o {
gsave
newpath
translate
0.8 setlinewidth
1 setlinejoin
0 setlinecap
0 0 m
-3.5 0 l

gsave
0.000 setgray
fill
grestore
stroke
grestore
} bind def
420.45 330.886 o
grestore
gsave
397.543750 327.089499 translate
0.000000 rotate
0.000000 0.000000 m /zero glyphshow
6.362305 0.000000 m /period glyphshow
9.541016 0.000000 m /six glyphshow
grestore
gsave
/o {
gsave
newpath
translate
0.8 setlinewidth
1 setlinejoin
0 setlinecap
0 0 m
-3.5 0 l

gsave
0.000 setgray
fill
grestore
stroke
grestore
} bind def
420.45 383.044 o
grestore
gsave
397.543750 379.247034 translate
0.000000 rotate
0.000000 0.000000 m /zero glyphshow
6.362305 0.000000 m /period glyphshow
9.541016 0.000000 m /seven glyphshow
grestore
gsave
/o {
gsave
newpath
translate
0.8 setlinewidth
1 setlinejoin
0 setlinecap
0 0 m
-3.5 0 l

gsave
0.000 setgray
fill
grestore
stroke
grestore
} bind def
420.45 435.201 o
grestore
gsave
397.543750 431.404569 translate
0.000000 rotate
0.000000 0.000000 m /zero glyphshow
6.362305 0.000000 m /period glyphshow
9.541016 0.000000 m /eight glyphshow
grestore
gsave
/o {
gsave
newpath
translate
0.8 setlinewidth
1 setlinejoin
0 setlinecap
0 0 m
-3.5 0 l

gsave
0.000 setgray
fill
grestore
stroke
grestore
} bind def
420.45 487.359 o
grestore
gsave
397.543750 483.562104 translate
0.000000 rotate
0.000000 0.000000 m /zero glyphshow
6.362305 0.000000 m /period glyphshow
9.541016 0.000000 m /nine glyphshow
grestore
gsave
/o {
gsave
newpath
translate
0.8 setlinewidth
1 setlinejoin
0 setlinecap
0 0 m
-3.5 0 l

gsave
0.000 setgray
fill
grestore
stroke
grestore
} bind def
420.45 539.517 o
grestore
gsave
397.543750 535.719639 translate
0.000000 rotate
0.000000 0.000000 m /one glyphshow
6.362305 0.000000 m /period glyphshow
9.541016 0.000000 m /zero glyphshow
grestore
1.500 setlinewidth
2 setlinecap
0.122 0.467 0.706 setrgbcolor
gsave
336.8 238.8 420.5 310.4 clipbox
435.761364 463.176962 m
439.738341 466.391158 l
443.715319 468.880473 l
447.692296 469.18221 l
451.669274 470.901576 l
455.646251 471.763361 l
459.623229 475.491092 l
463.600207 476.374028 l
467.577184 479.836859 l
471.554162 482.745849 l
475.531139 484.263466 l
479.508117 489.201665 l
483.485094 489.220853 l
487.462072 490.489347 l
491.43905 492.629534 l
495.416027 497.111394 l
499.393005 498.724359 l
503.369982 501.32232 l
507.34696 503.778008 l
511.323937 507.151485 l
515.300915 508.024778 l
519.277893 508.942722 l
523.25487 513.307792 l
527.231848 512.317407 l
531.208825 515.024595 l
535.185803 516.902763 l
539.16278 501.686211 l
543.139758 517.846134 l
547.116736 522.572997 l
551.093713 523.193206 l
555.070691 522.594401 l
559.047668 525.894709 l
563.024646 527.285259 l
567.001623 526.479641 l
570.978601 528.127698 l
574.955579 527.288463 l
578.932556 525.574765 l
582.909534 530.550041 l
586.886511 529.687651 l
590.863489 528.393222 l
594.840466 530.972314 l
598.817444 532.260335 l
602.794421 532.580591 l
606.771399 531.452316 l
610.748377 534.156419 l
614.725354 530.303764 l
618.702332 534.702721 l
622.679309 535.103092 l
626.656287 535.665248 l
630.633264 527.626421 l
634.610242 535.257422 l
638.58722 535.061474 l
642.564197 536.163261 l
646.541175 535.726159 l
650.518152 518.048412 l
654.49513 536.086982 l
658.472107 536.303066 l
662.449085 535.317958 l
666.426063 536.076443 l
670.40304 537.178702 l
674.380018 536.686351 l
678.356995 537.584883 l
682.333973 537.135957 l
686.31095 538.102336 l
690.287928 537.010315 l
694.264906 538.205863 l
698.241883 535.528972 l
702.218861 535.70459 l
706.195838 538.163761 l
710.172816 534.477603 l
714.149793 537.373974 l
718.126771 537.847176 l
722.103749 537.339103 l
726.080726 536.341824 l
730.057704 537.061947 l
734.034681 537.751439 l
738.011659 538.345455 l
741.988636 538.273497 l
stroke
grestore
1.000 0.498 0.055 setrgbcolor
gsave
336.8 238.8 420.5 310.4 clipbox
435.761364 455.364296 m
439.738341 457.200858 l
443.715319 457.33534 l
447.692296 457.28754 l
451.669274 456.843689 l
455.646251 455.873996 l
459.623229 455.875425 l
463.600207 453.413988 l
467.577184 454.007072 l
471.554162 452.556172 l
475.531139 450.545046 l
479.508117 447.021173 l
483.485094 448.510363 l
487.462072 445.921858 l
491.43905 433.453316 l
495.416027 444.067341 l
499.393005 430.758308 l
503.369982 428.929598 l
507.34696 436.256561 l
511.323937 423.592929 l
515.300915 426.889578 l
519.277893 418.553965 l
523.25487 422.249504 l
527.231848 409.977234 l
531.208825 410.158372 l
535.185803 392.510972 l
539.16278 361.61871 l
543.139758 405.310648 l
547.116736 409.256243 l
551.093713 402.849668 l
555.070691 394.702112 l
559.047668 400.017301 l
563.024646 397.639038 l
567.001623 404.215335 l
570.978601 396.833806 l
574.955579 394.576664 l
578.932556 384.459531 l
582.909534 380.759761 l
586.886511 401.494655 l
590.863489 376.31773 l
594.840466 393.061973 l
598.817444 395.6711 l
602.794421 374.807366 l
606.771399 385.084405 l
610.748377 376.387182 l
614.725354 382.393629 l
618.702332 385.074171 l
622.679309 373.776473 l
626.656287 365.11266 l
630.633264 375.764118 l
634.610242 385.135694 l
638.58722 390.260996 l
642.564197 363.842899 l
646.541175 374.356825 l
650.518152 321.254545 l
654.49513 374.512444 l
658.472107 358.649669 l
662.449085 375.234596 l
666.426063 373.528113 l
670.40304 382.05327 l
674.380018 363.535779 l
678.356995 387.078378 l
682.333973 387.306612 l
686.31095 379.311967 l
690.287928 374.535162 l
694.264906 376.589343 l
698.241883 366.035239 l
702.218861 357.722573 l
706.195838 377.885253 l
710.172816 371.335086 l
714.149793 373.6013 l
718.126771 382.032991 l
722.103749 373.638084 l
726.080726 360.684486 l
730.057704 398.160764 l
734.034681 373.67525 l
738.011659 371.360682 l
741.988636 365.158135 l
stroke
grestore
0.800 setlinewidth
0 setlinejoin
[] 0 setdash
0.000 setgray
gsave
420.45 310.4 m
420.45 549.2 l
stroke
grestore
gsave
757.3 310.4 m
757.3 549.2 l
stroke
grestore
gsave
420.45 310.4 m
757.3 310.4 l
stroke
grestore
gsave
420.45 549.2 m
757.3 549.2 l
stroke
grestore
/DejaVuSans findfont
12.000 scalefont
setfont
gsave
538.781250 555.200000 translate
0.000000 rotate
0.000000 0.000000 m /R glyphshow
8.337891 0.000000 m /M glyphshow
18.691406 0.000000 m /S glyphshow
26.308594 0.000000 m /p glyphshow
33.925781 0.000000 m /r glyphshow
38.859375 0.000000 m /o glyphshow
46.201172 0.000000 m /p glyphshow
53.818359 0.000000 m /space glyphshow
57.632812 0.000000 m /hyphen glyphshow
61.962891 0.000000 m /space glyphshow
65.777344 0.000000 m /zero glyphshow
73.412109 0.000000 m /period glyphshow
77.226562 0.000000 m /eight glyphshow
84.861328 0.000000 m /four glyphshow
92.496094 0.000000 m /two glyphshow
grestore
1.000 setlinewidth
0 setlinecap
0.800 setgray
gsave
427.45 511.85625 m
492.965625 511.85625 l
494.298958 511.85625 494.965625 512.522917 494.965625 513.85625 c
494.965625 542.2 l
494.965625 543.533333 494.298958 544.2 492.965625 544.2 c
427.45 544.2 l
426.116667 544.2 425.45 543.533333 425.45 542.2 c
425.45 513.85625 l
425.45 512.522917 426.116667 511.85625 427.45 511.85625 c
cl
gsave
1.000 setgray
fill
grestore
stroke
grestore
1.500 setlinewidth
1 setlinejoin
2 setlinecap
[] 0 setdash
0.122 0.467 0.706 setrgbcolor
gsave
429.45 536.10625 m
449.45 536.10625 l
stroke
grestore
0.000 setgray
/DejaVuSans findfont
10.000 scalefont
setfont
gsave
457.450000 532.606250 translate
0.000000 rotate
0.000000 0.000000 m /a glyphshow
6.127930 0.000000 m /u glyphshow
12.465820 0.000000 m /c glyphshow
grestore
1.000 0.498 0.055 setrgbcolor
gsave
429.45 521.434375 m
449.45 521.434375 l
stroke
grestore
0.000 setgray
gsave
457.450000 517.934375 translate
0.000000 rotate
0.000000 0.000000 m /v glyphshow
5.917969 0.000000 m /a glyphshow
12.045898 0.000000 m /l glyphshow
14.824219 0.000000 m /A glyphshow
21.665039 0.000000 m /u glyphshow
28.002930 0.000000 m /c glyphshow
grestore
gsave
800.85 310.4 m
1137.7 310.4 l
1137.7 549.2 l
800.85 549.2 l
cl
1.000 setgray
fill
grestore
0.800 setlinewidth
0 setlinecap
gsave
/o {
gsave
newpath
translate
0.8 setlinewidth
1 setlinejoin
0 setlinecap
0 0 m
0 -3.5 l

gsave
0.000 setgray
fill
grestore
stroke
grestore
} bind def
808.207 310.4 o
grestore
gsave
805.027721 295.806250 translate
0.000000 rotate
0.000000 0.000000 m /zero glyphshow
grestore
gsave
/o {
gsave
newpath
translate
0.8 setlinewidth
1 setlinejoin
0 setlinecap
0 0 m
0 -3.5 l

gsave
0.000 setgray
fill
grestore
stroke
grestore
} bind def
847.977 310.4 o
grestore
gsave
841.617809 295.806250 translate
0.000000 rotate
0.000000 0.000000 m /one glyphshow
6.362305 0.000000 m /zero glyphshow
grestore
gsave
/o {
gsave
newpath
translate
0.8 setlinewidth
1 setlinejoin
0 setlinecap
0 0 m
0 -3.5 l

gsave
0.000 setgray
fill
grestore
stroke
grestore
} bind def
887.747 310.4 o
grestore
gsave
881.387585 295.806250 translate
0.000000 rotate
0.000000 0.000000 m /two glyphshow
6.362305 0.000000 m /zero glyphshow
grestore
gsave
/o {
gsave
newpath
translate
0.8 setlinewidth
1 setlinejoin
0 setlinecap
0 0 m
0 -3.5 l

gsave
0.000 setgray
fill
grestore
stroke
grestore
} bind def
927.517 310.4 o
grestore
gsave
921.157361 295.806250 translate
0.000000 rotate
0.000000 0.000000 m /three glyphshow
6.362305 0.000000 m /zero glyphshow
grestore
gsave
/o {
gsave
newpath
translate
0.8 setlinewidth
1 setlinejoin
0 setlinecap
0 0 m
0 -3.5 l

gsave
0.000 setgray
fill
grestore
stroke
grestore
} bind def
967.287 310.4 o
grestore
gsave
960.927136 295.806250 translate
0.000000 rotate
0.000000 0.000000 m /four glyphshow
6.362305 0.000000 m /zero glyphshow
grestore
gsave
/o {
gsave
newpath
translate
0.8 setlinewidth
1 setlinejoin
0 setlinecap
0 0 m
0 -3.5 l

gsave
0.000 setgray
fill
grestore
stroke
grestore
} bind def
1007.06 310.4 o
grestore
gsave
1000.696912 295.806250 translate
0.000000 rotate
0.000000 0.000000 m /five glyphshow
6.362305 0.000000 m /zero glyphshow
grestore
gsave
/o {
gsave
newpath
translate
0.8 setlinewidth
1 setlinejoin
0 setlinecap
0 0 m
0 -3.5 l

gsave
0.000 setgray
fill
grestore
stroke
grestore
} bind def
1046.83 310.4 o
grestore
gsave
1040.466688 295.806250 translate
0.000000 rotate
0.000000 0.000000 m /six glyphshow
6.362305 0.000000 m /zero glyphshow
grestore
gsave
/o {
gsave
newpath
translate
0.8 setlinewidth
1 setlinejoin
0 setlinecap
0 0 m
0 -3.5 l

gsave
0.000 setgray
fill
grestore
stroke
grestore
} bind def
1086.6 310.4 o
grestore
gsave
1080.236463 295.806250 translate
0.000000 rotate
0.000000 0.000000 m /seven glyphshow
6.362305 0.000000 m /zero glyphshow
grestore
gsave
/o {
gsave
newpath
translate
0.8 setlinewidth
1 setlinejoin
0 setlinecap
0 0 m
0 -3.5 l

gsave
0.000 setgray
fill
grestore
stroke
grestore
} bind def
1126.37 310.4 o
grestore
gsave
1120.006239 295.806250 translate
0.000000 rotate
0.000000 0.000000 m /eight glyphshow
6.362305 0.000000 m /zero glyphshow
grestore
gsave
/o {
gsave
newpath
translate
0.8 setlinewidth
1 setlinejoin
0 setlinecap
0 0 m
-3.5 0 l

gsave
0.000 setgray
fill
grestore
stroke
grestore
} bind def
800.85 336.498 o
grestore
gsave
771.584375 332.700666 translate
0.000000 rotate
0.000000 0.000000 m /zero glyphshow
6.362305 0.000000 m /period glyphshow
9.541016 0.000000 m /seven glyphshow
15.903320 0.000000 m /five glyphshow
grestore
gsave
/o {
gsave
newpath
translate
0.8 setlinewidth
1 setlinejoin
0 setlinecap
0 0 m
-3.5 0 l

gsave
0.000 setgray
fill
grestore
stroke
grestore
} bind def
800.85 378.068 o
grestore
gsave
771.584375 374.271268 translate
0.000000 rotate
0.000000 0.000000 m /zero glyphshow
6.362305 0.000000 m /period glyphshow
9.541016 0.000000 m /eight glyphshow
15.903320 0.000000 m /zero glyphshow
grestore
gsave
/o {
gsave
newpath
translate
0.8 setlinewidth
1 setlinejoin
0 setlinecap
0 0 m
-3.5 0 l

gsave
0.000 setgray
fill
grestore
stroke
grestore
} bind def
800.85 419.639 o
grestore
gsave
771.584375 415.841869 translate
0.000000 rotate
0.000000 0.000000 m /zero glyphshow
6.362305 0.000000 m /period glyphshow
9.541016 0.000000 m /eight glyphshow
15.903320 0.000000 m /five glyphshow
grestore
gsave
/o {
gsave
newpath
translate
0.8 setlinewidth
1 setlinejoin
0 setlinecap
0 0 m
-3.5 0 l

gsave
0.000 setgray
fill
grestore
stroke
grestore
} bind def
800.85 461.209 o
grestore
gsave
771.584375 457.412471 translate
0.000000 rotate
0.000000 0.000000 m /zero glyphshow
6.362305 0.000000 m /period glyphshow
9.541016 0.000000 m /nine glyphshow
15.903320 0.000000 m /zero glyphshow
grestore
gsave
/o {
gsave
newpath
translate
0.8 setlinewidth
1 setlinejoin
0 setlinecap
0 0 m
-3.5 0 l

gsave
0.000 setgray
fill
grestore
stroke
grestore
} bind def
800.85 502.78 o
grestore
gsave
771.584375 498.983073 translate
0.000000 rotate
0.000000 0.000000 m /zero glyphshow
6.362305 0.000000 m /period glyphshow
9.541016 0.000000 m /nine glyphshow
15.903320 0.000000 m /five glyphshow
grestore
gsave
/o {
gsave
newpath
translate
0.8 setlinewidth
1 setlinejoin
0 setlinecap
0 0 m
-3.5 0 l

gsave
0.000 setgray
fill
grestore
stroke
grestore
} bind def
800.85 544.351 o
grestore
gsave
771.584375 540.553675 translate
0.000000 rotate
0.000000 0.000000 m /one glyphshow
6.362305 0.000000 m /period glyphshow
9.541016 0.000000 m /zero glyphshow
15.903320 0.000000 m /zero glyphshow
grestore
1.500 setlinewidth
2 setlinecap
0.122 0.467 0.706 setrgbcolor
gsave
336.9 238.8 800.9 310.4 clipbox
816.161364 424.842079 m
820.138341 426.804801 l
824.115319 430.301372 l
828.092296 431.597659 l
832.069274 433.428815 l
836.046251 435.386737 l
840.023229 438.024454 l
844.000207 441.5982 l
847.977184 443.512452 l
851.954162 446.074536 l
855.931139 447.982525 l
859.908117 451.317944 l
863.885094 453.481 l
867.862072 456.943072 l
871.83905 460.020841 l
875.816027 463.919342 l
879.793005 465.797778 l
883.769982 468.612455 l
887.74696 468.207757 l
891.723937 472.616635 l
895.700915 478.509594 l
899.677893 480.182466 l
903.65487 482.3757 l
907.631848 484.155038 l
911.608825 484.023389 l
915.585803 488.210841 l
919.56278 493.112632 l
923.539758 495.918061 l
927.516736 497.544328 l
931.493713 499.287091 l
935.470691 501.575623 l
939.447668 502.404755 l
943.424646 504.294678 l
947.401623 505.967902 l
951.378601 506.749051 l
955.355579 508.244512 l
959.332556 509.210853 l
963.309534 513.177498 l
967.286511 513.452808 l
971.263489 515.94173 l
975.240466 517.885496 l
979.217444 518.351485 l
983.194421 518.771543 l
987.171399 520.684573 l
991.148377 521.696771 l
995.125354 522.536168 l
999.102332 521.844166 l
1003.079309 524.822306 l
1007.056287 524.089955 l
1011.033264 525.416594 l
1015.010242 525.926653 l
1018.98722 525.655585 l
1022.964197 526.203509 l
1026.941175 529.116117 l
1030.918152 528.05487 l
1034.89513 529.200257 l
1038.872107 528.256114 l
1042.849085 529.165987 l
1046.826063 532.019594 l
1050.80304 531.497641 l
1054.780018 532.729407 l
1058.756995 532.72252 l
1062.733973 532.849821 l
1066.71095 534.260405 l
1070.687928 533.49307 l
1074.664906 533.763362 l
1078.641883 534.741804 l
1082.618861 533.616464 l
1086.595838 534.738711 l
1090.572816 535.642122 l
1094.549793 536.696477 l
1098.526771 535.277911 l
1102.503749 536.842403 l
1106.480726 536.84117 l
1110.457704 537.244127 l
1114.434681 537.571109 l
1118.411659 538.212616 l
1122.388636 538.345455 l
stroke
grestore
1.000 0.498 0.055 setrgbcolor
gsave
336.9 238.8 800.9 310.4 clipbox
816.161364 412.466857 m
820.138341 412.925946 l
824.115319 413.84464 l
828.092296 414.010704 l
832.069274 414.437254 l
836.046251 414.153586 l
840.023229 414.120136 l
844.000207 415.267145 l
847.977184 413.035227 l
851.954162 413.676815 l
855.931139 412.06771 l
859.908117 412.565899 l
863.885094 408.941007 l
867.862072 410.071367 l
871.83905 405.763325 l
875.816027 406.279591 l
879.793005 405.465893 l
883.769982 406.359524 l
887.74696 400.636542 l
891.723937 400.550624 l
895.700915 397.274932 l
899.677893 397.707407 l
903.65487 393.390251 l
907.631848 397.702364 l
911.608825 390.886908 l
915.585803 395.229766 l
919.56278 386.965192 l
923.539758 384.399993 l
927.516736 386.404599 l
931.493713 386.948148 l
935.470691 380.180967 l
939.447668 382.759746 l
943.424646 379.151776 l
947.401623 379.587563 l
951.378601 379.937523 l
955.355579 377.093334 l
959.332556 367.834689 l
963.309534 368.27315 l
967.286511 367.566272 l
971.263489 359.273048 l
975.240466 363.976652 l
979.217444 361.004468 l
983.194421 355.799909 l
987.171399 345.559894 l
991.148377 359.486627 l
995.125354 359.562458 l
999.102332 360.179924 l
1003.079309 345.959132 l
1007.056287 341.36736 l
1011.033264 355.676319 l
1015.010242 345.377637 l
1018.98722 347.072934 l
1022.964197 341.293838 l
1026.941175 347.842822 l
1030.918152 340.542513 l
1034.89513 336.121848 l
1038.872107 352.589689 l
1042.849085 350.255538 l
1046.826063 337.499571 l
1050.80304 332.53077 l
1054.780018 333.809693 l
1058.756995 339.284948 l
1062.733973 343.742495 l
1066.71095 334.803368 l
1070.687928 341.857043 l
1074.664906 334.272884 l
1078.641883 335.33124 l
1082.618861 340.572499 l
1086.595838 324.800751 l
1090.572816 334.383228 l
1094.549793 330.514861 l
1098.526771 334.497643 l
1102.503749 325.909996 l
1106.480726 328.746042 l
1110.457704 333.270307 l
1114.434681 325.464821 l
1118.411659 321.254545 l
1122.388636 321.627656 l
stroke
grestore
0.800 setlinewidth
0 setlinejoin
[] 0 setdash
0.000 setgray
gsave
800.85 310.4 m
800.85 549.2 l
stroke
grestore
gsave
1137.7 310.4 m
1137.7 549.2 l
stroke
grestore
gsave
800.85 310.4 m
1137.7 310.4 l
stroke
grestore
gsave
800.85 549.2 m
1137.7 549.2 l
stroke
grestore
/DejaVuSans findfont
12.000 scalefont
setfont
gsave
920.743750 555.200000 translate
0.000000 rotate
0.000000 0.000000 m /A glyphshow
8.208984 0.000000 m /d glyphshow
15.826172 0.000000 m /a glyphshow
23.179688 0.000000 m /g glyphshow
30.796875 0.000000 m /r glyphshow
35.730469 0.000000 m /a glyphshow
43.083984 0.000000 m /d glyphshow
50.701172 0.000000 m /space glyphshow
54.515625 0.000000 m /hyphen glyphshow
58.845703 0.000000 m /space glyphshow
62.660156 0.000000 m /zero glyphshow
70.294922 0.000000 m /period glyphshow
74.109375 0.000000 m /eight glyphshow
81.744141 0.000000 m /four glyphshow
89.378906 0.000000 m /five glyphshow
grestore
1.000 setlinewidth
0 setlinecap
0.800 setgray
gsave
807.85 511.85625 m
873.365625 511.85625 l
874.698958 511.85625 875.365625 512.522917 875.365625 513.85625 c
875.365625 542.2 l
875.365625 543.533333 874.698958 544.2 873.365625 544.2 c
807.85 544.2 l
806.516667 544.2 805.85 543.533333 805.85 542.2 c
805.85 513.85625 l
805.85 512.522917 806.516667 511.85625 807.85 511.85625 c
cl
gsave
1.000 setgray
fill
grestore
stroke
grestore
1.500 setlinewidth
1 setlinejoin
2 setlinecap
[] 0 setdash
0.122 0.467 0.706 setrgbcolor
gsave
809.85 536.10625 m
829.85 536.10625 l
stroke
grestore
0.000 setgray
/DejaVuSans findfont
10.000 scalefont
setfont
gsave
837.850000 532.606250 translate
0.000000 rotate
0.000000 0.000000 m /a glyphshow
6.127930 0.000000 m /u glyphshow
12.465820 0.000000 m /c glyphshow
grestore
1.000 0.498 0.055 setrgbcolor
gsave
809.85 521.434375 m
829.85 521.434375 l
stroke
grestore
0.000 setgray
gsave
837.850000 517.934375 translate
0.000000 rotate
0.000000 0.000000 m /v glyphshow
5.917969 0.000000 m /a glyphshow
12.045898 0.000000 m /l glyphshow
14.824219 0.000000 m /A glyphshow
21.665039 0.000000 m /u glyphshow
28.002930 0.000000 m /c glyphshow
grestore
gsave
40.05 27.8 m
376.9 27.8 l
376.9 266.6 l
40.05 266.6 l
cl
1.000 setgray
fill
grestore
0.800 setlinewidth
0 setlinecap
gsave
/o {
gsave
newpath
translate
0.8 setlinewidth
1 setlinejoin
0 setlinecap
0 0 m
0 -3.5 l

gsave
0.000 setgray
fill
grestore
stroke
grestore
} bind def
47.4074 27.8 o
grestore
gsave
44.227721 13.206250 translate
0.000000 rotate
0.000000 0.000000 m /zero glyphshow
grestore
gsave
/o {
gsave
newpath
translate
0.8 setlinewidth
1 setlinejoin
0 setlinecap
0 0 m
0 -3.5 l

gsave
0.000 setgray
fill
grestore
stroke
grestore
} bind def
87.1772 27.8 o
grestore
gsave
80.817809 13.206250 translate
0.000000 rotate
0.000000 0.000000 m /one glyphshow
6.362305 0.000000 m /zero glyphshow
grestore
gsave
/o {
gsave
newpath
translate
0.8 setlinewidth
1 setlinejoin
0 setlinecap
0 0 m
0 -3.5 l

gsave
0.000 setgray
fill
grestore
stroke
grestore
} bind def
126.947 27.8 o
grestore
gsave
120.587585 13.206250 translate
0.000000 rotate
0.000000 0.000000 m /two glyphshow
6.362305 0.000000 m /zero glyphshow
grestore
gsave
/o {
gsave
newpath
translate
0.8 setlinewidth
1 setlinejoin
0 setlinecap
0 0 m
0 -3.5 l

gsave
0.000 setgray
fill
grestore
stroke
grestore
} bind def
166.717 27.8 o
grestore
gsave
160.357361 13.206250 translate
0.000000 rotate
0.000000 0.000000 m /three glyphshow
6.362305 0.000000 m /zero glyphshow
grestore
gsave
/o {
gsave
newpath
translate
0.8 setlinewidth
1 setlinejoin
0 setlinecap
0 0 m
0 -3.5 l

gsave
0.000 setgray
fill
grestore
stroke
grestore
} bind def
206.487 27.8 o
grestore
gsave
200.127136 13.206250 translate
0.000000 rotate
0.000000 0.000000 m /four glyphshow
6.362305 0.000000 m /zero glyphshow
grestore
gsave
/o {
gsave
newpath
translate
0.8 setlinewidth
1 setlinejoin
0 setlinecap
0 0 m
0 -3.5 l

gsave
0.000 setgray
fill
grestore
stroke
grestore
} bind def
246.256 27.8 o
grestore
gsave
239.896912 13.206250 translate
0.000000 rotate
0.000000 0.000000 m /five glyphshow
6.362305 0.000000 m /zero glyphshow
grestore
gsave
/o {
gsave
newpath
translate
0.8 setlinewidth
1 setlinejoin
0 setlinecap
0 0 m
0 -3.5 l

gsave
0.000 setgray
fill
grestore
stroke
grestore
} bind def
286.026 27.8 o
grestore
gsave
279.666688 13.206250 translate
0.000000 rotate
0.000000 0.000000 m /six glyphshow
6.362305 0.000000 m /zero glyphshow
grestore
gsave
/o {
gsave
newpath
translate
0.8 setlinewidth
1 setlinejoin
0 setlinecap
0 0 m
0 -3.5 l

gsave
0.000 setgray
fill
grestore
stroke
grestore
} bind def
325.796 27.8 o
grestore
gsave
319.436463 13.206250 translate
0.000000 rotate
0.000000 0.000000 m /seven glyphshow
6.362305 0.000000 m /zero glyphshow
grestore
gsave
/o {
gsave
newpath
translate
0.8 setlinewidth
1 setlinejoin
0 setlinecap
0 0 m
0 -3.5 l

gsave
0.000 setgray
fill
grestore
stroke
grestore
} bind def
365.566 27.8 o
grestore
gsave
359.206239 13.206250 translate
0.000000 rotate
0.000000 0.000000 m /eight glyphshow
6.362305 0.000000 m /zero glyphshow
grestore
gsave
/o {
gsave
newpath
translate
0.8 setlinewidth
1 setlinejoin
0 setlinecap
0 0 m
-3.5 0 l

gsave
0.000 setgray
fill
grestore
stroke
grestore
} bind def
40.05 61.146 o
grestore
gsave
10.784375 57.349088 translate
0.000000 rotate
0.000000 0.000000 m /zero glyphshow
6.362305 0.000000 m /period glyphshow
9.541016 0.000000 m /seven glyphshow
15.903320 0.000000 m /five glyphshow
grestore
gsave
/o {
gsave
newpath
translate
0.8 setlinewidth
1 setlinejoin
0 setlinecap
0 0 m
-3.5 0 l

gsave
0.000 setgray
fill
grestore
stroke
grestore
} bind def
40.05 100.595 o
grestore
gsave
10.784375 96.798321 translate
0.000000 rotate
0.000000 0.000000 m /zero glyphshow
6.362305 0.000000 m /period glyphshow
9.541016 0.000000 m /eight glyphshow
15.903320 0.000000 m /zero glyphshow
grestore
gsave
/o {
gsave
newpath
translate
0.8 setlinewidth
1 setlinejoin
0 setlinecap
0 0 m
-3.5 0 l

gsave
0.000 setgray
fill
grestore
stroke
grestore
} bind def
40.05 140.044 o
grestore
gsave
10.784375 136.247553 translate
0.000000 rotate
0.000000 0.000000 m /zero glyphshow
6.362305 0.000000 m /period glyphshow
9.541016 0.000000 m /eight glyphshow
15.903320 0.000000 m /five glyphshow
grestore
gsave
/o {
gsave
newpath
translate
0.8 setlinewidth
1 setlinejoin
0 setlinecap
0 0 m
-3.5 0 l

gsave
0.000 setgray
fill
grestore
stroke
grestore
} bind def
40.05 179.494 o
grestore
gsave
10.784375 175.696786 translate
0.000000 rotate
0.000000 0.000000 m /zero glyphshow
6.362305 0.000000 m /period glyphshow
9.541016 0.000000 m /nine glyphshow
15.903320 0.000000 m /zero glyphshow
grestore
gsave
/o {
gsave
newpath
translate
0.8 setlinewidth
1 setlinejoin
0 setlinecap
0 0 m
-3.5 0 l

gsave
0.000 setgray
fill
grestore
stroke
grestore
} bind def
40.05 218.943 o
grestore
gsave
10.784375 215.146019 translate
0.000000 rotate
0.000000 0.000000 m /zero glyphshow
6.362305 0.000000 m /period glyphshow
9.541016 0.000000 m /nine glyphshow
15.903320 0.000000 m /five glyphshow
grestore
gsave
/o {
gsave
newpath
translate
0.8 setlinewidth
1 setlinejoin
0 setlinecap
0 0 m
-3.5 0 l

gsave
0.000 setgray
fill
grestore
stroke
grestore
} bind def
40.05 258.392 o
grestore
gsave
10.784375 254.595252 translate
0.000000 rotate
0.000000 0.000000 m /one glyphshow
6.362305 0.000000 m /period glyphshow
9.541016 0.000000 m /zero glyphshow
15.903320 0.000000 m /zero glyphshow
grestore
1.500 setlinewidth
2 setlinecap
0.122 0.467 0.706 setrgbcolor
gsave
336.8 238.8 40.05 27.8 clipbox
55.361364 140.2814 m
59.338341 143.47366 l
63.315319 144.173453 l
67.292296 145.896848 l
71.269274 148.237773 l
75.246251 150.257333 l
79.223229 152.490923 l
83.200207 153.47338 l
87.177184 153.649847 l
91.154162 157.106996 l
95.131139 156.806795 l
99.108117 159.449898 l
103.085094 163.084377 l
107.062072 164.63274 l
111.03905 163.7456 l
115.016027 168.610805 l
118.993005 169.168315 l
122.969982 172.244145 l
126.94696 173.496475 l
130.923937 177.268185 l
134.900915 177.290727 l
138.877893 181.75912 l
142.85487 182.235682 l
146.831848 187.253069 l
150.808825 188.374345 l
154.785803 191.685996 l
158.76278 194.213723 l
162.739758 195.29359 l
166.716736 200.135479 l
170.693713 203.66597 l
174.670691 203.02543 l
178.647668 204.482987 l
182.624646 206.4243 l
186.601623 210.53066 l
190.578601 211.300765 l
194.555579 214.213836 l
198.532556 220.151079 l
202.509534 220.864919 l
206.486511 223.457359 l
210.463489 223.34549 l
214.440466 227.670975 l
218.417444 226.856431 l
222.394421 229.439534 l
226.371399 232.373087 l
230.348377 231.38288 l
234.325354 232.061439 l
238.302332 231.540206 l
242.279309 235.269828 l
246.256287 238.099413 l
250.233264 234.875278 l
254.210242 235.013186 l
258.18722 240.167421 l
262.164197 241.910619 l
266.141175 239.822739 l
270.118152 246.34566 l
274.09513 242.800693 l
278.072107 245.861296 l
282.049085 247.733519 l
286.026063 247.095903 l
290.00304 247.514828 l
293.980018 248.279345 l
297.956995 248.078085 l
301.933973 248.051305 l
305.91095 250.604297 l
309.887928 252.01258 l
313.864906 250.698614 l
317.841883 249.255733 l
321.818861 252.518576 l
325.795838 253.222331 l
329.772816 253.730169 l
333.749793 253.382807 l
337.726771 253.655191 l
341.703749 254.549465 l
345.680726 254.74822 l
349.657704 254.439904 l
353.634681 255.21233 l
357.611659 255.745455 l
361.588636 255.150624 l
stroke
grestore
1.000 0.498 0.055 setrgbcolor
gsave
336.8 238.8 40.05 27.8 clipbox
55.361364 132.933295 m
59.338341 134.409746 l
63.315319 132.712134 l
67.292296 133.969126 l
71.269274 136.11324 l
75.246251 136.512258 l
79.223229 136.569689 l
83.200207 136.848482 l
87.177184 134.489262 l
91.154162 135.639147 l
95.131139 133.823675 l
99.108117 134.733516 l
103.085094 135.560958 l
107.062072 136.437644 l
111.03905 133.676696 l
115.016027 134.475307 l
118.993005 132.428497 l
122.969982 133.68324 l
126.94696 130.963866 l
130.923937 129.684415 l
134.900915 123.810409 l
138.877893 130.412737 l
142.85487 128.238582 l
146.831848 127.701897 l
150.808825 126.653755 l
154.785803 125.930276 l
158.76278 121.895124 l
162.739758 124.094968 l
166.716736 120.262958 l
170.693713 118.809571 l
174.670691 116.059002 l
178.647668 120.451424 l
182.624646 118.615857 l
186.601623 111.521531 l
190.578601 118.334786 l
194.555579 115.681117 l
198.532556 109.120334 l
202.509534 97.066485 l
206.486511 96.131503 l
210.463489 106.090683 l
214.440466 95.939836 l
218.417444 94.415036 l
222.394421 94.487055 l
226.371399 91.987775 l
230.348377 99.005987 l
234.325354 97.527085 l
238.302332 90.871217 l
242.279309 93.369921 l
246.256287 86.49517 l
250.233264 84.482553 l
254.210242 81.997054 l
258.18722 83.92119 l
262.164197 89.005032 l
266.141175 91.877901 l
270.118152 67.141519 l
274.09513 88.825589 l
278.072107 74.283185 l
282.049085 63.899645 l
286.026063 73.784701 l
290.00304 67.415584 l
293.980018 72.077286 l
297.956995 62.098444 l
301.933973 72.126183 l
305.91095 63.682521 l
309.887928 52.891199 l
313.864906 44.0956 l
317.841883 38.654545 l
321.818861 52.753475 l
325.795838 51.71058 l
329.772816 57.787238 l
333.749793 62.606183 l
337.726771 59.32187 l
341.703749 46.994302 l
345.680726 52.382221 l
349.657704 56.361442 l
353.634681 44.270834 l
357.611659 52.745633 l
361.588636 44.496607 l
stroke
grestore
0.800 setlinewidth
0 setlinejoin
[] 0 setdash
0.000 setgray
gsave
40.05 27.8 m
40.05 266.6 l
stroke
grestore
gsave
376.9 27.8 m
376.9 266.6 l
stroke
grestore
gsave
40.05 27.8 m
376.9 27.8 l
stroke
grestore
gsave
40.05 266.6 m
376.9 266.6 l
stroke
grestore
/DejaVuSans findfont
12.000 scalefont
setfont
gsave
158.514062 272.600000 translate
0.000000 rotate
0.000000 0.000000 m /A glyphshow
8.208984 0.000000 m /d glyphshow
15.826172 0.000000 m /a glyphshow
23.179688 0.000000 m /d glyphshow
30.796875 0.000000 m /e glyphshow
38.179688 0.000000 m /l glyphshow
41.513672 0.000000 m /t glyphshow
46.218750 0.000000 m /a glyphshow
53.572266 0.000000 m /space glyphshow
57.386719 0.000000 m /hyphen glyphshow
61.716797 0.000000 m /space glyphshow
65.531250 0.000000 m /zero glyphshow
73.166016 0.000000 m /period glyphshow
76.980469 0.000000 m /eight glyphshow
84.615234 0.000000 m /four glyphshow
92.250000 0.000000 m /six glyphshow
grestore
1.000 setlinewidth
0 setlinecap
0.800 setgray
gsave
47.05 229.25625 m
112.565625 229.25625 l
113.898958 229.25625 114.565625 229.922917 114.565625 231.25625 c
114.565625 259.6 l
114.565625 260.933333 113.898958 261.6 112.565625 261.6 c
47.05 261.6 l
45.716667 261.6 45.05 260.933333 45.05 259.6 c
45.05 231.25625 l
45.05 229.922917 45.716667 229.25625 47.05 229.25625 c
cl
gsave
1.000 setgray
fill
grestore
stroke
grestore
1.500 setlinewidth
1 setlinejoin
2 setlinecap
[] 0 setdash
0.122 0.467 0.706 setrgbcolor
gsave
49.05 253.50625 m
69.05 253.50625 l
stroke
grestore
0.000 setgray
/DejaVuSans findfont
10.000 scalefont
setfont
gsave
77.050000 250.006250 translate
0.000000 rotate
0.000000 0.000000 m /a glyphshow
6.127930 0.000000 m /u glyphshow
12.465820 0.000000 m /c glyphshow
grestore
1.000 0.498 0.055 setrgbcolor
gsave
49.05 238.834375 m
69.05 238.834375 l
stroke
grestore
0.000 setgray
gsave
77.050000 235.334375 translate
0.000000 rotate
0.000000 0.000000 m /v glyphshow
5.917969 0.000000 m /a glyphshow
12.045898 0.000000 m /l glyphshow
14.824219 0.000000 m /A glyphshow
21.665039 0.000000 m /u glyphshow
28.002930 0.000000 m /c glyphshow
grestore
gsave
420.45 27.8 m
757.3 27.8 l
757.3 266.6 l
420.45 266.6 l
cl
1.000 setgray
fill
grestore
0.800 setlinewidth
0 setlinecap
gsave
/o {
gsave
newpath
translate
0.8 setlinewidth
1 setlinejoin
0 setlinecap
0 0 m
0 -3.5 l

gsave
0.000 setgray
fill
grestore
stroke
grestore
} bind def
427.807 27.8 o
grestore
gsave
424.627721 13.206250 translate
0.000000 rotate
0.000000 0.000000 m /zero glyphshow
grestore
gsave
/o {
gsave
newpath
translate
0.8 setlinewidth
1 setlinejoin
0 setlinecap
0 0 m
0 -3.5 l

gsave
0.000 setgray
fill
grestore
stroke
grestore
} bind def
467.577 27.8 o
grestore
gsave
461.217809 13.206250 translate
0.000000 rotate
0.000000 0.000000 m /one glyphshow
6.362305 0.000000 m /zero glyphshow
grestore
gsave
/o {
gsave
newpath
translate
0.8 setlinewidth
1 setlinejoin
0 setlinecap
0 0 m
0 -3.5 l

gsave
0.000 setgray
fill
grestore
stroke
grestore
} bind def
507.347 27.8 o
grestore
gsave
500.987585 13.206250 translate
0.000000 rotate
0.000000 0.000000 m /two glyphshow
6.362305 0.000000 m /zero glyphshow
grestore
gsave
/o {
gsave
newpath
translate
0.8 setlinewidth
1 setlinejoin
0 setlinecap
0 0 m
0 -3.5 l

gsave
0.000 setgray
fill
grestore
stroke
grestore
} bind def
547.117 27.8 o
grestore
gsave
540.757361 13.206250 translate
0.000000 rotate
0.000000 0.000000 m /three glyphshow
6.362305 0.000000 m /zero glyphshow
grestore
gsave
/o {
gsave
newpath
translate
0.8 setlinewidth
1 setlinejoin
0 setlinecap
0 0 m
0 -3.5 l

gsave
0.000 setgray
fill
grestore
stroke
grestore
} bind def
586.887 27.8 o
grestore
gsave
580.527136 13.206250 translate
0.000000 rotate
0.000000 0.000000 m /four glyphshow
6.362305 0.000000 m /zero glyphshow
grestore
gsave
/o {
gsave
newpath
translate
0.8 setlinewidth
1 setlinejoin
0 setlinecap
0 0 m
0 -3.5 l

gsave
0.000 setgray
fill
grestore
stroke
grestore
} bind def
626.656 27.8 o
grestore
gsave
620.296912 13.206250 translate
0.000000 rotate
0.000000 0.000000 m /five glyphshow
6.362305 0.000000 m /zero glyphshow
grestore
gsave
/o {
gsave
newpath
translate
0.8 setlinewidth
1 setlinejoin
0 setlinecap
0 0 m
0 -3.5 l

gsave
0.000 setgray
fill
grestore
stroke
grestore
} bind def
666.426 27.8 o
grestore
gsave
660.066688 13.206250 translate
0.000000 rotate
0.000000 0.000000 m /six glyphshow
6.362305 0.000000 m /zero glyphshow
grestore
gsave
/o {
gsave
newpath
translate
0.8 setlinewidth
1 setlinejoin
0 setlinecap
0 0 m
0 -3.5 l

gsave
0.000 setgray
fill
grestore
stroke
grestore
} bind def
706.196 27.8 o
grestore
gsave
699.836463 13.206250 translate
0.000000 rotate
0.000000 0.000000 m /seven glyphshow
6.362305 0.000000 m /zero glyphshow
grestore
gsave
/o {
gsave
newpath
translate
0.8 setlinewidth
1 setlinejoin
0 setlinecap
0 0 m
0 -3.5 l

gsave
0.000 setgray
fill
grestore
stroke
grestore
} bind def
745.966 27.8 o
grestore
gsave
739.606239 13.206250 translate
0.000000 rotate
0.000000 0.000000 m /eight glyphshow
6.362305 0.000000 m /zero glyphshow
grestore
gsave
/o {
gsave
newpath
translate
0.8 setlinewidth
1 setlinejoin
0 setlinecap
0 0 m
-3.5 0 l

gsave
0.000 setgray
fill
grestore
stroke
grestore
} bind def
420.45 49.0927 o
grestore
gsave
391.184375 45.295807 translate
0.000000 rotate
0.000000 0.000000 m /zero glyphshow
6.362305 0.000000 m /period glyphshow
9.541016 0.000000 m /seven glyphshow
15.903320 0.000000 m /zero glyphshow
grestore
gsave
/o {
gsave
newpath
translate
0.8 setlinewidth
1 setlinejoin
0 setlinecap
0 0 m
-3.5 0 l

gsave
0.000 setgray
fill
grestore
stroke
grestore
} bind def
420.45 83.5764 o
grestore
gsave
391.184375 79.779547 translate
0.000000 rotate
0.000000 0.000000 m /zero glyphshow
6.362305 0.000000 m /period glyphshow
9.541016 0.000000 m /seven glyphshow
15.903320 0.000000 m /five glyphshow
grestore
gsave
/o {
gsave
newpath
translate
0.8 setlinewidth
1 setlinejoin
0 setlinecap
0 0 m
-3.5 0 l

gsave
0.000 setgray
fill
grestore
stroke
grestore
} bind def
420.45 118.06 o
grestore
gsave
391.184375 114.263286 translate
0.000000 rotate
0.000000 0.000000 m /zero glyphshow
6.362305 0.000000 m /period glyphshow
9.541016 0.000000 m /eight glyphshow
15.903320 0.000000 m /zero glyphshow
grestore
gsave
/o {
gsave
newpath
translate
0.8 setlinewidth
1 setlinejoin
0 setlinecap
0 0 m
-3.5 0 l

gsave
0.000 setgray
fill
grestore
stroke
grestore
} bind def
420.45 152.544 o
grestore
gsave
391.184375 148.747025 translate
0.000000 rotate
0.000000 0.000000 m /zero glyphshow
6.362305 0.000000 m /period glyphshow
9.541016 0.000000 m /eight glyphshow
15.903320 0.000000 m /five glyphshow
grestore
gsave
/o {
gsave
newpath
translate
0.8 setlinewidth
1 setlinejoin
0 setlinecap
0 0 m
-3.5 0 l

gsave
0.000 setgray
fill
grestore
stroke
grestore
} bind def
420.45 187.028 o
grestore
gsave
391.184375 183.230765 translate
0.000000 rotate
0.000000 0.000000 m /zero glyphshow
6.362305 0.000000 m /period glyphshow
9.541016 0.000000 m /nine glyphshow
15.903320 0.000000 m /zero glyphshow
grestore
gsave
/o {
gsave
newpath
translate
0.8 setlinewidth
1 setlinejoin
0 setlinecap
0 0 m
-3.5 0 l

gsave
0.000 setgray
fill
grestore
stroke
grestore
} bind def
420.45 221.511 o
grestore
gsave
391.184375 217.714504 translate
0.000000 rotate
0.000000 0.000000 m /zero glyphshow
6.362305 0.000000 m /period glyphshow
9.541016 0.000000 m /nine glyphshow
15.903320 0.000000 m /five glyphshow
grestore
gsave
/o {
gsave
newpath
translate
0.8 setlinewidth
1 setlinejoin
0 setlinecap
0 0 m
-3.5 0 l

gsave
0.000 setgray
fill
grestore
stroke
grestore
} bind def
420.45 255.995 o
grestore
gsave
391.184375 252.198243 translate
0.000000 rotate
0.000000 0.000000 m /one glyphshow
6.362305 0.000000 m /period glyphshow
9.541016 0.000000 m /zero glyphshow
15.903320 0.000000 m /zero glyphshow
grestore
1.500 setlinewidth
2 setlinecap
0.122 0.467 0.706 setrgbcolor
gsave
336.8 238.8 420.5 27.8 clipbox
435.761364 155.766905 m
439.738341 157.663205 l
443.715319 162.230174 l
447.692296 164.20559 l
451.669274 167.201468 l
455.646251 169.730776 l
459.623229 171.582601 l
463.600207 175.231266 l
467.577184 179.815643 l
471.554162 181.197026 l
475.531139 186.714587 l
479.508117 193.276583 l
483.485094 190.159614 l
487.462072 200.267339 l
491.43905 204.770021 l
495.416027 209.368852 l
499.393005 211.129028 l
503.369982 210.860173 l
507.34696 216.183638 l
511.323937 221.043402 l
515.300915 226.429441 l
519.277893 228.96748 l
523.25487 231.704727 l
527.231848 233.851441 l
531.208825 235.338206 l
535.185803 239.904271 l
539.16278 237.228691 l
543.139758 241.757064 l
547.116736 241.481773 l
551.093713 245.474354 l
555.070691 245.144592 l
559.047668 246.859469 l
563.024646 247.322757 l
567.001623 248.590911 l
570.978601 248.938535 l
574.955579 248.811453 l
578.932556 249.027619 l
582.909534 248.560303 l
586.886511 248.531852 l
590.863489 251.917324 l
594.840466 253.073564 l
598.817444 251.660401 l
602.794421 251.800637 l
606.771399 249.781093 l
610.748377 252.109198 l
614.725354 254.038569 l
618.702332 253.528593 l
622.679309 253.856002 l
626.656287 251.259755 l
630.633264 251.707978 l
634.610242 253.979436 l
638.58722 254.579937 l
642.564197 254.219303 l
646.541175 253.638465 l
650.518152 253.6528 l
654.49513 254.791538 l
658.472107 253.602977 l
662.449085 252.039554 l
666.426063 254.830628 l
670.40304 254.959609 l
674.380018 255.041864 l
678.356995 254.076428 l
682.333973 254.994819 l
686.31095 254.766448 l
690.287928 254.712519 l
694.264906 254.470161 l
698.241883 255.135046 l
702.218861 254.659497 l
706.195838 255.548257 l
710.172816 255.364421 l
714.149793 255.24703 l
718.126771 255.387756 l
722.103749 255.249849 l
726.080726 253.121752 l
730.057704 254.220465 l
734.034681 255.726453 l
738.011659 255.745455 l
741.988636 255.508139 l
stroke
grestore
1.000 0.498 0.055 setrgbcolor
gsave
336.8 238.8 420.5 27.8 clipbox
435.761364 146.952752 m
439.738341 146.351563 l
443.715319 148.576404 l
447.692296 148.333736 l
451.669274 148.712418 l
455.646251 148.289053 l
459.623229 145.792285 l
463.600207 145.336485 l
467.577184 145.377362 l
471.554162 138.461531 l
475.531139 137.047206 l
479.508117 135.820407 l
483.485094 137.537834 l
487.462072 134.538441 l
491.43905 126.91013 l
495.416027 123.442764 l
499.393005 119.021963 l
503.369982 122.686508 l
507.34696 114.636495 l
511.323937 110.766177 l
515.300915 105.006001 l
519.277893 105.847439 l
523.25487 95.618225 l
527.231848 91.673738 l
531.208825 87.456518 l
535.185803 81.237089 l
539.16278 73.207262 l
543.139758 89.177675 l
547.116736 82.711319 l
551.093713 69.042285 l
555.070691 72.568094 l
559.047668 70.948197 l
563.024646 70.620145 l
567.001623 75.357178 l
570.978601 50.47233 l
574.955579 50.419986 l
578.932556 59.53596 l
582.909534 41.928135 l
586.886511 66.243724 l
590.863489 52.531595 l
594.840466 54.847843 l
598.817444 45.844698 l
602.794421 61.380632 l
606.771399 51.43577 l
610.748377 57.214621 l
614.725354 58.60934 l
618.702332 64.205578 l
622.679309 50.756758 l
626.656287 38.654545 l
630.633264 65.451556 l
634.610242 48.432596 l
638.58722 42.828721 l
642.564197 59.10695 l
646.541175 54.435769 l
650.518152 73.54731 l
654.49513 55.381215 l
658.472107 45.43159 l
662.449085 42.389908 l
666.426063 67.601749 l
670.40304 60.775889 l
674.380018 67.373093 l
678.356995 45.504625 l
682.333973 56.352543 l
686.31095 46.819277 l
690.287928 47.434403 l
694.264906 55.113017 l
698.241883 50.999527 l
702.218861 41.238664 l
706.195838 57.80825 l
710.172816 60.311294 l
714.149793 49.809548 l
718.126771 54.773019 l
722.103749 52.275671 l
726.080726 49.521289 l
730.057704 55.419446 l
734.034681 62.043893 l
738.011659 49.663377 l
741.988636 59.868699 l
stroke
grestore
0.800 setlinewidth
0 setlinejoin
[] 0 setdash
0.000 setgray
gsave
420.45 27.8 m
420.45 266.6 l
stroke
grestore
gsave
757.3 27.8 m
757.3 266.6 l
stroke
grestore
gsave
420.45 27.8 m
757.3 27.8 l
stroke
grestore
gsave
420.45 266.6 m
757.3 266.6 l
stroke
grestore
/DejaVuSans findfont
12.000 scalefont
setfont
gsave
548.273438 272.600000 translate
0.000000 rotate
0.000000 0.000000 m /A glyphshow
8.208984 0.000000 m /d glyphshow
15.826172 0.000000 m /a glyphshow
23.179688 0.000000 m /m glyphshow
34.869141 0.000000 m /space glyphshow
38.683594 0.000000 m /hyphen glyphshow
43.013672 0.000000 m /space glyphshow
46.828125 0.000000 m /zero glyphshow
54.462891 0.000000 m /period glyphshow
58.277344 0.000000 m /eight glyphshow
65.912109 0.000000 m /four glyphshow
73.546875 0.000000 m /four glyphshow
grestore
1.000 setlinewidth
0 setlinecap
0.800 setgray
gsave
427.45 229.25625 m
492.965625 229.25625 l
494.298958 229.25625 494.965625 229.922917 494.965625 231.25625 c
494.965625 259.6 l
494.965625 260.933333 494.298958 261.6 492.965625 261.6 c
427.45 261.6 l
426.116667 261.6 425.45 260.933333 425.45 259.6 c
425.45 231.25625 l
425.45 229.922917 426.116667 229.25625 427.45 229.25625 c
cl
gsave
1.000 setgray
fill
grestore
stroke
grestore
1.500 setlinewidth
1 setlinejoin
2 setlinecap
[] 0 setdash
0.122 0.467 0.706 setrgbcolor
gsave
429.45 253.50625 m
449.45 253.50625 l
stroke
grestore
0.000 setgray
/DejaVuSans findfont
10.000 scalefont
setfont
gsave
457.450000 250.006250 translate
0.000000 rotate
0.000000 0.000000 m /a glyphshow
6.127930 0.000000 m /u glyphshow
12.465820 0.000000 m /c glyphshow
grestore
1.000 0.498 0.055 setrgbcolor
gsave
429.45 238.834375 m
449.45 238.834375 l
stroke
grestore
0.000 setgray
gsave
457.450000 235.334375 translate
0.000000 rotate
0.000000 0.000000 m /v glyphshow
5.917969 0.000000 m /a glyphshow
12.045898 0.000000 m /l glyphshow
14.824219 0.000000 m /A glyphshow
21.665039 0.000000 m /u glyphshow
28.002930 0.000000 m /c glyphshow
grestore
gsave
800.85 27.8 m
1137.7 27.8 l
1137.7 266.6 l
800.85 266.6 l
cl
1.000 setgray
fill
grestore
0.800 setlinewidth
0 setlinecap
gsave
/o {
gsave
newpath
translate
0.8 setlinewidth
1 setlinejoin
0 setlinecap
0 0 m
0 -3.5 l

gsave
0.000 setgray
fill
grestore
stroke
grestore
} bind def
808.207 27.8 o
grestore
gsave
805.027721 13.206250 translate
0.000000 rotate
0.000000 0.000000 m /zero glyphshow
grestore
gsave
/o {
gsave
newpath
translate
0.8 setlinewidth
1 setlinejoin
0 setlinecap
0 0 m
0 -3.5 l

gsave
0.000 setgray
fill
grestore
stroke
grestore
} bind def
847.977 27.8 o
grestore
gsave
841.617809 13.206250 translate
0.000000 rotate
0.000000 0.000000 m /one glyphshow
6.362305 0.000000 m /zero glyphshow
grestore
gsave
/o {
gsave
newpath
translate
0.8 setlinewidth
1 setlinejoin
0 setlinecap
0 0 m
0 -3.5 l

gsave
0.000 setgray
fill
grestore
stroke
grestore
} bind def
887.747 27.8 o
grestore
gsave
881.387585 13.206250 translate
0.000000 rotate
0.000000 0.000000 m /two glyphshow
6.362305 0.000000 m /zero glyphshow
grestore
gsave
/o {
gsave
newpath
translate
0.8 setlinewidth
1 setlinejoin
0 setlinecap
0 0 m
0 -3.5 l

gsave
0.000 setgray
fill
grestore
stroke
grestore
} bind def
927.517 27.8 o
grestore
gsave
921.157361 13.206250 translate
0.000000 rotate
0.000000 0.000000 m /three glyphshow
6.362305 0.000000 m /zero glyphshow
grestore
gsave
/o {
gsave
newpath
translate
0.8 setlinewidth
1 setlinejoin
0 setlinecap
0 0 m
0 -3.5 l

gsave
0.000 setgray
fill
grestore
stroke
grestore
} bind def
967.287 27.8 o
grestore
gsave
960.927136 13.206250 translate
0.000000 rotate
0.000000 0.000000 m /four glyphshow
6.362305 0.000000 m /zero glyphshow
grestore
gsave
/o {
gsave
newpath
translate
0.8 setlinewidth
1 setlinejoin
0 setlinecap
0 0 m
0 -3.5 l

gsave
0.000 setgray
fill
grestore
stroke
grestore
} bind def
1007.06 27.8 o
grestore
gsave
1000.696912 13.206250 translate
0.000000 rotate
0.000000 0.000000 m /five glyphshow
6.362305 0.000000 m /zero glyphshow
grestore
gsave
/o {
gsave
newpath
translate
0.8 setlinewidth
1 setlinejoin
0 setlinecap
0 0 m
0 -3.5 l

gsave
0.000 setgray
fill
grestore
stroke
grestore
} bind def
1046.83 27.8 o
grestore
gsave
1040.466688 13.206250 translate
0.000000 rotate
0.000000 0.000000 m /six glyphshow
6.362305 0.000000 m /zero glyphshow
grestore
gsave
/o {
gsave
newpath
translate
0.8 setlinewidth
1 setlinejoin
0 setlinecap
0 0 m
0 -3.5 l

gsave
0.000 setgray
fill
grestore
stroke
grestore
} bind def
1086.6 27.8 o
grestore
gsave
1080.236463 13.206250 translate
0.000000 rotate
0.000000 0.000000 m /seven glyphshow
6.362305 0.000000 m /zero glyphshow
grestore
gsave
/o {
gsave
newpath
translate
0.8 setlinewidth
1 setlinejoin
0 setlinecap
0 0 m
0 -3.5 l

gsave
0.000 setgray
fill
grestore
stroke
grestore
} bind def
1126.37 27.8 o
grestore
gsave
1120.006239 13.206250 translate
0.000000 rotate
0.000000 0.000000 m /eight glyphshow
6.362305 0.000000 m /zero glyphshow
grestore
gsave
/o {
gsave
newpath
translate
0.8 setlinewidth
1 setlinejoin
0 setlinecap
0 0 m
-3.5 0 l

gsave
0.000 setgray
fill
grestore
stroke
grestore
} bind def
800.85 49.756 o
grestore
gsave
771.584375 45.959118 translate
0.000000 rotate
0.000000 0.000000 m /zero glyphshow
6.362305 0.000000 m /period glyphshow
9.541016 0.000000 m /seven glyphshow
15.903320 0.000000 m /zero glyphshow
grestore
gsave
/o {
gsave
newpath
translate
0.8 setlinewidth
1 setlinejoin
0 setlinecap
0 0 m
-3.5 0 l

gsave
0.000 setgray
fill
grestore
stroke
grestore
} bind def
800.85 84.1007 o
grestore
gsave
771.584375 80.303840 translate
0.000000 rotate
0.000000 0.000000 m /zero glyphshow
6.362305 0.000000 m /period glyphshow
9.541016 0.000000 m /seven glyphshow
15.903320 0.000000 m /five glyphshow
grestore
gsave
/o {
gsave
newpath
translate
0.8 setlinewidth
1 setlinejoin
0 setlinecap
0 0 m
-3.5 0 l

gsave
0.000 setgray
fill
grestore
stroke
grestore
} bind def
800.85 118.445 o
grestore
gsave
771.584375 114.648562 translate
0.000000 rotate
0.000000 0.000000 m /zero glyphshow
6.362305 0.000000 m /period glyphshow
9.541016 0.000000 m /eight glyphshow
15.903320 0.000000 m /zero glyphshow
grestore
gsave
/o {
gsave
newpath
translate
0.8 setlinewidth
1 setlinejoin
0 setlinecap
0 0 m
-3.5 0 l

gsave
0.000 setgray
fill
grestore
stroke
grestore
} bind def
800.85 152.79 o
grestore
gsave
771.584375 148.993284 translate
0.000000 rotate
0.000000 0.000000 m /zero glyphshow
6.362305 0.000000 m /period glyphshow
9.541016 0.000000 m /eight glyphshow
15.903320 0.000000 m /five glyphshow
grestore
gsave
/o {
gsave
newpath
translate
0.8 setlinewidth
1 setlinejoin
0 setlinecap
0 0 m
-3.5 0 l

gsave
0.000 setgray
fill
grestore
stroke
grestore
} bind def
800.85 187.135 o
grestore
gsave
771.584375 183.338006 translate
0.000000 rotate
0.000000 0.000000 m /zero glyphshow
6.362305 0.000000 m /period glyphshow
9.541016 0.000000 m /nine glyphshow
15.903320 0.000000 m /zero glyphshow
grestore
gsave
/o {
gsave
newpath
translate
0.8 setlinewidth
1 setlinejoin
0 setlinecap
0 0 m
-3.5 0 l

gsave
0.000 setgray
fill
grestore
stroke
grestore
} bind def
800.85 221.48 o
grestore
gsave
771.584375 217.682728 translate
0.000000 rotate
0.000000 0.000000 m /zero glyphshow
6.362305 0.000000 m /period glyphshow
9.541016 0.000000 m /nine glyphshow
15.903320 0.000000 m /five glyphshow
grestore
gsave
/o {
gsave
newpath
translate
0.8 setlinewidth
1 setlinejoin
0 setlinecap
0 0 m
-3.5 0 l

gsave
0.000 setgray
fill
grestore
stroke
grestore
} bind def
800.85 255.824 o
grestore
gsave
771.584375 252.027450 translate
0.000000 rotate
0.000000 0.000000 m /one glyphshow
6.362305 0.000000 m /period glyphshow
9.541016 0.000000 m /zero glyphshow
15.903320 0.000000 m /zero glyphshow
grestore
1.500 setlinewidth
2 setlinecap
0.122 0.467 0.706 setrgbcolor
gsave
336.9 238.8 800.9 27.8 clipbox
816.161364 155.936932 m
820.138341 158.651196 l
824.115319 160.147747 l
828.092296 163.580408 l
832.069274 163.657536 l
836.046251 168.202505 l
840.023229 169.318614 l
844.000207 171.762589 l
847.977184 174.112665 l
851.954162 179.485415 l
855.931139 180.995449 l
859.908117 183.233679 l
863.885094 187.366301 l
867.862072 192.208844 l
871.83905 194.905908 l
875.816027 198.020955 l
879.793005 201.91689 l
883.769982 205.326088 l
887.74696 208.190246 l
891.723937 210.782703 l
895.700915 213.938919 l
899.677893 218.614507 l
903.65487 222.280285 l
907.631848 224.081124 l
911.608825 229.068811 l
915.585803 229.060354 l
919.56278 232.887918 l
923.539758 236.746931 l
927.516736 236.724755 l
931.493713 232.918066 l
935.470691 242.206852 l
939.447668 243.863474 l
943.424646 242.899573 l
947.401623 244.943093 l
951.378601 245.43878 l
955.355579 248.087882 l
959.332556 248.598095 l
963.309534 248.477695 l
967.286511 248.93118 l
971.263489 249.598373 l
975.240466 251.277488 l
979.217444 251.938936 l
983.194421 251.200803 l
987.171399 252.616772 l
991.148377 253.228843 l
995.125354 252.735734 l
999.102332 253.548329 l
1003.079309 253.260541 l
1007.056287 254.465582 l
1011.033264 254.324892 l
1015.010242 254.169973 l
1018.98722 254.44461 l
1022.964197 254.957695 l
1026.941175 255.109553 l
1030.918152 253.637409 l
1034.89513 254.45137 l
1038.872107 255.241998 l
1042.849085 255.162933 l
1046.826063 254.472351 l
1050.80304 255.229538 l
1054.780018 255.196872 l
1058.756995 255.391633 l
1062.733973 255.205352 l
1066.71095 255.503981 l
1070.687928 255.480068 l
1074.664906 255.54315 l
1078.641883 255.40561 l
1082.618861 255.518572 l
1086.595838 255.440365 l
1090.572816 255.441564 l
1094.549793 255.261365 l
1098.526771 255.474018 l
1102.503749 255.67701 l
1106.480726 254.915797 l
1110.457704 255.556587 l
1114.434681 255.745455 l
1118.411659 255.74041 l
1122.388636 255.649384 l
stroke
grestore
1.000 0.498 0.055 setrgbcolor
gsave
336.9 238.8 800.9 27.8 clipbox
816.161364 147.019118 m
820.138341 148.288587 l
824.115319 147.544416 l
828.092296 148.598499 l
832.069274 147.662688 l
836.046251 148.893176 l
840.023229 149.044957 l
844.000207 148.223753 l
847.977184 148.196268 l
851.954162 146.404364 l
855.931139 144.90932 l
859.908117 145.629144 l
863.885094 142.856348 l
867.862072 141.418207 l
871.83905 140.171052 l
875.816027 136.571707 l
879.793005 131.309949 l
883.769982 125.41411 l
887.74696 127.247881 l
891.723937 122.985413 l
895.700915 121.295366 l
899.677893 124.021676 l
903.65487 118.253119 l
907.631848 123.154087 l
911.608825 103.236666 l
915.585803 103.795246 l
919.56278 112.073999 l
923.539758 93.430163 l
927.516736 105.737952 l
931.493713 115.000157 l
935.470691 85.849146 l
939.447668 82.561169 l
943.424646 93.835833 l
947.401623 73.164577 l
951.378601 84.809721 l
955.355579 68.658311 l
959.332556 77.170973 l
963.309534 79.779186 l
967.286511 67.837961 l
971.263489 85.093956 l
975.240466 62.593271 l
979.217444 67.041632 l
983.194421 67.632767 l
987.171399 58.98484 l
991.148377 66.258831 l
995.125354 71.376714 l
999.102332 60.09073 l
1003.079309 59.329189 l
1007.056287 60.877847 l
1011.033264 63.089678 l
1015.010242 64.563061 l
1018.98722 53.595548 l
1022.964197 54.999553 l
1026.941175 54.480129 l
1030.918152 74.469713 l
1034.89513 68.359593 l
1038.872107 60.082045 l
1042.849085 57.379706 l
1046.826063 70.381968 l
1050.80304 58.101387 l
1054.780018 62.878385 l
1058.756995 45.616566 l
1062.733973 64.027924 l
1066.71095 54.1972 l
1070.687928 58.280076 l
1074.664906 51.532084 l
1078.641883 48.257159 l
1082.618861 61.644308 l
1086.595838 59.436292 l
1090.572816 74.908139 l
1094.549793 55.794477 l
1098.526771 59.971504 l
1102.503749 50.375441 l
1106.480726 38.654545 l
1110.457704 46.558828 l
1114.434681 58.678617 l
1118.411659 45.193703 l
1122.388636 66.508403 l
stroke
grestore
0.800 setlinewidth
0 setlinejoin
[] 0 setdash
0.000 setgray
gsave
800.85 27.8 m
800.85 266.6 l
stroke
grestore
gsave
1137.7 27.8 m
1137.7 266.6 l
stroke
grestore
gsave
800.85 27.8 m
1137.7 27.8 l
stroke
grestore
gsave
800.85 266.6 m
1137.7 266.6 l
stroke
grestore
/DejaVuSans findfont
12.000 scalefont
setfont
gsave
921.439063 272.600000 translate
0.000000 rotate
0.000000 0.000000 m /A glyphshow
8.208984 0.000000 m /d glyphshow
15.826172 0.000000 m /a glyphshow
23.179688 0.000000 m /m glyphshow
34.869141 0.000000 m /a glyphshow
42.222656 0.000000 m /x glyphshow
49.324219 0.000000 m /space glyphshow
53.138672 0.000000 m /hyphen glyphshow
57.468750 0.000000 m /space glyphshow
61.283203 0.000000 m /zero glyphshow
68.917969 0.000000 m /period glyphshow
72.732422 0.000000 m /eight glyphshow
80.367188 0.000000 m /four glyphshow
88.001953 0.000000 m /five glyphshow
grestore
1.000 setlinewidth
0 setlinecap
0.800 setgray
gsave
807.85 229.25625 m
873.365625 229.25625 l
874.698958 229.25625 875.365625 229.922917 875.365625 231.25625 c
875.365625 259.6 l
875.365625 260.933333 874.698958 261.6 873.365625 261.6 c
807.85 261.6 l
806.516667 261.6 805.85 260.933333 805.85 259.6 c
805.85 231.25625 l
805.85 229.922917 806.516667 229.25625 807.85 229.25625 c
cl
gsave
1.000 setgray
fill
grestore
stroke
grestore
1.500 setlinewidth
1 setlinejoin
2 setlinecap
[] 0 setdash
0.122 0.467 0.706 setrgbcolor
gsave
809.85 253.50625 m
829.85 253.50625 l
stroke
grestore
0.000 setgray
/DejaVuSans findfont
10.000 scalefont
setfont
gsave
837.850000 250.006250 translate
0.000000 rotate
0.000000 0.000000 m /a glyphshow
6.127930 0.000000 m /u glyphshow
12.465820 0.000000 m /c glyphshow
grestore
1.000 0.498 0.055 setrgbcolor
gsave
809.85 238.834375 m
829.85 238.834375 l
stroke
grestore
0.000 setgray
gsave
837.850000 235.334375 translate
0.000000 rotate
0.000000 0.000000 m /v glyphshow
5.917969 0.000000 m /a glyphshow
12.045898 0.000000 m /l glyphshow
14.824219 0.000000 m /A glyphshow
21.665039 0.000000 m /u glyphshow
28.002930 0.000000 m /c glyphshow
grestore

end
showpage
