%!PS-Adobe-3.0 EPSF-3.0
%%Title: imgNets/opti_2_400_100.eps
%%Creator: matplotlib version 2.0.2, http://matplotlib.org/
%%CreationDate: Thu Apr 19 17:09:00 2018
%%Orientation: portrait
%%BoundingBox: -270 108 882 684
%%EndComments
%%BeginProlog
/mpldict 8 dict def
mpldict begin
/m { moveto } bind def
/l { lineto } bind def
/r { rlineto } bind def
/c { curveto } bind def
/cl { closepath } bind def
/box {
m
1 index 0 r
0 exch r
neg 0 r
cl
} bind def
/clipbox {
box
clip
newpath
} bind def
%!PS-Adobe-3.0 Resource-Font
%%Title: DejaVu Sans
%%Copyright: Copyright (c) 2003 by Bitstream, Inc. All Rights Reserved. Copyright (c) 2006 by Tavmjong Bah. All Rights Reserved. DejaVu changes are in public domain 
%%Creator: Converted from TrueType to type 3 by PPR
25 dict begin
/_d{bind def}bind def
/_m{moveto}_d
/_l{lineto}_d
/_cl{closepath eofill}_d
/_c{curveto}_d
/_sc{7 -1 roll{setcachedevice}{pop pop pop pop pop pop}ifelse}_d
/_e{exec}_d
/FontName /DejaVuSans def
/PaintType 0 def
/FontMatrix[.001 0 0 .001 0 0]def
/FontBBox[-1021 -463 1793 1232]def
/FontType 3 def
/Encoding [ /space /hyphen /period /zero /one /two /three /four /five /six /seven /eight /nine /A /D /G /M /R /S /a /c /d /e /g /l /m /o /p /r /t /u /v /x ] def
/FontInfo 10 dict dup begin
/FamilyName (DejaVu Sans) def
/FullName (DejaVu Sans) def
/Notice (Copyright (c) 2003 by Bitstream, Inc. All Rights Reserved. Copyright (c) 2006 by Tavmjong Bah. All Rights Reserved. DejaVu changes are in public domain ) def
/Weight (Book) def
/Version (Version 2.35) def
/ItalicAngle 0.0 def
/isFixedPitch false def
/UnderlinePosition -130 def
/UnderlineThickness 90 def
end readonly def
/CharStrings 33 dict dup begin
/space{318 0 0 0 0 0 _sc
}_d
/hyphen{361 0 49 234 312 314 _sc
49 314 _m
312 314 _l
312 234 _l
49 234 _l
49 314 _l
_cl}_d
/period{318 0 107 0 210 124 _sc
107 124 _m
210 124 _l
210 0 _l
107 0 _l
107 124 _l
_cl}_d
/zero{636 0 66 -13 570 742 _sc
318 664 _m
267 664 229 639 203 589 _c
177 539 165 464 165 364 _c
165 264 177 189 203 139 _c
229 89 267 64 318 64 _c
369 64 407 89 433 139 _c
458 189 471 264 471 364 _c
471 464 458 539 433 589 _c
407 639 369 664 318 664 _c
318 742 _m
399 742 461 709 505 645 _c
548 580 570 486 570 364 _c
570 241 548 147 505 83 _c
461 19 399 -13 318 -13 _c
236 -13 173 19 130 83 _c
87 147 66 241 66 364 _c
66 486 87 580 130 645 _c
173 709 236 742 318 742 _c
_cl}_d
/one{636 0 110 0 544 729 _sc
124 83 _m
285 83 _l
285 639 _l
110 604 _l
110 694 _l
284 729 _l
383 729 _l
383 83 _l
544 83 _l
544 0 _l
124 0 _l
124 83 _l
_cl}_d
/two{{636 0 73 0 536 742 _sc
192 83 _m
536 83 _l
536 0 _l
73 0 _l
73 83 _l
110 121 161 173 226 239 _c
290 304 331 346 348 365 _c
380 400 402 430 414 455 _c
426 479 433 504 433 528 _c
433 566 419 598 392 622 _c
365 646 330 659 286 659 _c
255 659 222 653 188 643 _c
154 632 117 616 78 594 _c
78 694 _l
118 710 155 722 189 730 _c
223 738 255 742 284 742 _c
}_e{359 742 419 723 464 685 _c
509 647 532 597 532 534 _c
532 504 526 475 515 449 _c
504 422 484 390 454 354 _c
446 344 420 317 376 272 _c
332 227 271 164 192 83 _c
_cl}_e}_d
/three{{636 0 76 -13 556 742 _sc
406 393 _m
453 383 490 362 516 330 _c
542 298 556 258 556 212 _c
556 140 531 84 482 45 _c
432 6 362 -13 271 -13 _c
240 -13 208 -10 176 -4 _c
144 1 110 10 76 22 _c
76 117 _l
103 101 133 89 166 81 _c
198 73 232 69 268 69 _c
330 69 377 81 409 105 _c
441 129 458 165 458 212 _c
458 254 443 288 413 312 _c
383 336 341 349 287 349 _c
}_e{202 349 _l
202 430 _l
291 430 _l
339 430 376 439 402 459 _c
428 478 441 506 441 543 _c
441 580 427 609 401 629 _c
374 649 336 659 287 659 _c
260 659 231 656 200 650 _c
169 644 135 635 98 623 _c
98 711 _l
135 721 170 729 203 734 _c
235 739 266 742 296 742 _c
370 742 429 725 473 691 _c
517 657 539 611 539 553 _c
539 513 527 479 504 451 _c
481 423 448 403 406 393 _c
_cl}_e}_d
/four{636 0 49 0 580 729 _sc
378 643 _m
129 254 _l
378 254 _l
378 643 _l
352 729 _m
476 729 _l
476 254 _l
580 254 _l
580 172 _l
476 172 _l
476 0 _l
378 0 _l
378 172 _l
49 172 _l
49 267 _l
352 729 _l
_cl}_d
/five{{636 0 77 -13 549 729 _sc
108 729 _m
495 729 _l
495 646 _l
198 646 _l
198 467 _l
212 472 227 476 241 478 _c
255 480 270 482 284 482 _c
365 482 429 459 477 415 _c
525 370 549 310 549 234 _c
549 155 524 94 475 51 _c
426 8 357 -13 269 -13 _c
238 -13 207 -10 175 -6 _c
143 -1 111 6 77 17 _c
77 116 _l
106 100 136 88 168 80 _c
199 72 232 69 267 69 _c
}_e{323 69 368 83 401 113 _c
433 143 450 183 450 234 _c
450 284 433 324 401 354 _c
368 384 323 399 267 399 _c
241 399 214 396 188 390 _c
162 384 135 375 108 363 _c
108 729 _l
_cl}_e}_d
/six{{636 0 70 -13 573 742 _sc
330 404 _m
286 404 251 388 225 358 _c
199 328 186 286 186 234 _c
186 181 199 139 225 109 _c
251 79 286 64 330 64 _c
374 64 409 79 435 109 _c
461 139 474 181 474 234 _c
474 286 461 328 435 358 _c
409 388 374 404 330 404 _c
526 713 _m
526 623 _l
501 635 476 644 451 650 _c
425 656 400 659 376 659 _c
310 659 260 637 226 593 _c
}_e{192 549 172 482 168 394 _c
187 422 211 444 240 459 _c
269 474 301 482 336 482 _c
409 482 467 459 509 415 _c
551 371 573 310 573 234 _c
573 159 550 99 506 54 _c
462 9 403 -13 330 -13 _c
246 -13 181 19 137 83 _c
92 147 70 241 70 364 _c
70 479 97 571 152 639 _c
206 707 280 742 372 742 _c
396 742 421 739 447 735 _c
472 730 498 723 526 713 _c
_cl}_e}_d
/seven{636 0 82 0 551 729 _sc
82 729 _m
551 729 _l
551 687 _l
286 0 _l
183 0 _l
432 646 _l
82 646 _l
82 729 _l
_cl}_d
/eight{{636 0 68 -13 568 742 _sc
318 346 _m
271 346 234 333 207 308 _c
180 283 167 249 167 205 _c
167 161 180 126 207 101 _c
234 76 271 64 318 64 _c
364 64 401 76 428 102 _c
455 127 469 161 469 205 _c
469 249 455 283 429 308 _c
402 333 365 346 318 346 _c
219 388 _m
177 398 144 418 120 447 _c
96 476 85 511 85 553 _c
85 611 105 657 147 691 _c
188 725 245 742 318 742 _c
}_e{390 742 447 725 489 691 _c
530 657 551 611 551 553 _c
551 511 539 476 515 447 _c
491 418 459 398 417 388 _c
464 377 501 355 528 323 _c
554 291 568 251 568 205 _c
568 134 546 80 503 43 _c
459 5 398 -13 318 -13 _c
237 -13 175 5 132 43 _c
89 80 68 134 68 205 _c
68 251 81 291 108 323 _c
134 355 171 377 219 388 _c
183 544 _m
183 506 194 476 218 455 _c
}_e{242 434 275 424 318 424 _c
360 424 393 434 417 455 _c
441 476 453 506 453 544 _c
453 582 441 611 417 632 _c
393 653 360 664 318 664 _c
275 664 242 653 218 632 _c
194 611 183 582 183 544 _c
_cl}_e}_d
/nine{{636 0 63 -13 566 742 _sc
110 15 _m
110 105 _l
134 93 159 84 185 78 _c
210 72 235 69 260 69 _c
324 69 374 90 408 134 _c
442 178 462 244 468 334 _c
448 306 424 284 396 269 _c
367 254 335 247 300 247 _c
226 247 168 269 126 313 _c
84 357 63 417 63 494 _c
63 568 85 628 129 674 _c
173 719 232 742 306 742 _c
390 742 455 709 499 645 _c
543 580 566 486 566 364 _c
}_e{566 248 538 157 484 89 _c
429 21 356 -13 264 -13 _c
239 -13 214 -10 189 -6 _c
163 -2 137 5 110 15 _c
306 324 _m
350 324 385 339 411 369 _c
437 399 450 441 450 494 _c
450 546 437 588 411 618 _c
385 648 350 664 306 664 _c
262 664 227 648 201 618 _c
175 588 162 546 162 494 _c
162 441 175 399 201 369 _c
227 339 262 324 306 324 _c
_cl}_e}_d
/A{684 0 8 0 676 729 _sc
342 632 _m
208 269 _l
476 269 _l
342 632 _l
286 729 _m
398 729 _l
676 0 _l
573 0 _l
507 187 _l
178 187 _l
112 0 _l
8 0 _l
286 729 _l
_cl}_d
/D{770 0 98 0 711 729 _sc
197 648 _m
197 81 _l
316 81 _l
416 81 490 103 537 149 _c
583 195 607 267 607 365 _c
607 463 583 534 537 580 _c
490 625 416 648 316 648 _c
197 648 _l
98 729 _m
301 729 _l
442 729 546 699 612 641 _c
678 582 711 490 711 365 _c
711 239 677 147 611 88 _c
545 29 441 0 301 0 _c
98 0 _l
98 729 _l
_cl}_d
/G{{775 0 56 -13 693 742 _sc
595 104 _m
595 300 _l
434 300 _l
434 381 _l
693 381 _l
693 68 _l
655 40 613 20 567 7 _c
521 -6 472 -13 420 -13 _c
306 -13 216 20 152 86 _c
88 152 56 245 56 364 _c
56 482 88 575 152 642 _c
216 708 306 742 420 742 _c
467 742 512 736 555 724 _c
598 712 638 695 674 673 _c
674 568 _l
637 598 598 621 557 637 _c
516 653 473 661 428 661 _c
}_e{338 661 271 636 227 586 _c
182 536 160 462 160 364 _c
160 265 182 191 227 141 _c
271 91 338 67 428 67 _c
462 67 493 70 521 76 _c
549 82 573 91 595 104 _c
_cl}_e}_d
/M{863 0 98 0 765 729 _sc
98 729 _m
245 729 _l
431 233 _l
618 729 _l
765 729 _l
765 0 _l
669 0 _l
669 640 _l
481 140 _l
382 140 _l
194 640 _l
194 0 _l
98 0 _l
98 729 _l
_cl}_d
/R{{695 0 98 0 666 729 _sc
444 342 _m
465 334 486 319 506 296 _c
526 272 546 240 566 199 _c
666 0 _l
560 0 _l
467 187 _l
443 235 419 268 397 284 _c
374 300 343 308 304 308 _c
197 308 _l
197 0 _l
98 0 _l
98 729 _l
321 729 _l
404 729 466 711 507 677 _c
548 642 569 589 569 519 _c
569 473 558 434 537 404 _c
515 374 484 353 444 342 _c
197 648 _m
197 389 _l
321 389 _l
}_e{368 389 404 400 428 422 _c
452 444 465 476 465 519 _c
465 561 452 593 428 615 _c
404 637 368 648 321 648 _c
197 648 _l
_cl}_e}_d
/S{{635 0 66 -13 579 742 _sc
535 705 _m
535 609 _l
497 627 462 640 429 649 _c
395 657 363 662 333 662 _c
279 662 237 651 208 631 _c
179 610 165 580 165 542 _c
165 510 174 485 194 469 _c
213 452 250 439 304 429 _c
364 417 _l
437 403 491 378 526 343 _c
561 307 579 260 579 201 _c
579 130 555 77 508 41 _c
460 5 391 -13 300 -13 _c
265 -13 228 -9 189 -2 _c
}_e{150 5 110 16 69 32 _c
69 134 _l
109 111 148 94 186 83 _c
224 71 262 66 300 66 _c
356 66 399 77 430 99 _c
460 121 476 152 476 194 _c
476 230 465 258 443 278 _c
421 298 385 313 335 323 _c
275 335 _l
201 349 148 372 115 404 _c
82 435 66 478 66 534 _c
66 598 88 649 134 686 _c
179 723 242 742 322 742 _c
356 742 390 739 426 733 _c
461 727 497 717 535 705 _c
}_e{_cl}_e}_d
/a{{613 0 60 -13 522 560 _sc
343 275 _m
270 275 220 266 192 250 _c
164 233 150 205 150 165 _c
150 133 160 107 181 89 _c
202 70 231 61 267 61 _c
317 61 357 78 387 114 _c
417 149 432 196 432 255 _c
432 275 _l
343 275 _l
522 312 _m
522 0 _l
432 0 _l
432 83 _l
411 49 385 25 355 10 _c
325 -5 287 -13 243 -13 _c
187 -13 142 2 109 33 _c
76 64 60 106 60 159 _c
}_e{60 220 80 266 122 298 _c
163 329 224 345 306 345 _c
432 345 _l
432 354 _l
432 395 418 427 391 450 _c
364 472 326 484 277 484 _c
245 484 215 480 185 472 _c
155 464 127 453 100 439 _c
100 522 _l
132 534 164 544 195 550 _c
226 556 256 560 286 560 _c
365 560 424 539 463 498 _c
502 457 522 395 522 312 _c
_cl}_e}_d
/c{{550 0 55 -13 488 560 _sc
488 526 _m
488 442 _l
462 456 437 466 411 473 _c
385 480 360 484 334 484 _c
276 484 230 465 198 428 _c
166 391 150 339 150 273 _c
150 206 166 154 198 117 _c
230 80 276 62 334 62 _c
360 62 385 65 411 72 _c
437 79 462 90 488 104 _c
488 21 _l
462 9 436 0 410 -5 _c
383 -10 354 -13 324 -13 _c
242 -13 176 12 128 64 _c
}_e{79 115 55 185 55 273 _c
55 362 79 432 128 483 _c
177 534 244 560 330 560 _c
358 560 385 557 411 551 _c
437 545 463 537 488 526 _c
_cl}_e}_d
/d{{635 0 55 -13 544 760 _sc
454 464 _m
454 760 _l
544 760 _l
544 0 _l
454 0 _l
454 82 _l
435 49 411 25 382 10 _c
353 -5 319 -13 279 -13 _c
213 -13 159 13 117 65 _c
75 117 55 187 55 273 _c
55 359 75 428 117 481 _c
159 533 213 560 279 560 _c
319 560 353 552 382 536 _c
411 520 435 496 454 464 _c
148 273 _m
148 207 161 155 188 117 _c
215 79 253 61 301 61 _c
}_e{348 61 385 79 413 117 _c
440 155 454 207 454 273 _c
454 339 440 390 413 428 _c
385 466 348 485 301 485 _c
253 485 215 466 188 428 _c
161 390 148 339 148 273 _c
_cl}_e}_d
/e{{615 0 55 -13 562 560 _sc
562 296 _m
562 252 _l
149 252 _l
153 190 171 142 205 110 _c
238 78 284 62 344 62 _c
378 62 412 66 444 74 _c
476 82 509 95 541 113 _c
541 28 _l
509 14 476 3 442 -3 _c
408 -9 373 -13 339 -13 _c
251 -13 182 12 131 62 _c
80 112 55 181 55 268 _c
55 357 79 428 127 481 _c
175 533 241 560 323 560 _c
397 560 455 536 498 489 _c
}_e{540 441 562 377 562 296 _c
472 322 _m
471 371 457 410 431 440 _c
404 469 368 484 324 484 _c
274 484 234 469 204 441 _c
174 413 156 373 152 322 _c
472 322 _l
_cl}_e}_d
/g{{635 0 55 -207 544 560 _sc
454 280 _m
454 344 440 395 414 431 _c
387 467 349 485 301 485 _c
253 485 215 467 188 431 _c
161 395 148 344 148 280 _c
148 215 161 165 188 129 _c
215 93 253 75 301 75 _c
349 75 387 93 414 129 _c
440 165 454 215 454 280 _c
544 68 _m
544 -24 523 -93 482 -139 _c
440 -184 377 -207 292 -207 _c
260 -207 231 -204 203 -200 _c
175 -195 147 -188 121 -178 _c
}_e{121 -91 _l
147 -105 173 -115 199 -122 _c
225 -129 251 -133 278 -133 _c
336 -133 380 -117 410 -87 _c
439 -56 454 -10 454 52 _c
454 96 _l
435 64 411 40 382 24 _c
353 8 319 0 279 0 _c
211 0 157 25 116 76 _c
75 127 55 195 55 280 _c
55 364 75 432 116 483 _c
157 534 211 560 279 560 _c
319 560 353 552 382 536 _c
411 520 435 496 454 464 _c
454 547 _l
544 547 _l
}_e{544 68 _l
_cl}_e}_d
/l{278 0 94 0 184 760 _sc
94 760 _m
184 760 _l
184 0 _l
94 0 _l
94 760 _l
_cl}_d
/m{{974 0 91 0 889 560 _sc
520 442 _m
542 482 569 511 600 531 _c
631 550 668 560 711 560 _c
767 560 811 540 842 500 _c
873 460 889 403 889 330 _c
889 0 _l
799 0 _l
799 327 _l
799 379 789 418 771 444 _c
752 469 724 482 686 482 _c
639 482 602 466 575 435 _c
548 404 535 362 535 309 _c
535 0 _l
445 0 _l
445 327 _l
445 379 435 418 417 444 _c
398 469 369 482 331 482 _c
}_e{285 482 248 466 221 435 _c
194 404 181 362 181 309 _c
181 0 _l
91 0 _l
91 547 _l
181 547 _l
181 462 _l
201 495 226 520 255 536 _c
283 552 317 560 357 560 _c
397 560 430 550 458 530 _c
486 510 506 480 520 442 _c
_cl}_e}_d
/o{612 0 55 -13 557 560 _sc
306 484 _m
258 484 220 465 192 427 _c
164 389 150 338 150 273 _c
150 207 163 156 191 118 _c
219 80 257 62 306 62 _c
354 62 392 80 420 118 _c
448 156 462 207 462 273 _c
462 337 448 389 420 427 _c
392 465 354 484 306 484 _c
306 560 _m
384 560 445 534 490 484 _c
534 433 557 363 557 273 _c
557 183 534 113 490 63 _c
445 12 384 -13 306 -13 _c
227 -13 165 12 121 63 _c
77 113 55 183 55 273 _c
55 363 77 433 121 484 _c
165 534 227 560 306 560 _c
_cl}_d
/p{{635 0 91 -207 580 560 _sc
181 82 _m
181 -207 _l
91 -207 _l
91 547 _l
181 547 _l
181 464 _l
199 496 223 520 252 536 _c
281 552 316 560 356 560 _c
422 560 476 533 518 481 _c
559 428 580 359 580 273 _c
580 187 559 117 518 65 _c
476 13 422 -13 356 -13 _c
316 -13 281 -5 252 10 _c
223 25 199 49 181 82 _c
487 273 _m
487 339 473 390 446 428 _c
418 466 381 485 334 485 _c
}_e{286 485 249 466 222 428 _c
194 390 181 339 181 273 _c
181 207 194 155 222 117 _c
249 79 286 61 334 61 _c
381 61 418 79 446 117 _c
473 155 487 207 487 273 _c
_cl}_e}_d
/r{411 0 91 0 411 560 _sc
411 463 _m
401 469 390 473 378 476 _c
366 478 353 480 339 480 _c
288 480 249 463 222 430 _c
194 397 181 350 181 288 _c
181 0 _l
91 0 _l
91 547 _l
181 547 _l
181 462 _l
199 495 224 520 254 536 _c
284 552 321 560 365 560 _c
371 560 378 559 386 559 _c
393 558 401 557 411 555 _c
411 463 _l
_cl}_d
/t{392 0 27 0 368 702 _sc
183 702 _m
183 547 _l
368 547 _l
368 477 _l
183 477 _l
183 180 _l
183 135 189 106 201 94 _c
213 81 238 75 276 75 _c
368 75 _l
368 0 _l
276 0 _l
206 0 158 13 132 39 _c
106 65 93 112 93 180 _c
93 477 _l
27 477 _l
27 547 _l
93 547 _l
93 702 _l
183 702 _l
_cl}_d
/u{634 0 85 -13 543 560 _sc
85 216 _m
85 547 _l
175 547 _l
175 219 _l
175 167 185 129 205 103 _c
225 77 255 64 296 64 _c
344 64 383 79 411 110 _c
439 141 453 183 453 237 _c
453 547 _l
543 547 _l
543 0 _l
453 0 _l
453 84 _l
431 50 405 26 377 10 _c
348 -5 315 -13 277 -13 _c
214 -13 166 6 134 45 _c
101 83 85 140 85 216 _c
311 560 _m
311 560 _l
_cl}_d
/v{592 0 30 0 562 547 _sc
30 547 _m
125 547 _l
296 88 _l
467 547 _l
562 547 _l
357 0 _l
235 0 _l
30 547 _l
_cl}_d
/x{592 0 29 0 559 547 _sc
549 547 _m
351 281 _l
559 0 _l
453 0 _l
294 215 _l
135 0 _l
29 0 _l
241 286 _l
47 547 _l
153 547 _l
298 352 _l
443 547 _l
549 547 _l
_cl}_d
end readonly def

/BuildGlyph
 {exch begin
 CharStrings exch
 2 copy known not{pop /.notdef}if
 true 3 1 roll get exec
 end}_d

/BuildChar {
 1 index /Encoding get exch get
 1 index /BuildGlyph get exec
}_d

FontName currentdict end definefont pop
end
%%EndProlog
mpldict begin
-270 108 translate
1152 576 0 0 clipbox
gsave
0 0 m
1152 0 l
1152 576 l
0 576 l
cl
1.000 setgray
fill
grestore
gsave
40.05 310.4 m
372.65 310.4 l
372.65 549.2 l
40.05 549.2 l
cl
1.000 setgray
fill
grestore
0.800 setlinewidth
1 setlinejoin
0 setlinecap
[] 0 setdash
0.000 setgray
gsave
/o {
gsave
newpath
translate
0.8 setlinewidth
1 setlinejoin
0 setlinecap
0 0 m
0 -3.5 l

gsave
0.000 setgray
fill
grestore
stroke
grestore
} bind def
47.3146 310.4 o
grestore
/DejaVuSans findfont
10.000 scalefont
setfont
gsave
44.134893 295.806250 translate
0.000000 rotate
0.000000 0.000000 m /zero glyphshow
grestore
gsave
/o {
gsave
newpath
translate
0.8 setlinewidth
1 setlinejoin
0 setlinecap
0 0 m
0 -3.5 l

gsave
0.000 setgray
fill
grestore
stroke
grestore
} bind def
86.5826 310.4 o
grestore
gsave
80.223211 295.806250 translate
0.000000 rotate
0.000000 0.000000 m /one glyphshow
6.362305 0.000000 m /zero glyphshow
grestore
gsave
/o {
gsave
newpath
translate
0.8 setlinewidth
1 setlinejoin
0 setlinecap
0 0 m
0 -3.5 l

gsave
0.000 setgray
fill
grestore
stroke
grestore
} bind def
125.851 310.4 o
grestore
gsave
119.491215 295.806250 translate
0.000000 rotate
0.000000 0.000000 m /two glyphshow
6.362305 0.000000 m /zero glyphshow
grestore
gsave
/o {
gsave
newpath
translate
0.8 setlinewidth
1 setlinejoin
0 setlinecap
0 0 m
0 -3.5 l

gsave
0.000 setgray
fill
grestore
stroke
grestore
} bind def
165.119 310.4 o
grestore
gsave
158.759220 295.806250 translate
0.000000 rotate
0.000000 0.000000 m /three glyphshow
6.362305 0.000000 m /zero glyphshow
grestore
gsave
/o {
gsave
newpath
translate
0.8 setlinewidth
1 setlinejoin
0 setlinecap
0 0 m
0 -3.5 l

gsave
0.000 setgray
fill
grestore
stroke
grestore
} bind def
204.387 310.4 o
grestore
gsave
198.027225 295.806250 translate
0.000000 rotate
0.000000 0.000000 m /four glyphshow
6.362305 0.000000 m /zero glyphshow
grestore
gsave
/o {
gsave
newpath
translate
0.8 setlinewidth
1 setlinejoin
0 setlinecap
0 0 m
0 -3.5 l

gsave
0.000 setgray
fill
grestore
stroke
grestore
} bind def
243.655 310.4 o
grestore
gsave
237.295229 295.806250 translate
0.000000 rotate
0.000000 0.000000 m /five glyphshow
6.362305 0.000000 m /zero glyphshow
grestore
gsave
/o {
gsave
newpath
translate
0.8 setlinewidth
1 setlinejoin
0 setlinecap
0 0 m
0 -3.5 l

gsave
0.000 setgray
fill
grestore
stroke
grestore
} bind def
282.923 310.4 o
grestore
gsave
276.563234 295.806250 translate
0.000000 rotate
0.000000 0.000000 m /six glyphshow
6.362305 0.000000 m /zero glyphshow
grestore
gsave
/o {
gsave
newpath
translate
0.8 setlinewidth
1 setlinejoin
0 setlinecap
0 0 m
0 -3.5 l

gsave
0.000 setgray
fill
grestore
stroke
grestore
} bind def
322.191 310.4 o
grestore
gsave
315.831239 295.806250 translate
0.000000 rotate
0.000000 0.000000 m /seven glyphshow
6.362305 0.000000 m /zero glyphshow
grestore
gsave
/o {
gsave
newpath
translate
0.8 setlinewidth
1 setlinejoin
0 setlinecap
0 0 m
0 -3.5 l

gsave
0.000 setgray
fill
grestore
stroke
grestore
} bind def
361.459 310.4 o
grestore
gsave
355.099244 295.806250 translate
0.000000 rotate
0.000000 0.000000 m /eight glyphshow
6.362305 0.000000 m /zero glyphshow
grestore
gsave
/o {
gsave
newpath
translate
0.8 setlinewidth
1 setlinejoin
0 setlinecap
0 0 m
-3.5 0 l

gsave
0.000 setgray
fill
grestore
stroke
grestore
} bind def
40.05 319.646 o
grestore
gsave
10.784375 315.848692 translate
0.000000 rotate
0.000000 0.000000 m /zero glyphshow
6.362305 0.000000 m /period glyphshow
9.541016 0.000000 m /eight glyphshow
15.903320 0.000000 m /two glyphshow
grestore
gsave
/o {
gsave
newpath
translate
0.8 setlinewidth
1 setlinejoin
0 setlinecap
0 0 m
-3.5 0 l

gsave
0.000 setgray
fill
grestore
stroke
grestore
} bind def
40.05 368.297 o
grestore
gsave
10.784375 364.500063 translate
0.000000 rotate
0.000000 0.000000 m /zero glyphshow
6.362305 0.000000 m /period glyphshow
9.541016 0.000000 m /eight glyphshow
15.903320 0.000000 m /three glyphshow
grestore
gsave
/o {
gsave
newpath
translate
0.8 setlinewidth
1 setlinejoin
0 setlinecap
0 0 m
-3.5 0 l

gsave
0.000 setgray
fill
grestore
stroke
grestore
} bind def
40.05 416.948 o
grestore
gsave
10.784375 413.151433 translate
0.000000 rotate
0.000000 0.000000 m /zero glyphshow
6.362305 0.000000 m /period glyphshow
9.541016 0.000000 m /eight glyphshow
15.903320 0.000000 m /four glyphshow
grestore
gsave
/o {
gsave
newpath
translate
0.8 setlinewidth
1 setlinejoin
0 setlinecap
0 0 m
-3.5 0 l

gsave
0.000 setgray
fill
grestore
stroke
grestore
} bind def
40.05 465.6 o
grestore
gsave
10.784375 461.802804 translate
0.000000 rotate
0.000000 0.000000 m /zero glyphshow
6.362305 0.000000 m /period glyphshow
9.541016 0.000000 m /eight glyphshow
15.903320 0.000000 m /five glyphshow
grestore
gsave
/o {
gsave
newpath
translate
0.8 setlinewidth
1 setlinejoin
0 setlinecap
0 0 m
-3.5 0 l

gsave
0.000 setgray
fill
grestore
stroke
grestore
} bind def
40.05 514.251 o
grestore
gsave
10.784375 510.454174 translate
0.000000 rotate
0.000000 0.000000 m /zero glyphshow
6.362305 0.000000 m /period glyphshow
9.541016 0.000000 m /eight glyphshow
15.903320 0.000000 m /six glyphshow
grestore
1.500 setlinewidth
2 setlinecap
0.122 0.467 0.706 setrgbcolor
gsave
332.6 238.8 40.05 310.4 clipbox
55.168182 348.272309 m
59.094982 363.463152 l
63.021783 376.378857 l
66.948583 386.69161 l
70.875384 394.035251 l
74.802184 402.310699 l
78.728985 409.624325 l
82.655785 414.117968 l
86.582586 419.879235 l
90.509386 425.08132 l
94.436187 429.735784 l
98.362987 434.24984 l
102.289787 436.93095 l
106.216588 441.226735 l
110.143388 441.681011 l
114.070189 448.090722 l
117.996989 450.961002 l
121.92379 454.275891 l
125.85059 456.503966 l
129.777391 458.730505 l
133.704191 460.756214 l
137.630992 463.753479 l
141.557792 465.362439 l
145.484593 466.897716 l
149.411393 469.412289 l
153.338194 472.326792 l
157.264994 473.907435 l
161.191795 474.950321 l
165.118595 476.609676 l
169.045396 478.305938 l
172.972196 480.182486 l
176.898996 480.984794 l
180.825797 482.631118 l
184.752597 485.262812 l
188.679398 485.749978 l
192.606198 488.397741 l
196.532999 490.055692 l
200.459799 489.99798 l
204.3866 493.469053 l
208.3134 493.494169 l
212.240201 495.664532 l
216.167001 496.800468 l
220.093802 497.499078 l
224.020602 500.243974 l
227.947403 500.954473 l
231.874203 501.362764 l
235.801004 502.212332 l
239.727804 505.843571 l
243.654604 505.644766 l
247.581405 506.545807 l
251.508205 508.749778 l
255.435006 509.278815 l
259.361806 510.481705 l
263.288607 512.175811 l
267.215407 510.748477 l
271.142208 513.521265 l
275.069008 513.666703 l
278.995809 514.866719 l
282.922609 519.110443 l
286.84941 519.574387 l
290.77621 520.712544 l
294.703011 521.203564 l
298.629811 520.432088 l
302.556612 523.805374 l
306.483412 525.710631 l
310.410213 526.418974 l
314.337013 527.241564 l
318.263813 528.907582 l
322.190614 528.429594 l
326.117414 530.891159 l
330.044215 531.475523 l
333.971015 531.932837 l
337.897816 534.055287 l
341.824616 535.731789 l
345.751417 537.055687 l
349.678217 537.175911 l
353.605018 538.345455 l
357.531818 538.10197 l
stroke
grestore
1.000 0.498 0.055 setrgbcolor
gsave
332.6 238.8 40.05 310.4 clipbox
55.168182 321.254545 m
59.094982 333.664289 l
63.021783 345.767895 l
66.948583 354.504352 l
70.875384 360.93287 l
74.802184 367.675881 l
78.728985 372.32998 l
82.655785 375.66424 l
86.582586 380.160115 l
90.509386 383.900424 l
94.436187 386.676812 l
98.362987 391.181397 l
102.289787 391.661758 l
106.216588 395.508914 l
110.143388 392.580525 l
114.070189 398.660595 l
117.996989 402.043923 l
121.92379 404.449106 l
125.85059 405.046446 l
129.777391 406.521663 l
133.704191 407.026558 l
137.630992 409.263206 l
141.557792 410.769357 l
145.484593 410.714956 l
149.411393 411.453276 l
153.338194 415.038384 l
157.264994 415.472167 l
161.191795 415.910927 l
165.118595 416.903472 l
169.045396 416.457778 l
172.972196 417.287654 l
176.898996 417.129075 l
180.825797 419.417457 l
184.752597 420.015508 l
188.679398 422.12451 l
192.606198 422.141577 l
196.532999 422.386735 l
200.459799 421.510992 l
204.3866 425.327392 l
208.3134 423.353858 l
212.240201 425.385526 l
216.167001 425.672996 l
220.093802 424.237068 l
224.020602 425.823931 l
227.947403 426.870343 l
231.874203 427.010433 l
235.801004 425.498594 l
239.727804 429.381305 l
243.654604 428.103424 l
247.581405 428.726186 l
251.508205 428.781476 l
255.435006 428.937922 l
259.361806 428.631074 l
263.288607 430.190203 l
267.215407 427.71373 l
271.142208 428.084223 l
275.069008 427.945022 l
278.995809 428.666275 l
282.922609 430.297049 l
286.84941 430.505407 l
290.77621 430.411361 l
294.703011 430.630742 l
298.629811 430.062202 l
302.556612 432.477163 l
306.483412 431.60142 l
310.410213 432.13227 l
314.337013 431.622042 l
318.263813 431.475018 l
322.190614 431.805866 l
326.117414 431.430751 l
330.044215 431.507552 l
333.971015 430.513051 l
337.897816 431.568708 l
341.824616 432.476096 l
345.751417 433.408018 l
349.678217 433.110415 l
353.605018 432.962146 l
357.531818 434.212828 l
stroke
grestore
0.800 setlinewidth
0 setlinejoin
[] 0 setdash
0.000 setgray
gsave
40.05 310.4 m
40.05 549.2 l
stroke
grestore
gsave
372.65 310.4 m
372.65 549.2 l
stroke
grestore
gsave
40.05 310.4 m
372.65 310.4 l
stroke
grestore
gsave
40.05 549.2 m
372.65 549.2 l
stroke
grestore
/DejaVuSans findfont
12.000 scalefont
setfont
gsave
170.107812 555.200000 translate
0.000000 rotate
0.000000 0.000000 m /S glyphshow
7.617188 0.000000 m /G glyphshow
16.916016 0.000000 m /D glyphshow
26.156250 0.000000 m /space glyphshow
29.970703 0.000000 m /hyphen glyphshow
34.300781 0.000000 m /space glyphshow
38.115234 0.000000 m /zero glyphshow
45.750000 0.000000 m /period glyphshow
49.564453 0.000000 m /eight glyphshow
57.199219 0.000000 m /four glyphshow
64.833984 0.000000 m /four glyphshow
grestore
1.000 setlinewidth
0 setlinecap
0.800 setgray
gsave
47.05 511.85625 m
112.565625 511.85625 l
113.898958 511.85625 114.565625 512.522917 114.565625 513.85625 c
114.565625 542.2 l
114.565625 543.533333 113.898958 544.2 112.565625 544.2 c
47.05 544.2 l
45.716667 544.2 45.05 543.533333 45.05 542.2 c
45.05 513.85625 l
45.05 512.522917 45.716667 511.85625 47.05 511.85625 c
cl
gsave
1.000 setgray
fill
grestore
stroke
grestore
1.500 setlinewidth
1 setlinejoin
2 setlinecap
[] 0 setdash
0.122 0.467 0.706 setrgbcolor
gsave
49.05 536.10625 m
69.05 536.10625 l
stroke
grestore
0.000 setgray
/DejaVuSans findfont
10.000 scalefont
setfont
gsave
77.050000 532.606250 translate
0.000000 rotate
0.000000 0.000000 m /a glyphshow
6.127930 0.000000 m /u glyphshow
12.465820 0.000000 m /c glyphshow
grestore
1.000 0.498 0.055 setrgbcolor
gsave
49.05 521.434375 m
69.05 521.434375 l
stroke
grestore
0.000 setgray
gsave
77.050000 517.934375 translate
0.000000 rotate
0.000000 0.000000 m /v glyphshow
5.917969 0.000000 m /a glyphshow
12.045898 0.000000 m /l glyphshow
14.824219 0.000000 m /A glyphshow
21.665039 0.000000 m /u glyphshow
28.002930 0.000000 m /c glyphshow
grestore
gsave
422.575 310.4 m
755.175 310.4 l
755.175 549.2 l
422.575 549.2 l
cl
1.000 setgray
fill
grestore
0.800 setlinewidth
0 setlinecap
gsave
/o {
gsave
newpath
translate
0.8 setlinewidth
1 setlinejoin
0 setlinecap
0 0 m
0 -3.5 l

gsave
0.000 setgray
fill
grestore
stroke
grestore
} bind def
429.84 310.4 o
grestore
gsave
426.659893 295.806250 translate
0.000000 rotate
0.000000 0.000000 m /zero glyphshow
grestore
gsave
/o {
gsave
newpath
translate
0.8 setlinewidth
1 setlinejoin
0 setlinecap
0 0 m
0 -3.5 l

gsave
0.000 setgray
fill
grestore
stroke
grestore
} bind def
469.108 310.4 o
grestore
gsave
462.748211 295.806250 translate
0.000000 rotate
0.000000 0.000000 m /one glyphshow
6.362305 0.000000 m /zero glyphshow
grestore
gsave
/o {
gsave
newpath
translate
0.8 setlinewidth
1 setlinejoin
0 setlinecap
0 0 m
0 -3.5 l

gsave
0.000 setgray
fill
grestore
stroke
grestore
} bind def
508.376 310.4 o
grestore
gsave
502.016215 295.806250 translate
0.000000 rotate
0.000000 0.000000 m /two glyphshow
6.362305 0.000000 m /zero glyphshow
grestore
gsave
/o {
gsave
newpath
translate
0.8 setlinewidth
1 setlinejoin
0 setlinecap
0 0 m
0 -3.5 l

gsave
0.000 setgray
fill
grestore
stroke
grestore
} bind def
547.644 310.4 o
grestore
gsave
541.284220 295.806250 translate
0.000000 rotate
0.000000 0.000000 m /three glyphshow
6.362305 0.000000 m /zero glyphshow
grestore
gsave
/o {
gsave
newpath
translate
0.8 setlinewidth
1 setlinejoin
0 setlinecap
0 0 m
0 -3.5 l

gsave
0.000 setgray
fill
grestore
stroke
grestore
} bind def
586.912 310.4 o
grestore
gsave
580.552225 295.806250 translate
0.000000 rotate
0.000000 0.000000 m /four glyphshow
6.362305 0.000000 m /zero glyphshow
grestore
gsave
/o {
gsave
newpath
translate
0.8 setlinewidth
1 setlinejoin
0 setlinecap
0 0 m
0 -3.5 l

gsave
0.000 setgray
fill
grestore
stroke
grestore
} bind def
626.18 310.4 o
grestore
gsave
619.820229 295.806250 translate
0.000000 rotate
0.000000 0.000000 m /five glyphshow
6.362305 0.000000 m /zero glyphshow
grestore
gsave
/o {
gsave
newpath
translate
0.8 setlinewidth
1 setlinejoin
0 setlinecap
0 0 m
0 -3.5 l

gsave
0.000 setgray
fill
grestore
stroke
grestore
} bind def
665.448 310.4 o
grestore
gsave
659.088234 295.806250 translate
0.000000 rotate
0.000000 0.000000 m /six glyphshow
6.362305 0.000000 m /zero glyphshow
grestore
gsave
/o {
gsave
newpath
translate
0.8 setlinewidth
1 setlinejoin
0 setlinecap
0 0 m
0 -3.5 l

gsave
0.000 setgray
fill
grestore
stroke
grestore
} bind def
704.716 310.4 o
grestore
gsave
698.356239 295.806250 translate
0.000000 rotate
0.000000 0.000000 m /seven glyphshow
6.362305 0.000000 m /zero glyphshow
grestore
gsave
/o {
gsave
newpath
translate
0.8 setlinewidth
1 setlinejoin
0 setlinecap
0 0 m
0 -3.5 l

gsave
0.000 setgray
fill
grestore
stroke
grestore
} bind def
743.984 310.4 o
grestore
gsave
737.624244 295.806250 translate
0.000000 rotate
0.000000 0.000000 m /eight glyphshow
6.362305 0.000000 m /zero glyphshow
grestore
gsave
/o {
gsave
newpath
translate
0.8 setlinewidth
1 setlinejoin
0 setlinecap
0 0 m
-3.5 0 l

gsave
0.000 setgray
fill
grestore
stroke
grestore
} bind def
422.575 311.479 o
grestore
gsave
393.309375 307.682430 translate
0.000000 rotate
0.000000 0.000000 m /zero glyphshow
6.362305 0.000000 m /period glyphshow
9.541016 0.000000 m /six glyphshow
15.903320 0.000000 m /five glyphshow
grestore
gsave
/o {
gsave
newpath
translate
0.8 setlinewidth
1 setlinejoin
0 setlinecap
0 0 m
-3.5 0 l

gsave
0.000 setgray
fill
grestore
stroke
grestore
} bind def
422.575 343.951 o
grestore
gsave
393.309375 340.153857 translate
0.000000 rotate
0.000000 0.000000 m /zero glyphshow
6.362305 0.000000 m /period glyphshow
9.541016 0.000000 m /seven glyphshow
15.903320 0.000000 m /zero glyphshow
grestore
gsave
/o {
gsave
newpath
translate
0.8 setlinewidth
1 setlinejoin
0 setlinecap
0 0 m
-3.5 0 l

gsave
0.000 setgray
fill
grestore
stroke
grestore
} bind def
422.575 376.422 o
grestore
gsave
393.309375 372.625284 translate
0.000000 rotate
0.000000 0.000000 m /zero glyphshow
6.362305 0.000000 m /period glyphshow
9.541016 0.000000 m /seven glyphshow
15.903320 0.000000 m /five glyphshow
grestore
gsave
/o {
gsave
newpath
translate
0.8 setlinewidth
1 setlinejoin
0 setlinecap
0 0 m
-3.5 0 l

gsave
0.000 setgray
fill
grestore
stroke
grestore
} bind def
422.575 408.894 o
grestore
gsave
393.309375 405.096710 translate
0.000000 rotate
0.000000 0.000000 m /zero glyphshow
6.362305 0.000000 m /period glyphshow
9.541016 0.000000 m /eight glyphshow
15.903320 0.000000 m /zero glyphshow
grestore
gsave
/o {
gsave
newpath
translate
0.8 setlinewidth
1 setlinejoin
0 setlinecap
0 0 m
-3.5 0 l

gsave
0.000 setgray
fill
grestore
stroke
grestore
} bind def
422.575 441.365 o
grestore
gsave
393.309375 437.568137 translate
0.000000 rotate
0.000000 0.000000 m /zero glyphshow
6.362305 0.000000 m /period glyphshow
9.541016 0.000000 m /eight glyphshow
15.903320 0.000000 m /five glyphshow
grestore
gsave
/o {
gsave
newpath
translate
0.8 setlinewidth
1 setlinejoin
0 setlinecap
0 0 m
-3.5 0 l

gsave
0.000 setgray
fill
grestore
stroke
grestore
} bind def
422.575 473.836 o
grestore
gsave
393.309375 470.039564 translate
0.000000 rotate
0.000000 0.000000 m /zero glyphshow
6.362305 0.000000 m /period glyphshow
9.541016 0.000000 m /nine glyphshow
15.903320 0.000000 m /zero glyphshow
grestore
gsave
/o {
gsave
newpath
translate
0.8 setlinewidth
1 setlinejoin
0 setlinecap
0 0 m
-3.5 0 l

gsave
0.000 setgray
fill
grestore
stroke
grestore
} bind def
422.575 506.308 o
grestore
gsave
393.309375 502.510991 translate
0.000000 rotate
0.000000 0.000000 m /zero glyphshow
6.362305 0.000000 m /period glyphshow
9.541016 0.000000 m /nine glyphshow
15.903320 0.000000 m /five glyphshow
grestore
gsave
/o {
gsave
newpath
translate
0.8 setlinewidth
1 setlinejoin
0 setlinecap
0 0 m
-3.5 0 l

gsave
0.000 setgray
fill
grestore
stroke
grestore
} bind def
422.575 538.779 o
grestore
gsave
393.309375 534.982417 translate
0.000000 rotate
0.000000 0.000000 m /one glyphshow
6.362305 0.000000 m /period glyphshow
9.541016 0.000000 m /zero glyphshow
15.903320 0.000000 m /zero glyphshow
grestore
1.500 setlinewidth
2 setlinecap
0.122 0.467 0.706 setrgbcolor
gsave
332.6 238.8 422.6 310.4 clipbox
437.693182 443.898157 m
441.619982 446.658257 l
445.546783 447.228009 l
449.473583 451.483744 l
453.400384 453.163547 l
457.327184 456.604381 l
461.253985 459.115975 l
465.180785 462.118999 l
469.107586 464.110359 l
473.034386 467.262991 l
476.961187 470.631693 l
480.887987 472.478239 l
484.814787 475.241656 l
488.741588 478.046491 l
492.668388 482.621354 l
496.595189 484.292076 l
500.521989 489.618576 l
504.44879 490.183485 l
508.37559 493.640232 l
512.302391 495.703414 l
516.229191 499.084022 l
520.155992 498.648035 l
524.082792 499.960155 l
528.009593 505.87185 l
531.936393 512.421292 l
535.863194 501.712173 l
539.789994 511.240356 l
543.716795 514.313724 l
547.643595 515.740776 l
551.570396 517.889928 l
555.497196 517.858258 l
559.423996 521.020509 l
563.350797 523.165274 l
567.277597 521.363891 l
571.204398 524.502198 l
575.131198 525.548614 l
579.057999 523.69337 l
582.984799 519.853463 l
586.9116 527.291045 l
590.8384 531.171013 l
594.765201 528.941974 l
598.692001 528.2514 l
602.618802 524.981364 l
606.545602 531.456995 l
610.472403 533.608335 l
614.399203 528.290284 l
618.326004 532.848319 l
622.252804 533.958252 l
626.179604 534.34167 l
630.106405 533.777005 l
634.033205 534.291829 l
637.960006 531.500601 l
641.886806 535.402203 l
645.813607 535.546179 l
649.740407 535.953012 l
653.667208 535.65886 l
657.594008 536.864425 l
661.520809 537.075645 l
665.447609 536.452368 l
669.37441 535.524798 l
673.30121 535.105452 l
677.228011 537.204606 l
681.154811 537.138234 l
685.081612 537.593992 l
689.008412 537.106129 l
692.935213 537.734995 l
696.862013 534.66276 l
700.788813 538.150705 l
704.715614 537.551101 l
708.642414 537.281852 l
712.569215 537.70272 l
716.496015 535.224473 l
720.422816 537.35323 l
724.349616 537.725613 l
728.276417 538.03954 l
732.203217 537.873391 l
736.130018 538.02058 l
740.056818 538.345455 l
stroke
grestore
1.000 0.498 0.055 setrgbcolor
gsave
332.6 238.8 422.6 310.4 clipbox
437.693182 433.813927 m
441.619982 435.132049 l
445.546783 432.929585 l
449.473583 436.170833 l
453.400384 433.729396 l
457.327184 435.462838 l
461.253985 433.458837 l
465.180785 431.459702 l
469.107586 432.436499 l
473.034386 433.375826 l
476.961187 429.527203 l
480.887987 430.264174 l
484.814787 427.223715 l
488.741588 423.30912 l
492.668388 425.358732 l
496.595189 418.522594 l
500.521989 418.281771 l
504.44879 405.122753 l
508.37559 414.700574 l
512.302391 400.767233 l
516.229191 414.32968 l
520.155992 411.47767 l
524.082792 406.818391 l
528.009593 385.864166 l
531.936393 386.753349 l
535.863194 372.845946 l
539.789994 398.682879 l
543.716795 394.379116 l
547.643595 370.584533 l
551.570396 395.281635 l
555.497196 368.863171 l
559.423996 380.289577 l
563.350797 359.958816 l
567.277597 383.774994 l
571.204398 375.819126 l
575.131198 376.660419 l
579.057999 393.729856 l
582.984799 328.842272 l
586.9116 382.156886 l
590.8384 368.711979 l
594.765201 349.093818 l
598.692001 391.060956 l
602.618802 327.375687 l
606.545602 364.680271 l
610.472403 358.222479 l
614.399203 329.057869 l
618.326004 371.993238 l
622.252804 344.636586 l
626.179604 354.11578 l
630.106405 373.803379 l
634.033205 359.568463 l
637.960006 375.073446 l
641.886806 362.911517 l
645.813607 350.03108 l
649.740407 374.16198 l
653.667208 373.349972 l
657.594008 349.634105 l
661.520809 366.021674 l
665.447609 346.951987 l
669.37441 329.182316 l
673.30121 371.194092 l
677.228011 364.378838 l
681.154811 358.272291 l
685.081612 354.340894 l
689.008412 347.56679 l
692.935213 350.578628 l
696.862013 368.293315 l
700.788813 356.393045 l
704.715614 360.594502 l
708.642414 360.110173 l
712.569215 349.42819 l
716.496015 375.36197 l
720.422816 352.849533 l
724.349616 353.284644 l
728.276417 346.809956 l
732.203217 339.1863 l
736.130018 321.254545 l
740.056818 347.715821 l
stroke
grestore
0.800 setlinewidth
0 setlinejoin
[] 0 setdash
0.000 setgray
gsave
422.575 310.4 m
422.575 549.2 l
stroke
grestore
gsave
755.175 310.4 m
755.175 549.2 l
stroke
grestore
gsave
422.575 310.4 m
755.175 310.4 l
stroke
grestore
gsave
422.575 549.2 m
755.175 549.2 l
stroke
grestore
/DejaVuSans findfont
12.000 scalefont
setfont
gsave
538.781250 555.200000 translate
0.000000 rotate
0.000000 0.000000 m /R glyphshow
8.337891 0.000000 m /M glyphshow
18.691406 0.000000 m /S glyphshow
26.308594 0.000000 m /p glyphshow
33.925781 0.000000 m /r glyphshow
38.859375 0.000000 m /o glyphshow
46.201172 0.000000 m /p glyphshow
53.818359 0.000000 m /space glyphshow
57.632812 0.000000 m /hyphen glyphshow
61.962891 0.000000 m /space glyphshow
65.777344 0.000000 m /zero glyphshow
73.412109 0.000000 m /period glyphshow
77.226562 0.000000 m /eight glyphshow
84.861328 0.000000 m /four glyphshow
92.496094 0.000000 m /two glyphshow
grestore
1.000 setlinewidth
0 setlinecap
0.800 setgray
gsave
429.575 511.85625 m
495.090625 511.85625 l
496.423958 511.85625 497.090625 512.522917 497.090625 513.85625 c
497.090625 542.2 l
497.090625 543.533333 496.423958 544.2 495.090625 544.2 c
429.575 544.2 l
428.241667 544.2 427.575 543.533333 427.575 542.2 c
427.575 513.85625 l
427.575 512.522917 428.241667 511.85625 429.575 511.85625 c
cl
gsave
1.000 setgray
fill
grestore
stroke
grestore
1.500 setlinewidth
1 setlinejoin
2 setlinecap
[] 0 setdash
0.122 0.467 0.706 setrgbcolor
gsave
431.575 536.10625 m
451.575 536.10625 l
stroke
grestore
0.000 setgray
/DejaVuSans findfont
10.000 scalefont
setfont
gsave
459.575000 532.606250 translate
0.000000 rotate
0.000000 0.000000 m /a glyphshow
6.127930 0.000000 m /u glyphshow
12.465820 0.000000 m /c glyphshow
grestore
1.000 0.498 0.055 setrgbcolor
gsave
431.575 521.434375 m
451.575 521.434375 l
stroke
grestore
0.000 setgray
gsave
459.575000 517.934375 translate
0.000000 rotate
0.000000 0.000000 m /v glyphshow
5.917969 0.000000 m /a glyphshow
12.045898 0.000000 m /l glyphshow
14.824219 0.000000 m /A glyphshow
21.665039 0.000000 m /u glyphshow
28.002930 0.000000 m /c glyphshow
grestore
gsave
805.1 310.4 m
1137.7 310.4 l
1137.7 549.2 l
805.1 549.2 l
cl
1.000 setgray
fill
grestore
0.800 setlinewidth
0 setlinecap
gsave
/o {
gsave
newpath
translate
0.8 setlinewidth
1 setlinejoin
0 setlinecap
0 0 m
0 -3.5 l

gsave
0.000 setgray
fill
grestore
stroke
grestore
} bind def
812.365 310.4 o
grestore
gsave
809.184893 295.806250 translate
0.000000 rotate
0.000000 0.000000 m /zero glyphshow
grestore
gsave
/o {
gsave
newpath
translate
0.8 setlinewidth
1 setlinejoin
0 setlinecap
0 0 m
0 -3.5 l

gsave
0.000 setgray
fill
grestore
stroke
grestore
} bind def
851.633 310.4 o
grestore
gsave
845.273211 295.806250 translate
0.000000 rotate
0.000000 0.000000 m /one glyphshow
6.362305 0.000000 m /zero glyphshow
grestore
gsave
/o {
gsave
newpath
translate
0.8 setlinewidth
1 setlinejoin
0 setlinecap
0 0 m
0 -3.5 l

gsave
0.000 setgray
fill
grestore
stroke
grestore
} bind def
890.901 310.4 o
grestore
gsave
884.541215 295.806250 translate
0.000000 rotate
0.000000 0.000000 m /two glyphshow
6.362305 0.000000 m /zero glyphshow
grestore
gsave
/o {
gsave
newpath
translate
0.8 setlinewidth
1 setlinejoin
0 setlinecap
0 0 m
0 -3.5 l

gsave
0.000 setgray
fill
grestore
stroke
grestore
} bind def
930.169 310.4 o
grestore
gsave
923.809220 295.806250 translate
0.000000 rotate
0.000000 0.000000 m /three glyphshow
6.362305 0.000000 m /zero glyphshow
grestore
gsave
/o {
gsave
newpath
translate
0.8 setlinewidth
1 setlinejoin
0 setlinecap
0 0 m
0 -3.5 l

gsave
0.000 setgray
fill
grestore
stroke
grestore
} bind def
969.437 310.4 o
grestore
gsave
963.077225 295.806250 translate
0.000000 rotate
0.000000 0.000000 m /four glyphshow
6.362305 0.000000 m /zero glyphshow
grestore
gsave
/o {
gsave
newpath
translate
0.8 setlinewidth
1 setlinejoin
0 setlinecap
0 0 m
0 -3.5 l

gsave
0.000 setgray
fill
grestore
stroke
grestore
} bind def
1008.7 310.4 o
grestore
gsave
1002.345229 295.806250 translate
0.000000 rotate
0.000000 0.000000 m /five glyphshow
6.362305 0.000000 m /zero glyphshow
grestore
gsave
/o {
gsave
newpath
translate
0.8 setlinewidth
1 setlinejoin
0 setlinecap
0 0 m
0 -3.5 l

gsave
0.000 setgray
fill
grestore
stroke
grestore
} bind def
1047.97 310.4 o
grestore
gsave
1041.613234 295.806250 translate
0.000000 rotate
0.000000 0.000000 m /six glyphshow
6.362305 0.000000 m /zero glyphshow
grestore
gsave
/o {
gsave
newpath
translate
0.8 setlinewidth
1 setlinejoin
0 setlinecap
0 0 m
0 -3.5 l

gsave
0.000 setgray
fill
grestore
stroke
grestore
} bind def
1087.24 310.4 o
grestore
gsave
1080.881239 295.806250 translate
0.000000 rotate
0.000000 0.000000 m /seven glyphshow
6.362305 0.000000 m /zero glyphshow
grestore
gsave
/o {
gsave
newpath
translate
0.8 setlinewidth
1 setlinejoin
0 setlinecap
0 0 m
0 -3.5 l

gsave
0.000 setgray
fill
grestore
stroke
grestore
} bind def
1126.51 310.4 o
grestore
gsave
1120.149244 295.806250 translate
0.000000 rotate
0.000000 0.000000 m /eight glyphshow
6.362305 0.000000 m /zero glyphshow
grestore
gsave
/o {
gsave
newpath
translate
0.8 setlinewidth
1 setlinejoin
0 setlinecap
0 0 m
-3.5 0 l

gsave
0.000 setgray
fill
grestore
stroke
grestore
} bind def
805.1 335.239 o
grestore
gsave
769.475000 331.441963 translate
0.000000 rotate
0.000000 0.000000 m /zero glyphshow
6.362305 0.000000 m /period glyphshow
9.541016 0.000000 m /eight glyphshow
15.903320 0.000000 m /zero glyphshow
22.265625 0.000000 m /zero glyphshow
grestore
gsave
/o {
gsave
newpath
translate
0.8 setlinewidth
1 setlinejoin
0 setlinecap
0 0 m
-3.5 0 l

gsave
0.000 setgray
fill
grestore
stroke
grestore
} bind def
805.1 365.41 o
grestore
gsave
769.475000 361.612795 translate
0.000000 rotate
0.000000 0.000000 m /zero glyphshow
6.362305 0.000000 m /period glyphshow
9.541016 0.000000 m /eight glyphshow
15.903320 0.000000 m /two glyphshow
22.265625 0.000000 m /five glyphshow
grestore
gsave
/o {
gsave
newpath
translate
0.8 setlinewidth
1 setlinejoin
0 setlinecap
0 0 m
-3.5 0 l

gsave
0.000 setgray
fill
grestore
stroke
grestore
} bind def
805.1 395.581 o
grestore
gsave
769.475000 391.783626 translate
0.000000 rotate
0.000000 0.000000 m /zero glyphshow
6.362305 0.000000 m /period glyphshow
9.541016 0.000000 m /eight glyphshow
15.903320 0.000000 m /five glyphshow
22.265625 0.000000 m /zero glyphshow
grestore
gsave
/o {
gsave
newpath
translate
0.8 setlinewidth
1 setlinejoin
0 setlinecap
0 0 m
-3.5 0 l

gsave
0.000 setgray
fill
grestore
stroke
grestore
} bind def
805.1 425.751 o
grestore
gsave
769.475000 421.954458 translate
0.000000 rotate
0.000000 0.000000 m /zero glyphshow
6.362305 0.000000 m /period glyphshow
9.541016 0.000000 m /eight glyphshow
15.903320 0.000000 m /seven glyphshow
22.265625 0.000000 m /five glyphshow
grestore
gsave
/o {
gsave
newpath
translate
0.8 setlinewidth
1 setlinejoin
0 setlinecap
0 0 m
-3.5 0 l

gsave
0.000 setgray
fill
grestore
stroke
grestore
} bind def
805.1 455.922 o
grestore
gsave
769.475000 452.125289 translate
0.000000 rotate
0.000000 0.000000 m /zero glyphshow
6.362305 0.000000 m /period glyphshow
9.541016 0.000000 m /nine glyphshow
15.903320 0.000000 m /zero glyphshow
22.265625 0.000000 m /zero glyphshow
grestore
gsave
/o {
gsave
newpath
translate
0.8 setlinewidth
1 setlinejoin
0 setlinecap
0 0 m
-3.5 0 l

gsave
0.000 setgray
fill
grestore
stroke
grestore
} bind def
805.1 486.093 o
grestore
gsave
769.475000 482.296121 translate
0.000000 rotate
0.000000 0.000000 m /zero glyphshow
6.362305 0.000000 m /period glyphshow
9.541016 0.000000 m /nine glyphshow
15.903320 0.000000 m /two glyphshow
22.265625 0.000000 m /five glyphshow
grestore
gsave
/o {
gsave
newpath
translate
0.8 setlinewidth
1 setlinejoin
0 setlinecap
0 0 m
-3.5 0 l

gsave
0.000 setgray
fill
grestore
stroke
grestore
} bind def
805.1 516.264 o
grestore
gsave
769.475000 512.466952 translate
0.000000 rotate
0.000000 0.000000 m /zero glyphshow
6.362305 0.000000 m /period glyphshow
9.541016 0.000000 m /nine glyphshow
15.903320 0.000000 m /five glyphshow
22.265625 0.000000 m /zero glyphshow
grestore
gsave
/o {
gsave
newpath
translate
0.8 setlinewidth
1 setlinejoin
0 setlinecap
0 0 m
-3.5 0 l

gsave
0.000 setgray
fill
grestore
stroke
grestore
} bind def
805.1 546.435 o
grestore
gsave
769.475000 542.637784 translate
0.000000 rotate
0.000000 0.000000 m /zero glyphshow
6.362305 0.000000 m /period glyphshow
9.541016 0.000000 m /nine glyphshow
15.903320 0.000000 m /seven glyphshow
22.265625 0.000000 m /five glyphshow
grestore
1.500 setlinewidth
2 setlinecap
0.122 0.467 0.706 setrgbcolor
gsave
332.6 238.8 805.1 310.4 clipbox
820.218182 405.610505 m
824.144982 409.265923 l
828.071783 412.35371 l
831.998583 415.516268 l
835.925384 416.712518 l
839.852184 420.177699 l
843.778985 424.103348 l
847.705785 427.45611 l
851.632586 428.020273 l
855.559386 429.881178 l
859.486187 433.983988 l
863.412987 437.432536 l
867.339787 439.356854 l
871.266588 443.529694 l
875.193388 448.010813 l
879.120189 448.078033 l
883.046989 452.067443 l
886.97379 452.946697 l
890.90059 455.216634 l
894.827391 458.814683 l
898.754191 460.939137 l
902.680992 462.72353 l
906.607792 465.791719 l
910.534593 469.176466 l
914.461393 471.073222 l
918.388194 471.25837 l
922.314994 473.896335 l
926.241795 476.852453 l
930.168595 479.662214 l
934.095396 481.602427 l
938.022196 481.957914 l
941.948996 485.492713 l
945.875797 489.478396 l
949.802597 488.38947 l
953.729398 489.405068 l
957.656198 490.142396 l
961.582999 495.978558 l
965.509799 494.732515 l
969.4366 498.743962 l
973.3634 501.059292 l
977.290201 500.326331 l
981.217001 501.858939 l
985.143802 503.637158 l
989.070602 506.224374 l
992.997403 503.615438 l
996.924203 505.921961 l
1000.851004 510.327394 l
1004.777804 509.708172 l
1008.704604 512.275134 l
1012.631405 511.587801 l
1016.558205 515.209515 l
1020.485006 514.060717 l
1024.411806 516.9117 l
1028.338607 516.32226 l
1032.265407 519.344926 l
1036.192208 520.589365 l
1040.119008 521.810826 l
1044.045809 522.761481 l
1047.972609 522.250085 l
1051.89941 524.634369 l
1055.82621 525.549878 l
1059.753011 526.348965 l
1063.679811 525.878556 l
1067.606612 528.907387 l
1071.533412 530.598059 l
1075.460213 528.089285 l
1079.387013 528.667747 l
1083.313813 531.718015 l
1087.240614 534.488831 l
1091.167414 532.561549 l
1095.094215 531.882828 l
1099.021015 534.760255 l
1102.947816 537.940539 l
1106.874616 537.887011 l
1110.801417 536.161696 l
1114.728217 538.345455 l
1118.655018 536.760226 l
1122.581818 537.876633 l
stroke
grestore
1.000 0.498 0.055 setrgbcolor
gsave
332.6 238.8 805.1 310.4 clipbox
820.218182 387.753527 m
824.144982 388.834409 l
828.071783 388.374626 l
831.998583 389.091333 l
835.925384 387.581318 l
839.852184 388.429927 l
843.778985 388.83238 l
847.705785 389.409732 l
851.632586 387.843623 l
855.559386 385.169114 l
859.486187 387.69708 l
863.412987 386.365713 l
867.339787 386.233767 l
871.266588 386.785012 l
875.193388 385.534965 l
879.120189 385.870563 l
883.046989 384.437943 l
886.97379 384.552249 l
890.90059 382.974983 l
894.827391 382.234506 l
898.754191 381.051182 l
902.680992 379.60811 l
906.607792 379.156663 l
910.534593 377.27749 l
914.461393 376.467469 l
918.388194 379.086015 l
922.314994 376.251293 l
926.241795 370.585993 l
930.168595 371.258247 l
934.095396 369.980505 l
938.022196 372.307421 l
941.948996 368.548415 l
945.875797 364.499719 l
949.802597 365.864513 l
953.729398 364.445652 l
957.656198 367.969299 l
961.582999 358.046183 l
965.509799 365.255674 l
969.4366 358.610922 l
973.3634 356.496611 l
977.290201 358.757421 l
981.217001 348.76401 l
985.143802 355.051731 l
989.070602 353.708105 l
992.997403 358.561266 l
996.924203 357.267516 l
1000.851004 346.538039 l
1004.777804 350.50149 l
1008.704604 351.287213 l
1012.631405 352.055604 l
1016.558205 344.416892 l
1020.485006 351.172995 l
1024.411806 344.06383 l
1028.338607 349.768246 l
1032.265407 344.618736 l
1036.192208 342.51492 l
1040.119008 343.122171 l
1044.045809 342.42037 l
1047.972609 342.932058 l
1051.89941 340.069597 l
1055.82621 338.19704 l
1059.753011 338.344509 l
1063.679811 342.838214 l
1067.606612 333.852964 l
1071.533412 332.779492 l
1075.460213 338.351697 l
1079.387013 339.738497 l
1083.313813 331.842243 l
1087.240614 327.752931 l
1091.167414 334.98531 l
1095.094215 334.905974 l
1099.021015 329.741029 l
1102.947816 321.254545 l
1106.874616 324.210233 l
1110.801417 329.579316 l
1114.728217 328.667336 l
1118.655018 333.24977 l
1122.581818 331.337964 l
stroke
grestore
0.800 setlinewidth
0 setlinejoin
[] 0 setdash
0.000 setgray
gsave
805.1 310.4 m
805.1 549.2 l
stroke
grestore
gsave
1137.7 310.4 m
1137.7 549.2 l
stroke
grestore
gsave
805.1 310.4 m
1137.7 310.4 l
stroke
grestore
gsave
805.1 549.2 m
1137.7 549.2 l
stroke
grestore
/DejaVuSans findfont
12.000 scalefont
setfont
gsave
922.868750 555.200000 translate
0.000000 rotate
0.000000 0.000000 m /A glyphshow
8.208984 0.000000 m /d glyphshow
15.826172 0.000000 m /a glyphshow
23.179688 0.000000 m /g glyphshow
30.796875 0.000000 m /r glyphshow
35.730469 0.000000 m /a glyphshow
43.083984 0.000000 m /d glyphshow
50.701172 0.000000 m /space glyphshow
54.515625 0.000000 m /hyphen glyphshow
58.845703 0.000000 m /space glyphshow
62.660156 0.000000 m /zero glyphshow
70.294922 0.000000 m /period glyphshow
74.109375 0.000000 m /eight glyphshow
81.744141 0.000000 m /four glyphshow
89.378906 0.000000 m /five glyphshow
grestore
1.000 setlinewidth
0 setlinecap
0.800 setgray
gsave
812.1 511.85625 m
877.615625 511.85625 l
878.948958 511.85625 879.615625 512.522917 879.615625 513.85625 c
879.615625 542.2 l
879.615625 543.533333 878.948958 544.2 877.615625 544.2 c
812.1 544.2 l
810.766667 544.2 810.1 543.533333 810.1 542.2 c
810.1 513.85625 l
810.1 512.522917 810.766667 511.85625 812.1 511.85625 c
cl
gsave
1.000 setgray
fill
grestore
stroke
grestore
1.500 setlinewidth
1 setlinejoin
2 setlinecap
[] 0 setdash
0.122 0.467 0.706 setrgbcolor
gsave
814.1 536.10625 m
834.1 536.10625 l
stroke
grestore
0.000 setgray
/DejaVuSans findfont
10.000 scalefont
setfont
gsave
842.100000 532.606250 translate
0.000000 rotate
0.000000 0.000000 m /a glyphshow
6.127930 0.000000 m /u glyphshow
12.465820 0.000000 m /c glyphshow
grestore
1.000 0.498 0.055 setrgbcolor
gsave
814.1 521.434375 m
834.1 521.434375 l
stroke
grestore
0.000 setgray
gsave
842.100000 517.934375 translate
0.000000 rotate
0.000000 0.000000 m /v glyphshow
5.917969 0.000000 m /a glyphshow
12.045898 0.000000 m /l glyphshow
14.824219 0.000000 m /A glyphshow
21.665039 0.000000 m /u glyphshow
28.002930 0.000000 m /c glyphshow
grestore
gsave
40.05 27.8 m
372.65 27.8 l
372.65 266.6 l
40.05 266.6 l
cl
1.000 setgray
fill
grestore
0.800 setlinewidth
0 setlinecap
gsave
/o {
gsave
newpath
translate
0.8 setlinewidth
1 setlinejoin
0 setlinecap
0 0 m
0 -3.5 l

gsave
0.000 setgray
fill
grestore
stroke
grestore
} bind def
47.3146 27.8 o
grestore
gsave
44.134893 13.206250 translate
0.000000 rotate
0.000000 0.000000 m /zero glyphshow
grestore
gsave
/o {
gsave
newpath
translate
0.8 setlinewidth
1 setlinejoin
0 setlinecap
0 0 m
0 -3.5 l

gsave
0.000 setgray
fill
grestore
stroke
grestore
} bind def
86.5826 27.8 o
grestore
gsave
80.223211 13.206250 translate
0.000000 rotate
0.000000 0.000000 m /one glyphshow
6.362305 0.000000 m /zero glyphshow
grestore
gsave
/o {
gsave
newpath
translate
0.8 setlinewidth
1 setlinejoin
0 setlinecap
0 0 m
0 -3.5 l

gsave
0.000 setgray
fill
grestore
stroke
grestore
} bind def
125.851 27.8 o
grestore
gsave
119.491215 13.206250 translate
0.000000 rotate
0.000000 0.000000 m /two glyphshow
6.362305 0.000000 m /zero glyphshow
grestore
gsave
/o {
gsave
newpath
translate
0.8 setlinewidth
1 setlinejoin
0 setlinecap
0 0 m
0 -3.5 l

gsave
0.000 setgray
fill
grestore
stroke
grestore
} bind def
165.119 27.8 o
grestore
gsave
158.759220 13.206250 translate
0.000000 rotate
0.000000 0.000000 m /three glyphshow
6.362305 0.000000 m /zero glyphshow
grestore
gsave
/o {
gsave
newpath
translate
0.8 setlinewidth
1 setlinejoin
0 setlinecap
0 0 m
0 -3.5 l

gsave
0.000 setgray
fill
grestore
stroke
grestore
} bind def
204.387 27.8 o
grestore
gsave
198.027225 13.206250 translate
0.000000 rotate
0.000000 0.000000 m /four glyphshow
6.362305 0.000000 m /zero glyphshow
grestore
gsave
/o {
gsave
newpath
translate
0.8 setlinewidth
1 setlinejoin
0 setlinecap
0 0 m
0 -3.5 l

gsave
0.000 setgray
fill
grestore
stroke
grestore
} bind def
243.655 27.8 o
grestore
gsave
237.295229 13.206250 translate
0.000000 rotate
0.000000 0.000000 m /five glyphshow
6.362305 0.000000 m /zero glyphshow
grestore
gsave
/o {
gsave
newpath
translate
0.8 setlinewidth
1 setlinejoin
0 setlinecap
0 0 m
0 -3.5 l

gsave
0.000 setgray
fill
grestore
stroke
grestore
} bind def
282.923 27.8 o
grestore
gsave
276.563234 13.206250 translate
0.000000 rotate
0.000000 0.000000 m /six glyphshow
6.362305 0.000000 m /zero glyphshow
grestore
gsave
/o {
gsave
newpath
translate
0.8 setlinewidth
1 setlinejoin
0 setlinecap
0 0 m
0 -3.5 l

gsave
0.000 setgray
fill
grestore
stroke
grestore
} bind def
322.191 27.8 o
grestore
gsave
315.831239 13.206250 translate
0.000000 rotate
0.000000 0.000000 m /seven glyphshow
6.362305 0.000000 m /zero glyphshow
grestore
gsave
/o {
gsave
newpath
translate
0.8 setlinewidth
1 setlinejoin
0 setlinecap
0 0 m
0 -3.5 l

gsave
0.000 setgray
fill
grestore
stroke
grestore
} bind def
361.459 27.8 o
grestore
gsave
355.099244 13.206250 translate
0.000000 rotate
0.000000 0.000000 m /eight glyphshow
6.362305 0.000000 m /zero glyphshow
grestore
gsave
/o {
gsave
newpath
translate
0.8 setlinewidth
1 setlinejoin
0 setlinecap
0 0 m
-3.5 0 l

gsave
0.000 setgray
fill
grestore
stroke
grestore
} bind def
40.05 63.4899 o
grestore
gsave
10.784375 59.693056 translate
0.000000 rotate
0.000000 0.000000 m /zero glyphshow
6.362305 0.000000 m /period glyphshow
9.541016 0.000000 m /eight glyphshow
15.903320 0.000000 m /zero glyphshow
grestore
gsave
/o {
gsave
newpath
translate
0.8 setlinewidth
1 setlinejoin
0 setlinecap
0 0 m
-3.5 0 l

gsave
0.000 setgray
fill
grestore
stroke
grestore
} bind def
40.05 115.22 o
grestore
gsave
10.784375 111.423119 translate
0.000000 rotate
0.000000 0.000000 m /zero glyphshow
6.362305 0.000000 m /period glyphshow
9.541016 0.000000 m /eight glyphshow
15.903320 0.000000 m /five glyphshow
grestore
gsave
/o {
gsave
newpath
translate
0.8 setlinewidth
1 setlinejoin
0 setlinecap
0 0 m
-3.5 0 l

gsave
0.000 setgray
fill
grestore
stroke
grestore
} bind def
40.05 166.95 o
grestore
gsave
10.784375 163.153182 translate
0.000000 rotate
0.000000 0.000000 m /zero glyphshow
6.362305 0.000000 m /period glyphshow
9.541016 0.000000 m /nine glyphshow
15.903320 0.000000 m /zero glyphshow
grestore
gsave
/o {
gsave
newpath
translate
0.8 setlinewidth
1 setlinejoin
0 setlinecap
0 0 m
-3.5 0 l

gsave
0.000 setgray
fill
grestore
stroke
grestore
} bind def
40.05 218.68 o
grestore
gsave
10.784375 214.883245 translate
0.000000 rotate
0.000000 0.000000 m /zero glyphshow
6.362305 0.000000 m /period glyphshow
9.541016 0.000000 m /nine glyphshow
15.903320 0.000000 m /five glyphshow
grestore
1.500 setlinewidth
2 setlinecap
0.122 0.467 0.706 setrgbcolor
gsave
332.6 238.8 40.05 27.8 clipbox
55.168182 118.579552 m
59.094982 121.933163 l
63.021783 123.460099 l
66.948583 127.574303 l
70.875384 129.054218 l
74.802184 131.156385 l
78.728985 131.847155 l
82.655785 134.336589 l
86.582586 137.844202 l
90.509386 141.447184 l
94.436187 140.378538 l
98.362987 139.367054 l
102.289787 146.998407 l
106.216588 148.307818 l
110.143388 151.487847 l
114.070189 152.250301 l
117.996989 155.201547 l
121.92379 155.3364 l
125.85059 159.68973 l
129.777391 162.575792 l
133.704191 163.561932 l
137.630992 165.434864 l
141.557792 169.345899 l
145.484593 167.453221 l
149.411393 173.278346 l
153.338194 175.374749 l
157.264994 175.920726 l
161.191795 173.541649 l
165.118595 178.866298 l
169.045396 181.809834 l
172.972196 184.675296 l
176.898996 186.07906 l
180.825797 188.02658 l
184.752597 192.507901 l
188.679398 194.063605 l
192.606198 192.387654 l
196.532999 198.115459 l
200.459799 196.21071 l
204.3866 199.908713 l
208.3134 205.940522 l
212.240201 205.632247 l
216.167001 206.797518 l
220.093802 212.631582 l
224.020602 209.161259 l
227.947403 213.840609 l
231.874203 216.459361 l
235.801004 215.661659 l
239.727804 219.813048 l
243.654604 221.487854 l
247.581405 221.090218 l
251.508205 223.292762 l
255.435006 224.971991 l
259.361806 226.360546 l
263.288607 229.866916 l
267.215407 228.25678 l
271.142208 235.327313 l
275.069008 227.668296 l
278.995809 236.082842 l
282.922609 235.756391 l
286.84941 237.186681 l
290.77621 240.01347 l
294.703011 238.452751 l
298.629811 239.278069 l
302.556612 244.243754 l
306.483412 242.469531 l
310.410213 245.123524 l
314.337013 245.289215 l
318.263813 246.481775 l
322.190614 244.987364 l
326.117414 248.994476 l
330.044215 247.123982 l
333.971015 249.11307 l
337.897816 250.002404 l
341.824616 251.219863 l
345.751417 252.66776 l
349.678217 251.892255 l
353.605018 252.091146 l
357.531818 255.745455 l
stroke
grestore
1.000 0.498 0.055 setrgbcolor
gsave
332.6 238.8 40.05 27.8 clipbox
55.168182 105.425903 m
59.094982 106.262134 l
63.021783 107.39223 l
66.948583 108.40509 l
70.875384 107.277186 l
74.802184 108.161846 l
78.728985 108.128577 l
82.655785 108.622096 l
86.582586 107.423836 l
90.509386 108.719824 l
94.436187 105.202848 l
98.362987 103.243289 l
102.289787 109.250998 l
106.216588 107.731916 l
110.143388 108.773282 l
114.070189 106.243382 l
117.996989 105.861126 l
121.92379 105.965621 l
125.85059 105.432104 l
129.777391 103.756543 l
133.704191 103.830907 l
137.630992 103.972037 l
141.557792 101.622547 l
145.484593 103.690307 l
149.411393 100.3286 l
153.338194 97.972494 l
157.264994 102.264379 l
161.191795 99.103913 l
165.118595 101.390267 l
169.045396 98.670959 l
172.972196 99.087657 l
176.898996 88.265319 l
180.825797 96.878049 l
184.752597 95.265548 l
188.679398 96.029834 l
192.606198 93.164066 l
196.532999 86.159904 l
200.459799 92.619735 l
204.3866 87.527951 l
208.3134 88.798686 l
212.240201 82.342711 l
216.167001 79.608281 l
220.093802 68.886167 l
224.020602 86.647412 l
227.947403 77.615717 l
231.874203 75.373974 l
235.801004 76.587886 l
239.727804 75.427243 l
243.654604 75.091715 l
247.581405 77.806146 l
251.508205 75.351933 l
255.435006 71.849021 l
259.361806 72.418643 l
263.288607 67.279904 l
267.215407 63.356476 l
271.142208 62.615895 l
275.069008 66.535316 l
278.995809 62.838648 l
282.922609 54.476307 l
286.84941 67.767828 l
290.77621 56.178861 l
294.703011 54.125543 l
298.629811 59.899952 l
302.556612 59.472782 l
306.483412 54.920149 l
310.410213 49.54225 l
314.337013 54.831154 l
318.263813 54.166752 l
322.190614 52.503138 l
326.117414 48.548709 l
330.044215 59.776099 l
333.971015 50.729281 l
337.897816 53.23922 l
341.824616 52.705589 l
345.751417 38.654545 l
349.678217 43.658128 l
353.605018 44.176939 l
357.531818 39.80449 l
stroke
grestore
0.800 setlinewidth
0 setlinejoin
[] 0 setdash
0.000 setgray
gsave
40.05 27.8 m
40.05 266.6 l
stroke
grestore
gsave
372.65 27.8 m
372.65 266.6 l
stroke
grestore
gsave
40.05 27.8 m
372.65 27.8 l
stroke
grestore
gsave
40.05 266.6 m
372.65 266.6 l
stroke
grestore
/DejaVuSans findfont
12.000 scalefont
setfont
gsave
156.389062 272.600000 translate
0.000000 rotate
0.000000 0.000000 m /A glyphshow
8.208984 0.000000 m /d glyphshow
15.826172 0.000000 m /a glyphshow
23.179688 0.000000 m /d glyphshow
30.796875 0.000000 m /e glyphshow
38.179688 0.000000 m /l glyphshow
41.513672 0.000000 m /t glyphshow
46.218750 0.000000 m /a glyphshow
53.572266 0.000000 m /space glyphshow
57.386719 0.000000 m /hyphen glyphshow
61.716797 0.000000 m /space glyphshow
65.531250 0.000000 m /zero glyphshow
73.166016 0.000000 m /period glyphshow
76.980469 0.000000 m /eight glyphshow
84.615234 0.000000 m /four glyphshow
92.250000 0.000000 m /four glyphshow
grestore
1.000 setlinewidth
0 setlinecap
0.800 setgray
gsave
47.05 229.25625 m
112.565625 229.25625 l
113.898958 229.25625 114.565625 229.922917 114.565625 231.25625 c
114.565625 259.6 l
114.565625 260.933333 113.898958 261.6 112.565625 261.6 c
47.05 261.6 l
45.716667 261.6 45.05 260.933333 45.05 259.6 c
45.05 231.25625 l
45.05 229.922917 45.716667 229.25625 47.05 229.25625 c
cl
gsave
1.000 setgray
fill
grestore
stroke
grestore
1.500 setlinewidth
1 setlinejoin
2 setlinecap
[] 0 setdash
0.122 0.467 0.706 setrgbcolor
gsave
49.05 253.50625 m
69.05 253.50625 l
stroke
grestore
0.000 setgray
/DejaVuSans findfont
10.000 scalefont
setfont
gsave
77.050000 250.006250 translate
0.000000 rotate
0.000000 0.000000 m /a glyphshow
6.127930 0.000000 m /u glyphshow
12.465820 0.000000 m /c glyphshow
grestore
1.000 0.498 0.055 setrgbcolor
gsave
49.05 238.834375 m
69.05 238.834375 l
stroke
grestore
0.000 setgray
gsave
77.050000 235.334375 translate
0.000000 rotate
0.000000 0.000000 m /v glyphshow
5.917969 0.000000 m /a glyphshow
12.045898 0.000000 m /l glyphshow
14.824219 0.000000 m /A glyphshow
21.665039 0.000000 m /u glyphshow
28.002930 0.000000 m /c glyphshow
grestore
gsave
422.575 27.8 m
755.175 27.8 l
755.175 266.6 l
422.575 266.6 l
cl
1.000 setgray
fill
grestore
0.800 setlinewidth
0 setlinecap
gsave
/o {
gsave
newpath
translate
0.8 setlinewidth
1 setlinejoin
0 setlinecap
0 0 m
0 -3.5 l

gsave
0.000 setgray
fill
grestore
stroke
grestore
} bind def
429.84 27.8 o
grestore
gsave
426.659893 13.206250 translate
0.000000 rotate
0.000000 0.000000 m /zero glyphshow
grestore
gsave
/o {
gsave
newpath
translate
0.8 setlinewidth
1 setlinejoin
0 setlinecap
0 0 m
0 -3.5 l

gsave
0.000 setgray
fill
grestore
stroke
grestore
} bind def
469.108 27.8 o
grestore
gsave
462.748211 13.206250 translate
0.000000 rotate
0.000000 0.000000 m /one glyphshow
6.362305 0.000000 m /zero glyphshow
grestore
gsave
/o {
gsave
newpath
translate
0.8 setlinewidth
1 setlinejoin
0 setlinecap
0 0 m
0 -3.5 l

gsave
0.000 setgray
fill
grestore
stroke
grestore
} bind def
508.376 27.8 o
grestore
gsave
502.016215 13.206250 translate
0.000000 rotate
0.000000 0.000000 m /two glyphshow
6.362305 0.000000 m /zero glyphshow
grestore
gsave
/o {
gsave
newpath
translate
0.8 setlinewidth
1 setlinejoin
0 setlinecap
0 0 m
0 -3.5 l

gsave
0.000 setgray
fill
grestore
stroke
grestore
} bind def
547.644 27.8 o
grestore
gsave
541.284220 13.206250 translate
0.000000 rotate
0.000000 0.000000 m /three glyphshow
6.362305 0.000000 m /zero glyphshow
grestore
gsave
/o {
gsave
newpath
translate
0.8 setlinewidth
1 setlinejoin
0 setlinecap
0 0 m
0 -3.5 l

gsave
0.000 setgray
fill
grestore
stroke
grestore
} bind def
586.912 27.8 o
grestore
gsave
580.552225 13.206250 translate
0.000000 rotate
0.000000 0.000000 m /four glyphshow
6.362305 0.000000 m /zero glyphshow
grestore
gsave
/o {
gsave
newpath
translate
0.8 setlinewidth
1 setlinejoin
0 setlinecap
0 0 m
0 -3.5 l

gsave
0.000 setgray
fill
grestore
stroke
grestore
} bind def
626.18 27.8 o
grestore
gsave
619.820229 13.206250 translate
0.000000 rotate
0.000000 0.000000 m /five glyphshow
6.362305 0.000000 m /zero glyphshow
grestore
gsave
/o {
gsave
newpath
translate
0.8 setlinewidth
1 setlinejoin
0 setlinecap
0 0 m
0 -3.5 l

gsave
0.000 setgray
fill
grestore
stroke
grestore
} bind def
665.448 27.8 o
grestore
gsave
659.088234 13.206250 translate
0.000000 rotate
0.000000 0.000000 m /six glyphshow
6.362305 0.000000 m /zero glyphshow
grestore
gsave
/o {
gsave
newpath
translate
0.8 setlinewidth
1 setlinejoin
0 setlinecap
0 0 m
0 -3.5 l

gsave
0.000 setgray
fill
grestore
stroke
grestore
} bind def
704.716 27.8 o
grestore
gsave
698.356239 13.206250 translate
0.000000 rotate
0.000000 0.000000 m /seven glyphshow
6.362305 0.000000 m /zero glyphshow
grestore
gsave
/o {
gsave
newpath
translate
0.8 setlinewidth
1 setlinejoin
0 setlinecap
0 0 m
0 -3.5 l

gsave
0.000 setgray
fill
grestore
stroke
grestore
} bind def
743.984 27.8 o
grestore
gsave
737.624244 13.206250 translate
0.000000 rotate
0.000000 0.000000 m /eight glyphshow
6.362305 0.000000 m /zero glyphshow
grestore
gsave
/o {
gsave
newpath
translate
0.8 setlinewidth
1 setlinejoin
0 setlinecap
0 0 m
-3.5 0 l

gsave
0.000 setgray
fill
grestore
stroke
grestore
} bind def
422.575 43.3899 o
grestore
gsave
393.309375 39.593033 translate
0.000000 rotate
0.000000 0.000000 m /zero glyphshow
6.362305 0.000000 m /period glyphshow
9.541016 0.000000 m /seven glyphshow
15.903320 0.000000 m /zero glyphshow
grestore
gsave
/o {
gsave
newpath
translate
0.8 setlinewidth
1 setlinejoin
0 setlinecap
0 0 m
-3.5 0 l

gsave
0.000 setgray
fill
grestore
stroke
grestore
} bind def
422.575 78.7956 o
grestore
gsave
393.309375 74.998710 translate
0.000000 rotate
0.000000 0.000000 m /zero glyphshow
6.362305 0.000000 m /period glyphshow
9.541016 0.000000 m /seven glyphshow
15.903320 0.000000 m /five glyphshow
grestore
gsave
/o {
gsave
newpath
translate
0.8 setlinewidth
1 setlinejoin
0 setlinecap
0 0 m
-3.5 0 l

gsave
0.000 setgray
fill
grestore
stroke
grestore
} bind def
422.575 114.201 o
grestore
gsave
393.309375 110.404386 translate
0.000000 rotate
0.000000 0.000000 m /zero glyphshow
6.362305 0.000000 m /period glyphshow
9.541016 0.000000 m /eight glyphshow
15.903320 0.000000 m /zero glyphshow
grestore
gsave
/o {
gsave
newpath
translate
0.8 setlinewidth
1 setlinejoin
0 setlinecap
0 0 m
-3.5 0 l

gsave
0.000 setgray
fill
grestore
stroke
grestore
} bind def
422.575 149.607 o
grestore
gsave
393.309375 145.810062 translate
0.000000 rotate
0.000000 0.000000 m /zero glyphshow
6.362305 0.000000 m /period glyphshow
9.541016 0.000000 m /eight glyphshow
15.903320 0.000000 m /five glyphshow
grestore
gsave
/o {
gsave
newpath
translate
0.8 setlinewidth
1 setlinejoin
0 setlinecap
0 0 m
-3.5 0 l

gsave
0.000 setgray
fill
grestore
stroke
grestore
} bind def
422.575 185.013 o
grestore
gsave
393.309375 181.215739 translate
0.000000 rotate
0.000000 0.000000 m /zero glyphshow
6.362305 0.000000 m /period glyphshow
9.541016 0.000000 m /nine glyphshow
15.903320 0.000000 m /zero glyphshow
grestore
gsave
/o {
gsave
newpath
translate
0.8 setlinewidth
1 setlinejoin
0 setlinecap
0 0 m
-3.5 0 l

gsave
0.000 setgray
fill
grestore
stroke
grestore
} bind def
422.575 220.418 o
grestore
gsave
393.309375 216.621415 translate
0.000000 rotate
0.000000 0.000000 m /zero glyphshow
6.362305 0.000000 m /period glyphshow
9.541016 0.000000 m /nine glyphshow
15.903320 0.000000 m /five glyphshow
grestore
gsave
/o {
gsave
newpath
translate
0.8 setlinewidth
1 setlinejoin
0 setlinecap
0 0 m
-3.5 0 l

gsave
0.000 setgray
fill
grestore
stroke
grestore
} bind def
422.575 255.824 o
grestore
gsave
393.309375 252.027092 translate
0.000000 rotate
0.000000 0.000000 m /one glyphshow
6.362305 0.000000 m /period glyphshow
9.541016 0.000000 m /zero glyphshow
15.903320 0.000000 m /zero glyphshow
grestore
1.500 setlinewidth
2 setlinecap
0.122 0.467 0.706 setrgbcolor
gsave
332.6 238.8 422.6 27.8 clipbox
437.693182 154.336513 m
441.619982 156.92944 l
445.546783 159.357337 l
449.473583 162.960046 l
453.400384 166.35729 l
457.327184 168.839708 l
461.253985 170.544153 l
465.180785 175.866819 l
469.107586 180.384796 l
473.034386 182.789928 l
476.961187 186.573226 l
480.887987 192.431933 l
484.814787 195.712968 l
488.741588 198.431417 l
492.668388 201.756053 l
496.595189 207.192874 l
500.521989 208.094732 l
504.44879 215.538387 l
508.37559 213.458351 l
512.302391 221.676503 l
516.229191 221.688896 l
520.155992 225.568175 l
524.082792 229.60832 l
528.009593 230.65306 l
531.936393 236.46289 l
535.863194 236.156832 l
539.789994 240.643136 l
543.716795 240.953458 l
547.643595 239.729198 l
551.570396 244.934771 l
555.497196 244.339531 l
559.423996 246.347752 l
563.350797 246.304693 l
567.277597 249.35099 l
571.204398 248.193877 l
575.131198 247.015196 l
579.057999 251.475478 l
582.984799 251.565085 l
586.9116 252.49818 l
590.8384 251.907513 l
594.765201 253.344939 l
598.692001 252.156275 l
602.618802 251.8433 l
606.545602 254.112724 l
610.472403 253.329513 l
614.399203 254.712113 l
618.326004 254.244663 l
622.252804 254.444204 l
626.179604 252.392914 l
630.106405 252.64246 l
634.033205 255.018675 l
637.960006 254.767684 l
641.886806 253.703876 l
645.813607 254.149389 l
649.740407 255.324752 l
653.667208 255.069801 l
657.594008 255.424969 l
661.520809 253.974652 l
665.447609 251.715583 l
669.37441 254.286372 l
673.30121 254.934877 l
677.228011 255.521622 l
681.154811 255.258732 l
685.081612 255.430574 l
689.008412 255.214789 l
692.935213 254.624293 l
696.862013 254.975117 l
700.788813 255.360053 l
704.715614 255.644182 l
708.642414 255.197196 l
712.569215 251.129351 l
716.496015 255.008778 l
720.422816 255.273084 l
724.349616 255.047791 l
728.276417 255.242955 l
732.203217 255.73069 l
736.130018 255.745455 l
740.056818 255.742945 l
stroke
grestore
1.000 0.498 0.055 setrgbcolor
gsave
332.6 238.8 422.6 27.8 clipbox
437.693182 143.384116 m
441.619982 143.422904 l
445.546783 144.982866 l
449.473583 142.10374 l
453.400384 142.422165 l
457.327184 141.857353 l
461.253985 141.144894 l
465.180785 142.53017 l
469.107586 142.990497 l
473.034386 141.283122 l
476.961187 134.779499 l
480.887987 134.446428 l
484.814787 131.245721 l
488.741588 130.138659 l
492.668388 126.773047 l
496.595189 121.956383 l
500.521989 120.032792 l
504.44879 121.713774 l
508.37559 118.632482 l
512.302391 116.375949 l
516.229191 119.387325 l
520.155992 108.432738 l
524.082792 103.621948 l
528.009593 107.206338 l
531.936393 97.397626 l
535.863194 103.031932 l
539.789994 94.056 l
543.716795 98.986128 l
547.643595 85.414225 l
551.570396 88.87211 l
555.497196 94.555476 l
559.423996 91.485648 l
563.350797 98.909122 l
567.277597 91.06724 l
571.204398 93.176644 l
575.131198 77.298733 l
579.057999 76.832093 l
582.984799 68.18579 l
586.9116 78.86519 l
590.8384 70.824505 l
594.765201 74.454462 l
598.692001 79.083502 l
602.618802 80.158995 l
606.545602 67.045142 l
610.472403 81.204137 l
614.399203 60.885069 l
618.326004 68.830739 l
622.252804 72.077789 l
626.179604 63.545778 l
630.106405 86.680654 l
634.033205 69.535486 l
637.960006 76.053936 l
641.886806 71.116226 l
645.813607 72.96126 l
649.740407 62.587968 l
653.667208 55.570533 l
657.594008 68.398901 l
661.520809 84.423888 l
665.447609 62.344142 l
669.37441 65.427193 l
673.30121 74.106927 l
677.228011 62.013504 l
681.154811 76.665428 l
685.081612 64.026262 l
689.008412 78.392495 l
692.935213 51.423477 l
696.862013 64.578577 l
700.788813 62.945102 l
704.715614 71.269255 l
708.642414 77.667512 l
712.569215 38.654545 l
716.496015 72.491126 l
720.422816 60.70896 l
724.349616 61.410473 l
728.276417 61.92858 l
732.203217 67.989032 l
736.130018 66.920318 l
740.056818 70.40325 l
stroke
grestore
0.800 setlinewidth
0 setlinejoin
[] 0 setdash
0.000 setgray
gsave
422.575 27.8 m
422.575 266.6 l
stroke
grestore
gsave
755.175 27.8 m
755.175 266.6 l
stroke
grestore
gsave
422.575 27.8 m
755.175 27.8 l
stroke
grestore
gsave
422.575 266.6 m
755.175 266.6 l
stroke
grestore
/DejaVuSans findfont
12.000 scalefont
setfont
gsave
548.273438 272.600000 translate
0.000000 rotate
0.000000 0.000000 m /A glyphshow
8.208984 0.000000 m /d glyphshow
15.826172 0.000000 m /a glyphshow
23.179688 0.000000 m /m glyphshow
34.869141 0.000000 m /space glyphshow
38.683594 0.000000 m /hyphen glyphshow
43.013672 0.000000 m /space glyphshow
46.828125 0.000000 m /zero glyphshow
54.462891 0.000000 m /period glyphshow
58.277344 0.000000 m /eight glyphshow
65.912109 0.000000 m /four glyphshow
73.546875 0.000000 m /three glyphshow
grestore
1.000 setlinewidth
0 setlinecap
0.800 setgray
gsave
429.575 229.25625 m
495.090625 229.25625 l
496.423958 229.25625 497.090625 229.922917 497.090625 231.25625 c
497.090625 259.6 l
497.090625 260.933333 496.423958 261.6 495.090625 261.6 c
429.575 261.6 l
428.241667 261.6 427.575 260.933333 427.575 259.6 c
427.575 231.25625 l
427.575 229.922917 428.241667 229.25625 429.575 229.25625 c
cl
gsave
1.000 setgray
fill
grestore
stroke
grestore
1.500 setlinewidth
1 setlinejoin
2 setlinecap
[] 0 setdash
0.122 0.467 0.706 setrgbcolor
gsave
431.575 253.50625 m
451.575 253.50625 l
stroke
grestore
0.000 setgray
/DejaVuSans findfont
10.000 scalefont
setfont
gsave
459.575000 250.006250 translate
0.000000 rotate
0.000000 0.000000 m /a glyphshow
6.127930 0.000000 m /u glyphshow
12.465820 0.000000 m /c glyphshow
grestore
1.000 0.498 0.055 setrgbcolor
gsave
431.575 238.834375 m
451.575 238.834375 l
stroke
grestore
0.000 setgray
gsave
459.575000 235.334375 translate
0.000000 rotate
0.000000 0.000000 m /v glyphshow
5.917969 0.000000 m /a glyphshow
12.045898 0.000000 m /l glyphshow
14.824219 0.000000 m /A glyphshow
21.665039 0.000000 m /u glyphshow
28.002930 0.000000 m /c glyphshow
grestore
gsave
805.1 27.8 m
1137.7 27.8 l
1137.7 266.6 l
805.1 266.6 l
cl
1.000 setgray
fill
grestore
0.800 setlinewidth
0 setlinecap
gsave
/o {
gsave
newpath
translate
0.8 setlinewidth
1 setlinejoin
0 setlinecap
0 0 m
0 -3.5 l

gsave
0.000 setgray
fill
grestore
stroke
grestore
} bind def
812.365 27.8 o
grestore
gsave
809.184893 13.206250 translate
0.000000 rotate
0.000000 0.000000 m /zero glyphshow
grestore
gsave
/o {
gsave
newpath
translate
0.8 setlinewidth
1 setlinejoin
0 setlinecap
0 0 m
0 -3.5 l

gsave
0.000 setgray
fill
grestore
stroke
grestore
} bind def
851.633 27.8 o
grestore
gsave
845.273211 13.206250 translate
0.000000 rotate
0.000000 0.000000 m /one glyphshow
6.362305 0.000000 m /zero glyphshow
grestore
gsave
/o {
gsave
newpath
translate
0.8 setlinewidth
1 setlinejoin
0 setlinecap
0 0 m
0 -3.5 l

gsave
0.000 setgray
fill
grestore
stroke
grestore
} bind def
890.901 27.8 o
grestore
gsave
884.541215 13.206250 translate
0.000000 rotate
0.000000 0.000000 m /two glyphshow
6.362305 0.000000 m /zero glyphshow
grestore
gsave
/o {
gsave
newpath
translate
0.8 setlinewidth
1 setlinejoin
0 setlinecap
0 0 m
0 -3.5 l

gsave
0.000 setgray
fill
grestore
stroke
grestore
} bind def
930.169 27.8 o
grestore
gsave
923.809220 13.206250 translate
0.000000 rotate
0.000000 0.000000 m /three glyphshow
6.362305 0.000000 m /zero glyphshow
grestore
gsave
/o {
gsave
newpath
translate
0.8 setlinewidth
1 setlinejoin
0 setlinecap
0 0 m
0 -3.5 l

gsave
0.000 setgray
fill
grestore
stroke
grestore
} bind def
969.437 27.8 o
grestore
gsave
963.077225 13.206250 translate
0.000000 rotate
0.000000 0.000000 m /four glyphshow
6.362305 0.000000 m /zero glyphshow
grestore
gsave
/o {
gsave
newpath
translate
0.8 setlinewidth
1 setlinejoin
0 setlinecap
0 0 m
0 -3.5 l

gsave
0.000 setgray
fill
grestore
stroke
grestore
} bind def
1008.7 27.8 o
grestore
gsave
1002.345229 13.206250 translate
0.000000 rotate
0.000000 0.000000 m /five glyphshow
6.362305 0.000000 m /zero glyphshow
grestore
gsave
/o {
gsave
newpath
translate
0.8 setlinewidth
1 setlinejoin
0 setlinecap
0 0 m
0 -3.5 l

gsave
0.000 setgray
fill
grestore
stroke
grestore
} bind def
1047.97 27.8 o
grestore
gsave
1041.613234 13.206250 translate
0.000000 rotate
0.000000 0.000000 m /six glyphshow
6.362305 0.000000 m /zero glyphshow
grestore
gsave
/o {
gsave
newpath
translate
0.8 setlinewidth
1 setlinejoin
0 setlinecap
0 0 m
0 -3.5 l

gsave
0.000 setgray
fill
grestore
stroke
grestore
} bind def
1087.24 27.8 o
grestore
gsave
1080.881239 13.206250 translate
0.000000 rotate
0.000000 0.000000 m /seven glyphshow
6.362305 0.000000 m /zero glyphshow
grestore
gsave
/o {
gsave
newpath
translate
0.8 setlinewidth
1 setlinejoin
0 setlinecap
0 0 m
0 -3.5 l

gsave
0.000 setgray
fill
grestore
stroke
grestore
} bind def
1126.51 27.8 o
grestore
gsave
1120.149244 13.206250 translate
0.000000 rotate
0.000000 0.000000 m /eight glyphshow
6.362305 0.000000 m /zero glyphshow
grestore
gsave
/o {
gsave
newpath
translate
0.8 setlinewidth
1 setlinejoin
0 setlinecap
0 0 m
-3.5 0 l

gsave
0.000 setgray
fill
grestore
stroke
grestore
} bind def
805.1 64.5455 o
grestore
gsave
775.834375 60.748658 translate
0.000000 rotate
0.000000 0.000000 m /zero glyphshow
6.362305 0.000000 m /period glyphshow
9.541016 0.000000 m /seven glyphshow
15.903320 0.000000 m /five glyphshow
grestore
gsave
/o {
gsave
newpath
translate
0.8 setlinewidth
1 setlinejoin
0 setlinecap
0 0 m
-3.5 0 l

gsave
0.000 setgray
fill
grestore
stroke
grestore
} bind def
805.1 102.846 o
grestore
gsave
775.834375 99.048709 translate
0.000000 rotate
0.000000 0.000000 m /zero glyphshow
6.362305 0.000000 m /period glyphshow
9.541016 0.000000 m /eight glyphshow
15.903320 0.000000 m /zero glyphshow
grestore
gsave
/o {
gsave
newpath
translate
0.8 setlinewidth
1 setlinejoin
0 setlinecap
0 0 m
-3.5 0 l

gsave
0.000 setgray
fill
grestore
stroke
grestore
} bind def
805.1 141.146 o
grestore
gsave
775.834375 137.348760 translate
0.000000 rotate
0.000000 0.000000 m /zero glyphshow
6.362305 0.000000 m /period glyphshow
9.541016 0.000000 m /eight glyphshow
15.903320 0.000000 m /five glyphshow
grestore
gsave
/o {
gsave
newpath
translate
0.8 setlinewidth
1 setlinejoin
0 setlinecap
0 0 m
-3.5 0 l

gsave
0.000 setgray
fill
grestore
stroke
grestore
} bind def
805.1 179.446 o
grestore
gsave
775.834375 175.648810 translate
0.000000 rotate
0.000000 0.000000 m /zero glyphshow
6.362305 0.000000 m /period glyphshow
9.541016 0.000000 m /nine glyphshow
15.903320 0.000000 m /zero glyphshow
grestore
gsave
/o {
gsave
newpath
translate
0.8 setlinewidth
1 setlinejoin
0 setlinecap
0 0 m
-3.5 0 l

gsave
0.000 setgray
fill
grestore
stroke
grestore
} bind def
805.1 217.746 o
grestore
gsave
775.834375 213.948861 translate
0.000000 rotate
0.000000 0.000000 m /zero glyphshow
6.362305 0.000000 m /period glyphshow
9.541016 0.000000 m /nine glyphshow
15.903320 0.000000 m /five glyphshow
grestore
gsave
/o {
gsave
newpath
translate
0.8 setlinewidth
1 setlinejoin
0 setlinecap
0 0 m
-3.5 0 l

gsave
0.000 setgray
fill
grestore
stroke
grestore
} bind def
805.1 256.046 o
grestore
gsave
775.834375 252.248911 translate
0.000000 rotate
0.000000 0.000000 m /one glyphshow
6.362305 0.000000 m /period glyphshow
9.541016 0.000000 m /zero glyphshow
15.903320 0.000000 m /zero glyphshow
grestore
1.500 setlinewidth
2 setlinecap
0.122 0.467 0.706 setrgbcolor
gsave
332.6 238.8 805.1 27.8 clipbox
820.218182 143.994169 m
824.144982 148.26753 l
828.071783 150.632928 l
831.998583 152.384698 l
835.925384 157.421677 l
839.852184 158.006137 l
843.778985 160.260255 l
847.705785 161.767215 l
851.632586 165.266015 l
855.559386 167.402575 l
859.486187 171.791267 l
863.412987 174.04684 l
867.339787 173.941948 l
871.266588 179.787386 l
875.193388 181.299967 l
879.120189 183.977333 l
883.046989 188.493262 l
886.97379 190.860084 l
890.90059 192.158801 l
894.827391 196.949746 l
898.754191 195.441109 l
902.680992 204.755399 l
906.607792 208.935817 l
910.534593 209.189729 l
914.461393 211.630148 l
918.388194 211.898608 l
922.314994 214.159925 l
926.241795 216.2647 l
930.168595 221.396524 l
934.095396 221.821114 l
938.022196 226.097273 l
941.948996 225.782434 l
945.875797 229.691385 l
949.802597 233.556683 l
953.729398 230.775483 l
957.656198 235.406095 l
961.582999 236.050396 l
965.509799 237.773159 l
969.4366 239.831206 l
973.3634 238.747669 l
977.290201 243.274438 l
981.217001 242.970424 l
985.143802 242.409027 l
989.070602 244.744245 l
992.997403 244.833901 l
996.924203 246.717695 l
1000.851004 247.52311 l
1004.777804 249.408488 l
1008.704604 250.262421 l
1012.631405 249.144132 l
1016.558205 250.553106 l
1020.485006 250.266535 l
1024.411806 250.303179 l
1028.338607 250.737252 l
1032.265407 250.855546 l
1036.192208 252.890143 l
1040.119008 252.440263 l
1044.045809 252.782505 l
1047.972609 253.690061 l
1051.89941 253.238165 l
1055.82621 254.225777 l
1059.753011 252.946184 l
1063.679811 253.667733 l
1067.606612 254.322247 l
1071.533412 254.044788 l
1075.460213 254.604807 l
1079.387013 254.753914 l
1083.313813 254.929266 l
1087.240614 255.165052 l
1091.167414 255.475318 l
1095.094215 255.495456 l
1099.021015 255.162028 l
1102.947816 255.186331 l
1106.874616 255.445164 l
1110.801417 255.43744 l
1114.728217 255.285238 l
1118.655018 255.733103 l
1122.581818 255.745455 l
stroke
grestore
1.000 0.498 0.055 setrgbcolor
gsave
332.6 238.8 805.1 27.8 clipbox
820.218182 132.742433 m
824.144982 136.246445 l
828.071783 134.370439 l
831.998583 135.389867 l
835.925384 137.269176 l
839.852184 136.382452 l
843.778985 136.178259 l
847.705785 133.762197 l
851.632586 134.424182 l
855.559386 134.072224 l
859.486187 135.498808 l
863.412987 132.931763 l
867.339787 129.029945 l
871.266588 130.025665 l
875.193388 128.659905 l
879.120189 128.926574 l
883.046989 124.348692 l
886.97379 126.78835 l
890.90059 129.06902 l
894.827391 123.326968 l
898.754191 124.544796 l
902.680992 115.578417 l
906.607792 114.854461 l
910.534593 114.618889 l
914.461393 112.930227 l
918.388194 110.089711 l
922.314994 107.17933 l
926.241795 115.156986 l
930.168595 108.945835 l
934.095396 109.591809 l
938.022196 98.13592 l
941.948996 102.219596 l
945.875797 96.315169 l
949.802597 87.546602 l
953.729398 94.221814 l
957.656198 94.989828 l
961.582999 95.402246 l
965.509799 90.527352 l
969.4366 87.646501 l
973.3634 95.436171 l
977.290201 86.084302 l
981.217001 77.451574 l
985.143802 86.122621 l
989.070602 83.981794 l
992.997403 83.246529 l
996.924203 74.622031 l
1000.851004 80.017807 l
1004.777804 71.289435 l
1008.704604 68.690397 l
1012.631405 78.431424 l
1016.558205 72.689512 l
1020.485006 62.958142 l
1024.411806 72.845757 l
1028.338607 69.360303 l
1032.265407 68.314423 l
1036.192208 60.035109 l
1040.119008 51.806094 l
1044.045809 71.731299 l
1047.972609 52.199422 l
1051.89941 66.636481 l
1055.82621 58.693198 l
1059.753011 70.184943 l
1063.679811 64.580158 l
1067.606612 63.703176 l
1071.533412 43.342152 l
1075.460213 61.452988 l
1079.387013 57.133349 l
1083.313813 41.094288 l
1087.240614 38.654545 l
1091.167414 43.635749 l
1095.094215 60.202718 l
1099.021015 63.039819 l
1102.947816 65.970774 l
1106.874616 58.01635 l
1110.801417 52.562464 l
1114.728217 64.124522 l
1118.655018 55.307475 l
1122.581818 45.239431 l
stroke
grestore
0.800 setlinewidth
0 setlinejoin
[] 0 setdash
0.000 setgray
gsave
805.1 27.8 m
805.1 266.6 l
stroke
grestore
gsave
1137.7 27.8 m
1137.7 266.6 l
stroke
grestore
gsave
805.1 27.8 m
1137.7 27.8 l
stroke
grestore
gsave
805.1 266.6 m
1137.7 266.6 l
stroke
grestore
/DejaVuSans findfont
12.000 scalefont
setfont
gsave
923.564063 272.600000 translate
0.000000 rotate
0.000000 0.000000 m /A glyphshow
8.208984 0.000000 m /d glyphshow
15.826172 0.000000 m /a glyphshow
23.179688 0.000000 m /m glyphshow
34.869141 0.000000 m /a glyphshow
42.222656 0.000000 m /x glyphshow
49.324219 0.000000 m /space glyphshow
53.138672 0.000000 m /hyphen glyphshow
57.468750 0.000000 m /space glyphshow
61.283203 0.000000 m /zero glyphshow
68.917969 0.000000 m /period glyphshow
72.732422 0.000000 m /eight glyphshow
80.367188 0.000000 m /four glyphshow
88.001953 0.000000 m /five glyphshow
grestore
1.000 setlinewidth
0 setlinecap
0.800 setgray
gsave
812.1 229.25625 m
877.615625 229.25625 l
878.948958 229.25625 879.615625 229.922917 879.615625 231.25625 c
879.615625 259.6 l
879.615625 260.933333 878.948958 261.6 877.615625 261.6 c
812.1 261.6 l
810.766667 261.6 810.1 260.933333 810.1 259.6 c
810.1 231.25625 l
810.1 229.922917 810.766667 229.25625 812.1 229.25625 c
cl
gsave
1.000 setgray
fill
grestore
stroke
grestore
1.500 setlinewidth
1 setlinejoin
2 setlinecap
[] 0 setdash
0.122 0.467 0.706 setrgbcolor
gsave
814.1 253.50625 m
834.1 253.50625 l
stroke
grestore
0.000 setgray
/DejaVuSans findfont
10.000 scalefont
setfont
gsave
842.100000 250.006250 translate
0.000000 rotate
0.000000 0.000000 m /a glyphshow
6.127930 0.000000 m /u glyphshow
12.465820 0.000000 m /c glyphshow
grestore
1.000 0.498 0.055 setrgbcolor
gsave
814.1 238.834375 m
834.1 238.834375 l
stroke
grestore
0.000 setgray
gsave
842.100000 235.334375 translate
0.000000 rotate
0.000000 0.000000 m /v glyphshow
5.917969 0.000000 m /a glyphshow
12.045898 0.000000 m /l glyphshow
14.824219 0.000000 m /A glyphshow
21.665039 0.000000 m /u glyphshow
28.002930 0.000000 m /c glyphshow
grestore

end
showpage
