%!PS-Adobe-3.0 EPSF-3.0
%%Title: imgNets/dropRate3.eps
%%Creator: matplotlib version 2.0.2, http://matplotlib.org/
%%CreationDate: Fri Apr 20 15:24:04 2018
%%Orientation: portrait
%%BoundingBox: -270 108 882 684
%%EndComments
%%BeginProlog
/mpldict 8 dict def
mpldict begin
/m { moveto } bind def
/l { lineto } bind def
/r { rlineto } bind def
/c { curveto } bind def
/cl { closepath } bind def
/box {
m
1 index 0 r
0 exch r
neg 0 r
cl
} bind def
/clipbox {
box
clip
newpath
} bind def
%!PS-Adobe-3.0 Resource-Font
%%Title: DejaVu Sans
%%Copyright: Copyright (c) 2003 by Bitstream, Inc. All Rights Reserved. Copyright (c) 2006 by Tavmjong Bah. All Rights Reserved. DejaVu changes are in public domain 
%%Creator: Converted from TrueType to type 3 by PPR
25 dict begin
/_d{bind def}bind def
/_m{moveto}_d
/_l{lineto}_d
/_cl{closepath eofill}_d
/_c{curveto}_d
/_sc{7 -1 roll{setcachedevice}{pop pop pop pop pop pop}ifelse}_d
/_e{exec}_d
/FontName /DejaVuSans def
/PaintType 0 def
/FontMatrix[.001 0 0 .001 0 0]def
/FontBBox[-1021 -463 1793 1232]def
/FontType 3 def
/Encoding [ /space /hyphen /period /zero /one /two /three /four /five /six /seven /eight /nine /A /a /c /l /u /v ] def
/FontInfo 10 dict dup begin
/FamilyName (DejaVu Sans) def
/FullName (DejaVu Sans) def
/Notice (Copyright (c) 2003 by Bitstream, Inc. All Rights Reserved. Copyright (c) 2006 by Tavmjong Bah. All Rights Reserved. DejaVu changes are in public domain ) def
/Weight (Book) def
/Version (Version 2.35) def
/ItalicAngle 0.0 def
/isFixedPitch false def
/UnderlinePosition -130 def
/UnderlineThickness 90 def
end readonly def
/CharStrings 19 dict dup begin
/space{318 0 0 0 0 0 _sc
}_d
/hyphen{361 0 49 234 312 314 _sc
49 314 _m
312 314 _l
312 234 _l
49 234 _l
49 314 _l
_cl}_d
/period{318 0 107 0 210 124 _sc
107 124 _m
210 124 _l
210 0 _l
107 0 _l
107 124 _l
_cl}_d
/zero{636 0 66 -13 570 742 _sc
318 664 _m
267 664 229 639 203 589 _c
177 539 165 464 165 364 _c
165 264 177 189 203 139 _c
229 89 267 64 318 64 _c
369 64 407 89 433 139 _c
458 189 471 264 471 364 _c
471 464 458 539 433 589 _c
407 639 369 664 318 664 _c
318 742 _m
399 742 461 709 505 645 _c
548 580 570 486 570 364 _c
570 241 548 147 505 83 _c
461 19 399 -13 318 -13 _c
236 -13 173 19 130 83 _c
87 147 66 241 66 364 _c
66 486 87 580 130 645 _c
173 709 236 742 318 742 _c
_cl}_d
/one{636 0 110 0 544 729 _sc
124 83 _m
285 83 _l
285 639 _l
110 604 _l
110 694 _l
284 729 _l
383 729 _l
383 83 _l
544 83 _l
544 0 _l
124 0 _l
124 83 _l
_cl}_d
/two{{636 0 73 0 536 742 _sc
192 83 _m
536 83 _l
536 0 _l
73 0 _l
73 83 _l
110 121 161 173 226 239 _c
290 304 331 346 348 365 _c
380 400 402 430 414 455 _c
426 479 433 504 433 528 _c
433 566 419 598 392 622 _c
365 646 330 659 286 659 _c
255 659 222 653 188 643 _c
154 632 117 616 78 594 _c
78 694 _l
118 710 155 722 189 730 _c
223 738 255 742 284 742 _c
}_e{359 742 419 723 464 685 _c
509 647 532 597 532 534 _c
532 504 526 475 515 449 _c
504 422 484 390 454 354 _c
446 344 420 317 376 272 _c
332 227 271 164 192 83 _c
_cl}_e}_d
/three{{636 0 76 -13 556 742 _sc
406 393 _m
453 383 490 362 516 330 _c
542 298 556 258 556 212 _c
556 140 531 84 482 45 _c
432 6 362 -13 271 -13 _c
240 -13 208 -10 176 -4 _c
144 1 110 10 76 22 _c
76 117 _l
103 101 133 89 166 81 _c
198 73 232 69 268 69 _c
330 69 377 81 409 105 _c
441 129 458 165 458 212 _c
458 254 443 288 413 312 _c
383 336 341 349 287 349 _c
}_e{202 349 _l
202 430 _l
291 430 _l
339 430 376 439 402 459 _c
428 478 441 506 441 543 _c
441 580 427 609 401 629 _c
374 649 336 659 287 659 _c
260 659 231 656 200 650 _c
169 644 135 635 98 623 _c
98 711 _l
135 721 170 729 203 734 _c
235 739 266 742 296 742 _c
370 742 429 725 473 691 _c
517 657 539 611 539 553 _c
539 513 527 479 504 451 _c
481 423 448 403 406 393 _c
_cl}_e}_d
/four{636 0 49 0 580 729 _sc
378 643 _m
129 254 _l
378 254 _l
378 643 _l
352 729 _m
476 729 _l
476 254 _l
580 254 _l
580 172 _l
476 172 _l
476 0 _l
378 0 _l
378 172 _l
49 172 _l
49 267 _l
352 729 _l
_cl}_d
/five{{636 0 77 -13 549 729 _sc
108 729 _m
495 729 _l
495 646 _l
198 646 _l
198 467 _l
212 472 227 476 241 478 _c
255 480 270 482 284 482 _c
365 482 429 459 477 415 _c
525 370 549 310 549 234 _c
549 155 524 94 475 51 _c
426 8 357 -13 269 -13 _c
238 -13 207 -10 175 -6 _c
143 -1 111 6 77 17 _c
77 116 _l
106 100 136 88 168 80 _c
199 72 232 69 267 69 _c
}_e{323 69 368 83 401 113 _c
433 143 450 183 450 234 _c
450 284 433 324 401 354 _c
368 384 323 399 267 399 _c
241 399 214 396 188 390 _c
162 384 135 375 108 363 _c
108 729 _l
_cl}_e}_d
/six{{636 0 70 -13 573 742 _sc
330 404 _m
286 404 251 388 225 358 _c
199 328 186 286 186 234 _c
186 181 199 139 225 109 _c
251 79 286 64 330 64 _c
374 64 409 79 435 109 _c
461 139 474 181 474 234 _c
474 286 461 328 435 358 _c
409 388 374 404 330 404 _c
526 713 _m
526 623 _l
501 635 476 644 451 650 _c
425 656 400 659 376 659 _c
310 659 260 637 226 593 _c
}_e{192 549 172 482 168 394 _c
187 422 211 444 240 459 _c
269 474 301 482 336 482 _c
409 482 467 459 509 415 _c
551 371 573 310 573 234 _c
573 159 550 99 506 54 _c
462 9 403 -13 330 -13 _c
246 -13 181 19 137 83 _c
92 147 70 241 70 364 _c
70 479 97 571 152 639 _c
206 707 280 742 372 742 _c
396 742 421 739 447 735 _c
472 730 498 723 526 713 _c
_cl}_e}_d
/seven{636 0 82 0 551 729 _sc
82 729 _m
551 729 _l
551 687 _l
286 0 _l
183 0 _l
432 646 _l
82 646 _l
82 729 _l
_cl}_d
/eight{{636 0 68 -13 568 742 _sc
318 346 _m
271 346 234 333 207 308 _c
180 283 167 249 167 205 _c
167 161 180 126 207 101 _c
234 76 271 64 318 64 _c
364 64 401 76 428 102 _c
455 127 469 161 469 205 _c
469 249 455 283 429 308 _c
402 333 365 346 318 346 _c
219 388 _m
177 398 144 418 120 447 _c
96 476 85 511 85 553 _c
85 611 105 657 147 691 _c
188 725 245 742 318 742 _c
}_e{390 742 447 725 489 691 _c
530 657 551 611 551 553 _c
551 511 539 476 515 447 _c
491 418 459 398 417 388 _c
464 377 501 355 528 323 _c
554 291 568 251 568 205 _c
568 134 546 80 503 43 _c
459 5 398 -13 318 -13 _c
237 -13 175 5 132 43 _c
89 80 68 134 68 205 _c
68 251 81 291 108 323 _c
134 355 171 377 219 388 _c
183 544 _m
183 506 194 476 218 455 _c
}_e{242 434 275 424 318 424 _c
360 424 393 434 417 455 _c
441 476 453 506 453 544 _c
453 582 441 611 417 632 _c
393 653 360 664 318 664 _c
275 664 242 653 218 632 _c
194 611 183 582 183 544 _c
_cl}_e}_d
/nine{{636 0 63 -13 566 742 _sc
110 15 _m
110 105 _l
134 93 159 84 185 78 _c
210 72 235 69 260 69 _c
324 69 374 90 408 134 _c
442 178 462 244 468 334 _c
448 306 424 284 396 269 _c
367 254 335 247 300 247 _c
226 247 168 269 126 313 _c
84 357 63 417 63 494 _c
63 568 85 628 129 674 _c
173 719 232 742 306 742 _c
390 742 455 709 499 645 _c
543 580 566 486 566 364 _c
}_e{566 248 538 157 484 89 _c
429 21 356 -13 264 -13 _c
239 -13 214 -10 189 -6 _c
163 -2 137 5 110 15 _c
306 324 _m
350 324 385 339 411 369 _c
437 399 450 441 450 494 _c
450 546 437 588 411 618 _c
385 648 350 664 306 664 _c
262 664 227 648 201 618 _c
175 588 162 546 162 494 _c
162 441 175 399 201 369 _c
227 339 262 324 306 324 _c
_cl}_e}_d
/A{684 0 8 0 676 729 _sc
342 632 _m
208 269 _l
476 269 _l
342 632 _l
286 729 _m
398 729 _l
676 0 _l
573 0 _l
507 187 _l
178 187 _l
112 0 _l
8 0 _l
286 729 _l
_cl}_d
/a{{613 0 60 -13 522 560 _sc
343 275 _m
270 275 220 266 192 250 _c
164 233 150 205 150 165 _c
150 133 160 107 181 89 _c
202 70 231 61 267 61 _c
317 61 357 78 387 114 _c
417 149 432 196 432 255 _c
432 275 _l
343 275 _l
522 312 _m
522 0 _l
432 0 _l
432 83 _l
411 49 385 25 355 10 _c
325 -5 287 -13 243 -13 _c
187 -13 142 2 109 33 _c
76 64 60 106 60 159 _c
}_e{60 220 80 266 122 298 _c
163 329 224 345 306 345 _c
432 345 _l
432 354 _l
432 395 418 427 391 450 _c
364 472 326 484 277 484 _c
245 484 215 480 185 472 _c
155 464 127 453 100 439 _c
100 522 _l
132 534 164 544 195 550 _c
226 556 256 560 286 560 _c
365 560 424 539 463 498 _c
502 457 522 395 522 312 _c
_cl}_e}_d
/c{{550 0 55 -13 488 560 _sc
488 526 _m
488 442 _l
462 456 437 466 411 473 _c
385 480 360 484 334 484 _c
276 484 230 465 198 428 _c
166 391 150 339 150 273 _c
150 206 166 154 198 117 _c
230 80 276 62 334 62 _c
360 62 385 65 411 72 _c
437 79 462 90 488 104 _c
488 21 _l
462 9 436 0 410 -5 _c
383 -10 354 -13 324 -13 _c
242 -13 176 12 128 64 _c
}_e{79 115 55 185 55 273 _c
55 362 79 432 128 483 _c
177 534 244 560 330 560 _c
358 560 385 557 411 551 _c
437 545 463 537 488 526 _c
_cl}_e}_d
/l{278 0 94 0 184 760 _sc
94 760 _m
184 760 _l
184 0 _l
94 0 _l
94 760 _l
_cl}_d
/u{634 0 85 -13 543 560 _sc
85 216 _m
85 547 _l
175 547 _l
175 219 _l
175 167 185 129 205 103 _c
225 77 255 64 296 64 _c
344 64 383 79 411 110 _c
439 141 453 183 453 237 _c
453 547 _l
543 547 _l
543 0 _l
453 0 _l
453 84 _l
431 50 405 26 377 10 _c
348 -5 315 -13 277 -13 _c
214 -13 166 6 134 45 _c
101 83 85 140 85 216 _c
311 560 _m
311 560 _l
_cl}_d
/v{592 0 30 0 562 547 _sc
30 547 _m
125 547 _l
296 88 _l
467 547 _l
562 547 _l
357 0 _l
235 0 _l
30 547 _l
_cl}_d
end readonly def

/BuildGlyph
 {exch begin
 CharStrings exch
 2 copy known not{pop /.notdef}if
 true 3 1 roll get exec
 end}_d

/BuildChar {
 1 index /Encoding get exch get
 1 index /BuildGlyph get exec
}_d

FontName currentdict end definefont pop
end
%%EndProlog
mpldict begin
-270 108 translate
1152 576 0 0 clipbox
gsave
0 0 m
1152 0 l
1152 576 l
0 576 l
cl
1.000 setgray
fill
grestore
gsave
46.3 310.4 m
376.9 310.4 l
376.9 549.2 l
46.3 549.2 l
cl
1.000 setgray
fill
grestore
0.800 setlinewidth
1 setlinejoin
0 setlinecap
[] 0 setdash
0.000 setgray
gsave
/o {
gsave
newpath
translate
0.8 setlinewidth
1 setlinejoin
0 setlinecap
0 0 m
0 -3.5 l

gsave
0.000 setgray
fill
grestore
stroke
grestore
} bind def
50.7818 310.4 o
grestore
/DejaVuSans findfont
10.000 scalefont
setfont
gsave
47.602131 295.806250 translate
0.000000 rotate
0.000000 0.000000 m /zero glyphshow
grestore
gsave
/o {
gsave
newpath
translate
0.8 setlinewidth
1 setlinejoin
0 setlinecap
0 0 m
0 -3.5 l

gsave
0.000 setgray
fill
grestore
stroke
grestore
} bind def
103.509 310.4 o
grestore
gsave
97.149716 295.806250 translate
0.000000 rotate
0.000000 0.000000 m /one glyphshow
6.362305 0.000000 m /zero glyphshow
grestore
gsave
/o {
gsave
newpath
translate
0.8 setlinewidth
1 setlinejoin
0 setlinecap
0 0 m
0 -3.5 l

gsave
0.000 setgray
fill
grestore
stroke
grestore
} bind def
156.236 310.4 o
grestore
gsave
149.876989 295.806250 translate
0.000000 rotate
0.000000 0.000000 m /two glyphshow
6.362305 0.000000 m /zero glyphshow
grestore
gsave
/o {
gsave
newpath
translate
0.8 setlinewidth
1 setlinejoin
0 setlinecap
0 0 m
0 -3.5 l

gsave
0.000 setgray
fill
grestore
stroke
grestore
} bind def
208.964 310.4 o
grestore
gsave
202.604261 295.806250 translate
0.000000 rotate
0.000000 0.000000 m /three glyphshow
6.362305 0.000000 m /zero glyphshow
grestore
gsave
/o {
gsave
newpath
translate
0.8 setlinewidth
1 setlinejoin
0 setlinecap
0 0 m
0 -3.5 l

gsave
0.000 setgray
fill
grestore
stroke
grestore
} bind def
261.691 310.4 o
grestore
gsave
255.331534 295.806250 translate
0.000000 rotate
0.000000 0.000000 m /four glyphshow
6.362305 0.000000 m /zero glyphshow
grestore
gsave
/o {
gsave
newpath
translate
0.8 setlinewidth
1 setlinejoin
0 setlinecap
0 0 m
0 -3.5 l

gsave
0.000 setgray
fill
grestore
stroke
grestore
} bind def
314.418 310.4 o
grestore
gsave
308.058807 295.806250 translate
0.000000 rotate
0.000000 0.000000 m /five glyphshow
6.362305 0.000000 m /zero glyphshow
grestore
gsave
/o {
gsave
newpath
translate
0.8 setlinewidth
1 setlinejoin
0 setlinecap
0 0 m
0 -3.5 l

gsave
0.000 setgray
fill
grestore
stroke
grestore
} bind def
367.145 310.4 o
grestore
gsave
360.786080 295.806250 translate
0.000000 rotate
0.000000 0.000000 m /six glyphshow
6.362305 0.000000 m /zero glyphshow
grestore
gsave
/o {
gsave
newpath
translate
0.8 setlinewidth
1 setlinejoin
0 setlinecap
0 0 m
-3.5 0 l

gsave
0.000 setgray
fill
grestore
stroke
grestore
} bind def
46.3 329.227 o
grestore
gsave
17.034375 325.429714 translate
0.000000 rotate
0.000000 0.000000 m /zero glyphshow
6.362305 0.000000 m /period glyphshow
9.541016 0.000000 m /eight glyphshow
15.903320 0.000000 m /zero glyphshow
grestore
gsave
/o {
gsave
newpath
translate
0.8 setlinewidth
1 setlinejoin
0 setlinecap
0 0 m
-3.5 0 l

gsave
0.000 setgray
fill
grestore
stroke
grestore
} bind def
46.3 357.619 o
grestore
gsave
17.034375 353.822384 translate
0.000000 rotate
0.000000 0.000000 m /zero glyphshow
6.362305 0.000000 m /period glyphshow
9.541016 0.000000 m /eight glyphshow
15.903320 0.000000 m /two glyphshow
grestore
gsave
/o {
gsave
newpath
translate
0.8 setlinewidth
1 setlinejoin
0 setlinecap
0 0 m
-3.5 0 l

gsave
0.000 setgray
fill
grestore
stroke
grestore
} bind def
46.3 386.012 o
grestore
gsave
17.034375 382.215053 translate
0.000000 rotate
0.000000 0.000000 m /zero glyphshow
6.362305 0.000000 m /period glyphshow
9.541016 0.000000 m /eight glyphshow
15.903320 0.000000 m /four glyphshow
grestore
gsave
/o {
gsave
newpath
translate
0.8 setlinewidth
1 setlinejoin
0 setlinecap
0 0 m
-3.5 0 l

gsave
0.000 setgray
fill
grestore
stroke
grestore
} bind def
46.3 414.405 o
grestore
gsave
17.034375 410.607722 translate
0.000000 rotate
0.000000 0.000000 m /zero glyphshow
6.362305 0.000000 m /period glyphshow
9.541016 0.000000 m /eight glyphshow
15.903320 0.000000 m /six glyphshow
grestore
gsave
/o {
gsave
newpath
translate
0.8 setlinewidth
1 setlinejoin
0 setlinecap
0 0 m
-3.5 0 l

gsave
0.000 setgray
fill
grestore
stroke
grestore
} bind def
46.3 442.797 o
grestore
gsave
17.034375 439.000391 translate
0.000000 rotate
0.000000 0.000000 m /zero glyphshow
6.362305 0.000000 m /period glyphshow
9.541016 0.000000 m /eight glyphshow
15.903320 0.000000 m /eight glyphshow
grestore
gsave
/o {
gsave
newpath
translate
0.8 setlinewidth
1 setlinejoin
0 setlinecap
0 0 m
-3.5 0 l

gsave
0.000 setgray
fill
grestore
stroke
grestore
} bind def
46.3 471.19 o
grestore
gsave
17.034375 467.393061 translate
0.000000 rotate
0.000000 0.000000 m /zero glyphshow
6.362305 0.000000 m /period glyphshow
9.541016 0.000000 m /nine glyphshow
15.903320 0.000000 m /zero glyphshow
grestore
gsave
/o {
gsave
newpath
translate
0.8 setlinewidth
1 setlinejoin
0 setlinecap
0 0 m
-3.5 0 l

gsave
0.000 setgray
fill
grestore
stroke
grestore
} bind def
46.3 499.583 o
grestore
gsave
17.034375 495.785730 translate
0.000000 rotate
0.000000 0.000000 m /zero glyphshow
6.362305 0.000000 m /period glyphshow
9.541016 0.000000 m /nine glyphshow
15.903320 0.000000 m /two glyphshow
grestore
gsave
/o {
gsave
newpath
translate
0.8 setlinewidth
1 setlinejoin
0 setlinecap
0 0 m
-3.5 0 l

gsave
0.000 setgray
fill
grestore
stroke
grestore
} bind def
46.3 527.975 o
grestore
gsave
17.034375 524.178399 translate
0.000000 rotate
0.000000 0.000000 m /zero glyphshow
6.362305 0.000000 m /period glyphshow
9.541016 0.000000 m /nine glyphshow
15.903320 0.000000 m /four glyphshow
grestore
1.500 setlinewidth
2 setlinecap
0.122 0.467 0.706 setrgbcolor
gsave
330.6 238.8 46.3 310.4 clipbox
61.327273 404.227096 m
66.6 408.187507 l
71.872727 410.377774 l
77.145455 414.095068 l
82.418182 417.090453 l
87.690909 417.828373 l
92.963636 420.461741 l
98.236364 424.395057 l
103.509091 426.493186 l
108.781818 429.402188 l
114.054545 432.482993 l
119.327273 434.098918 l
124.6 436.938473 l
129.872727 440.341516 l
135.145455 442.074187 l
140.418182 445.120587 l
145.690909 447.850354 l
150.963636 448.934823 l
156.236364 450.310509 l
161.509091 455.982539 l
166.781818 458.961693 l
172.054545 461.958165 l
177.327273 464.316689 l
182.6 466.512503 l
187.872727 467.650694 l
193.145455 474.386903 l
198.418182 474.46345 l
203.690909 478.790072 l
208.963636 478.614724 l
214.236364 482.398225 l
219.509091 486.593958 l
224.781818 485.563392 l
230.054545 488.08292 l
235.327273 493.122178 l
240.6 496.561531 l
245.872727 501.118127 l
251.145455 498.840544 l
256.418182 500.909652 l
261.690909 499.290887 l
266.963636 505.210704 l
272.236364 508.360289 l
277.509091 510.052714 l
282.781818 514.630763 l
288.054545 513.318568 l
293.327273 514.577355 l
298.6 518.531667 l
303.872727 522.029755 l
309.145455 520.860914 l
314.418182 524.263004 l
319.690909 521.881836 l
324.963636 529.104899 l
330.236364 529.559207 l
335.509091 530.348009 l
340.781818 533.831296 l
346.054545 533.948843 l
351.327273 536.609362 l
356.6 535.002005 l
361.872727 538.345455 l
stroke
grestore
1.000 0.498 0.055 setrgbcolor
gsave
330.6 238.8 46.3 310.4 clipbox
61.327273 388.497177 m
66.6 390.85451 l
71.872727 390.101431 l
77.145455 392.239072 l
82.418182 391.924342 l
87.690909 392.150831 l
92.963636 391.692199 l
98.236364 393.751818 l
103.509091 393.478018 l
108.781818 391.863233 l
114.054545 391.488898 l
119.327273 392.648526 l
124.6 392.001429 l
129.872727 391.452689 l
135.145455 391.43059 l
140.418182 388.779225 l
145.690909 388.867673 l
150.963636 390.798485 l
156.236364 386.645838 l
161.509091 388.352288 l
166.781818 383.576718 l
172.054545 385.46105 l
177.327273 384.219977 l
182.6 379.672349 l
187.872727 380.72999 l
193.145455 372.690819 l
198.418182 370.169973 l
203.690909 372.167601 l
208.963636 370.256035 l
214.236364 366.131245 l
219.509091 368.775244 l
224.781818 362.282694 l
230.054545 366.450592 l
235.327273 365.652225 l
240.6 358.960888 l
245.872727 353.389494 l
251.145455 365.284842 l
256.418182 361.87796 l
261.690909 359.382533 l
266.963636 353.465388 l
272.236364 351.769676 l
277.509091 353.869499 l
282.781818 347.976839 l
288.054545 357.291529 l
293.327273 355.096877 l
298.6 345.551341 l
303.872727 341.745431 l
309.145455 341.125932 l
314.418182 338.689851 l
319.690909 348.398225 l
324.963636 329.663331 l
330.236364 322.456453 l
335.509091 339.887764 l
340.781818 321.254545 l
346.054545 334.248257 l
351.327273 326.061344 l
356.6 336.833636 l
361.872727 325.901411 l
stroke
grestore
0.800 setlinewidth
0 setlinejoin
[] 0 setdash
0.000 setgray
gsave
46.3 310.4 m
46.3 549.2 l
stroke
grestore
gsave
376.9 310.4 m
376.9 549.2 l
stroke
grestore
gsave
46.3 310.4 m
376.9 310.4 l
stroke
grestore
gsave
46.3 549.2 m
376.9 549.2 l
stroke
grestore
/DejaVuSans findfont
12.000 scalefont
setfont
gsave
184.615625 555.200000 translate
0.000000 rotate
0.000000 0.000000 m /zero glyphshow
7.634766 0.000000 m /space glyphshow
11.449219 0.000000 m /hyphen glyphshow
15.779297 0.000000 m /space glyphshow
19.593750 0.000000 m /zero glyphshow
27.228516 0.000000 m /period glyphshow
31.042969 0.000000 m /eight glyphshow
38.677734 0.000000 m /four glyphshow
46.312500 0.000000 m /five glyphshow
grestore
1.000 setlinewidth
0 setlinecap
0.800 setgray
gsave
53.3 511.85625 m
118.815625 511.85625 l
120.148958 511.85625 120.815625 512.522917 120.815625 513.85625 c
120.815625 542.2 l
120.815625 543.533333 120.148958 544.2 118.815625 544.2 c
53.3 544.2 l
51.966667 544.2 51.3 543.533333 51.3 542.2 c
51.3 513.85625 l
51.3 512.522917 51.966667 511.85625 53.3 511.85625 c
cl
gsave
1.000 setgray
fill
grestore
stroke
grestore
1.500 setlinewidth
1 setlinejoin
2 setlinecap
[] 0 setdash
0.122 0.467 0.706 setrgbcolor
gsave
55.3 536.10625 m
75.3 536.10625 l
stroke
grestore
0.000 setgray
/DejaVuSans findfont
10.000 scalefont
setfont
gsave
83.300000 532.606250 translate
0.000000 rotate
0.000000 0.000000 m /a glyphshow
6.127930 0.000000 m /u glyphshow
12.465820 0.000000 m /c glyphshow
grestore
1.000 0.498 0.055 setrgbcolor
gsave
55.3 521.434375 m
75.3 521.434375 l
stroke
grestore
0.000 setgray
gsave
83.300000 517.934375 translate
0.000000 rotate
0.000000 0.000000 m /v glyphshow
5.917969 0.000000 m /a glyphshow
12.045898 0.000000 m /l glyphshow
14.824219 0.000000 m /A glyphshow
21.665039 0.000000 m /u glyphshow
28.002930 0.000000 m /c glyphshow
grestore
gsave
426.7 310.4 m
757.3 310.4 l
757.3 549.2 l
426.7 549.2 l
cl
1.000 setgray
fill
grestore
0.800 setlinewidth
0 setlinecap
gsave
/o {
gsave
newpath
translate
0.8 setlinewidth
1 setlinejoin
0 setlinecap
0 0 m
0 -3.5 l

gsave
0.000 setgray
fill
grestore
stroke
grestore
} bind def
431.182 310.4 o
grestore
gsave
428.002131 295.806250 translate
0.000000 rotate
0.000000 0.000000 m /zero glyphshow
grestore
gsave
/o {
gsave
newpath
translate
0.8 setlinewidth
1 setlinejoin
0 setlinecap
0 0 m
0 -3.5 l

gsave
0.000 setgray
fill
grestore
stroke
grestore
} bind def
483.909 310.4 o
grestore
gsave
477.549716 295.806250 translate
0.000000 rotate
0.000000 0.000000 m /one glyphshow
6.362305 0.000000 m /zero glyphshow
grestore
gsave
/o {
gsave
newpath
translate
0.8 setlinewidth
1 setlinejoin
0 setlinecap
0 0 m
0 -3.5 l

gsave
0.000 setgray
fill
grestore
stroke
grestore
} bind def
536.636 310.4 o
grestore
gsave
530.276989 295.806250 translate
0.000000 rotate
0.000000 0.000000 m /two glyphshow
6.362305 0.000000 m /zero glyphshow
grestore
gsave
/o {
gsave
newpath
translate
0.8 setlinewidth
1 setlinejoin
0 setlinecap
0 0 m
0 -3.5 l

gsave
0.000 setgray
fill
grestore
stroke
grestore
} bind def
589.364 310.4 o
grestore
gsave
583.004261 295.806250 translate
0.000000 rotate
0.000000 0.000000 m /three glyphshow
6.362305 0.000000 m /zero glyphshow
grestore
gsave
/o {
gsave
newpath
translate
0.8 setlinewidth
1 setlinejoin
0 setlinecap
0 0 m
0 -3.5 l

gsave
0.000 setgray
fill
grestore
stroke
grestore
} bind def
642.091 310.4 o
grestore
gsave
635.731534 295.806250 translate
0.000000 rotate
0.000000 0.000000 m /four glyphshow
6.362305 0.000000 m /zero glyphshow
grestore
gsave
/o {
gsave
newpath
translate
0.8 setlinewidth
1 setlinejoin
0 setlinecap
0 0 m
0 -3.5 l

gsave
0.000 setgray
fill
grestore
stroke
grestore
} bind def
694.818 310.4 o
grestore
gsave
688.458807 295.806250 translate
0.000000 rotate
0.000000 0.000000 m /five glyphshow
6.362305 0.000000 m /zero glyphshow
grestore
gsave
/o {
gsave
newpath
translate
0.8 setlinewidth
1 setlinejoin
0 setlinecap
0 0 m
0 -3.5 l

gsave
0.000 setgray
fill
grestore
stroke
grestore
} bind def
747.545 310.4 o
grestore
gsave
741.186080 295.806250 translate
0.000000 rotate
0.000000 0.000000 m /six glyphshow
6.362305 0.000000 m /zero glyphshow
grestore
gsave
/o {
gsave
newpath
translate
0.8 setlinewidth
1 setlinejoin
0 setlinecap
0 0 m
-3.5 0 l

gsave
0.000 setgray
fill
grestore
stroke
grestore
} bind def
426.7 323.511 o
grestore
gsave
397.434375 319.713906 translate
0.000000 rotate
0.000000 0.000000 m /zero glyphshow
6.362305 0.000000 m /period glyphshow
9.541016 0.000000 m /eight glyphshow
15.903320 0.000000 m /four glyphshow
grestore
gsave
/o {
gsave
newpath
translate
0.8 setlinewidth
1 setlinejoin
0 setlinecap
0 0 m
-3.5 0 l

gsave
0.000 setgray
fill
grestore
stroke
grestore
} bind def
426.7 359.509 o
grestore
gsave
397.434375 355.711815 translate
0.000000 rotate
0.000000 0.000000 m /zero glyphshow
6.362305 0.000000 m /period glyphshow
9.541016 0.000000 m /eight glyphshow
15.903320 0.000000 m /five glyphshow
grestore
gsave
/o {
gsave
newpath
translate
0.8 setlinewidth
1 setlinejoin
0 setlinecap
0 0 m
-3.5 0 l

gsave
0.000 setgray
fill
grestore
stroke
grestore
} bind def
426.7 395.507 o
grestore
gsave
397.434375 391.709723 translate
0.000000 rotate
0.000000 0.000000 m /zero glyphshow
6.362305 0.000000 m /period glyphshow
9.541016 0.000000 m /eight glyphshow
15.903320 0.000000 m /six glyphshow
grestore
gsave
/o {
gsave
newpath
translate
0.8 setlinewidth
1 setlinejoin
0 setlinecap
0 0 m
-3.5 0 l

gsave
0.000 setgray
fill
grestore
stroke
grestore
} bind def
426.7 431.505 o
grestore
gsave
397.434375 427.707631 translate
0.000000 rotate
0.000000 0.000000 m /zero glyphshow
6.362305 0.000000 m /period glyphshow
9.541016 0.000000 m /eight glyphshow
15.903320 0.000000 m /seven glyphshow
grestore
gsave
/o {
gsave
newpath
translate
0.8 setlinewidth
1 setlinejoin
0 setlinecap
0 0 m
-3.5 0 l

gsave
0.000 setgray
fill
grestore
stroke
grestore
} bind def
426.7 467.502 o
grestore
gsave
397.434375 463.705539 translate
0.000000 rotate
0.000000 0.000000 m /zero glyphshow
6.362305 0.000000 m /period glyphshow
9.541016 0.000000 m /eight glyphshow
15.903320 0.000000 m /eight glyphshow
grestore
gsave
/o {
gsave
newpath
translate
0.8 setlinewidth
1 setlinejoin
0 setlinecap
0 0 m
-3.5 0 l

gsave
0.000 setgray
fill
grestore
stroke
grestore
} bind def
426.7 503.5 o
grestore
gsave
397.434375 499.703447 translate
0.000000 rotate
0.000000 0.000000 m /zero glyphshow
6.362305 0.000000 m /period glyphshow
9.541016 0.000000 m /eight glyphshow
15.903320 0.000000 m /nine glyphshow
grestore
gsave
/o {
gsave
newpath
translate
0.8 setlinewidth
1 setlinejoin
0 setlinecap
0 0 m
-3.5 0 l

gsave
0.000 setgray
fill
grestore
stroke
grestore
} bind def
426.7 539.498 o
grestore
gsave
397.434375 535.701356 translate
0.000000 rotate
0.000000 0.000000 m /zero glyphshow
6.362305 0.000000 m /period glyphshow
9.541016 0.000000 m /nine glyphshow
15.903320 0.000000 m /zero glyphshow
grestore
1.500 setlinewidth
2 setlinecap
0.122 0.467 0.706 setrgbcolor
gsave
330.6 238.8 426.7 310.4 clipbox
441.727273 367.285369 m
447 373.458889 l
452.272727 380.100409 l
457.545455 385.380991 l
462.818182 390.948812 l
468.090909 393.017671 l
473.363636 398.598518 l
478.636364 404.12847 l
483.909091 407.607977 l
489.181818 411.20817 l
494.454545 417.515521 l
499.727273 420.605181 l
505 424.826684 l
510.272727 426.202509 l
515.545455 429.141589 l
520.818182 432.585476 l
526.090909 437.215458 l
531.363636 437.684257 l
536.636364 440.277569 l
541.909091 445.431859 l
547.181818 447.83177 l
552.454545 450.997312 l
557.727273 454.016841 l
563 454.82266 l
568.272727 458.820095 l
573.545455 461.58257 l
578.818182 463.941713 l
584.090909 467.96834 l
589.363636 468.192481 l
594.636364 473.290368 l
599.909091 475.832134 l
605.181818 477.895 l
610.454545 481.422574 l
615.727273 482.738563 l
621 484.504524 l
626.272727 490.011398 l
631.545455 490.807502 l
636.818182 494.703899 l
642.090909 497.384571 l
647.363636 497.91724 l
652.636364 500.096491 l
657.909091 501.149045 l
663.181818 505.467092 l
668.454545 505.274246 l
673.727273 509.205225 l
679 510.059158 l
684.272727 515.176764 l
689.545455 515.17993 l
694.818182 519.878713 l
700.090909 521.576551 l
705.363636 522.366106 l
710.636364 523.768634 l
715.909091 527.677814 l
721.181818 529.875261 l
726.454545 532.615044 l
731.727273 534.163318 l
737 537.678591 l
742.272727 538.345455 l
stroke
grestore
1.000 0.498 0.055 setrgbcolor
gsave
330.6 238.8 426.7 310.4 clipbox
441.727273 330.358835 m
447 334.924003 l
452.272727 336.667461 l
457.545455 335.278377 l
462.818182 338.893416 l
468.090909 336.434369 l
473.363636 340.037832 l
478.636364 341.444149 l
483.909091 342.616583 l
489.181818 343.608542 l
494.454545 343.878335 l
499.727273 342.75023 l
505 344.067229 l
510.272727 343.262192 l
515.545455 343.432539 l
520.818182 344.331629 l
526.090909 345.34003 l
531.363636 344.443702 l
536.636364 342.758648 l
541.909091 343.354271 l
547.181818 346.006291 l
552.454545 345.368443 l
557.727273 343.179188 l
563 344.785186 l
568.272727 344.71902 l
573.545455 340.768417 l
578.818182 341.42639 l
584.090909 339.490749 l
589.363636 340.629509 l
594.636364 341.86824 l
599.909091 339.791322 l
605.181818 339.636366 l
610.454545 341.465853 l
615.727273 337.730847 l
621 338.799758 l
626.272727 335.456617 l
631.545455 335.510417 l
636.818182 334.661971 l
642.090909 333.958879 l
647.363636 334.371789 l
652.636364 334.911375 l
657.909091 334.59107 l
663.181818 332.972971 l
668.454545 333.625419 l
673.727273 331.799616 l
679 333.568593 l
684.272727 330.236106 l
689.545455 333.149237 l
694.818182 330.453677 l
700.090909 329.802281 l
705.363636 325.490332 l
710.636364 327.168545 l
715.909091 325.417457 l
721.181818 323.136123 l
726.454545 322.963672 l
731.727273 321.254545 l
737 322.162317 l
742.272727 324.06902 l
stroke
grestore
0.800 setlinewidth
0 setlinejoin
[] 0 setdash
0.000 setgray
gsave
426.7 310.4 m
426.7 549.2 l
stroke
grestore
gsave
757.3 310.4 m
757.3 549.2 l
stroke
grestore
gsave
426.7 310.4 m
757.3 310.4 l
stroke
grestore
gsave
426.7 549.2 m
757.3 549.2 l
stroke
grestore
/DejaVuSans findfont
12.000 scalefont
setfont
gsave
559.289062 555.200000 translate
0.000000 rotate
0.000000 0.000000 m /zero glyphshow
7.634766 0.000000 m /period glyphshow
11.449219 0.000000 m /two glyphshow
19.083984 0.000000 m /space glyphshow
22.898438 0.000000 m /hyphen glyphshow
27.228516 0.000000 m /space glyphshow
31.042969 0.000000 m /zero glyphshow
38.677734 0.000000 m /period glyphshow
42.492188 0.000000 m /eight glyphshow
50.126953 0.000000 m /four glyphshow
57.761719 0.000000 m /six glyphshow
grestore
1.000 setlinewidth
0 setlinecap
0.800 setgray
gsave
433.7 511.85625 m
499.215625 511.85625 l
500.548958 511.85625 501.215625 512.522917 501.215625 513.85625 c
501.215625 542.2 l
501.215625 543.533333 500.548958 544.2 499.215625 544.2 c
433.7 544.2 l
432.366667 544.2 431.7 543.533333 431.7 542.2 c
431.7 513.85625 l
431.7 512.522917 432.366667 511.85625 433.7 511.85625 c
cl
gsave
1.000 setgray
fill
grestore
stroke
grestore
1.500 setlinewidth
1 setlinejoin
2 setlinecap
[] 0 setdash
0.122 0.467 0.706 setrgbcolor
gsave
435.7 536.10625 m
455.7 536.10625 l
stroke
grestore
0.000 setgray
/DejaVuSans findfont
10.000 scalefont
setfont
gsave
463.700000 532.606250 translate
0.000000 rotate
0.000000 0.000000 m /a glyphshow
6.127930 0.000000 m /u glyphshow
12.465820 0.000000 m /c glyphshow
grestore
1.000 0.498 0.055 setrgbcolor
gsave
435.7 521.434375 m
455.7 521.434375 l
stroke
grestore
0.000 setgray
gsave
463.700000 517.934375 translate
0.000000 rotate
0.000000 0.000000 m /v glyphshow
5.917969 0.000000 m /a glyphshow
12.045898 0.000000 m /l glyphshow
14.824219 0.000000 m /A glyphshow
21.665039 0.000000 m /u glyphshow
28.002930 0.000000 m /c glyphshow
grestore
gsave
807.1 310.4 m
1137.7 310.4 l
1137.7 549.2 l
807.1 549.2 l
cl
1.000 setgray
fill
grestore
0.800 setlinewidth
0 setlinecap
gsave
/o {
gsave
newpath
translate
0.8 setlinewidth
1 setlinejoin
0 setlinecap
0 0 m
0 -3.5 l

gsave
0.000 setgray
fill
grestore
stroke
grestore
} bind def
811.582 310.4 o
grestore
gsave
808.402131 295.806250 translate
0.000000 rotate
0.000000 0.000000 m /zero glyphshow
grestore
gsave
/o {
gsave
newpath
translate
0.8 setlinewidth
1 setlinejoin
0 setlinecap
0 0 m
0 -3.5 l

gsave
0.000 setgray
fill
grestore
stroke
grestore
} bind def
864.309 310.4 o
grestore
gsave
857.949716 295.806250 translate
0.000000 rotate
0.000000 0.000000 m /one glyphshow
6.362305 0.000000 m /zero glyphshow
grestore
gsave
/o {
gsave
newpath
translate
0.8 setlinewidth
1 setlinejoin
0 setlinecap
0 0 m
0 -3.5 l

gsave
0.000 setgray
fill
grestore
stroke
grestore
} bind def
917.036 310.4 o
grestore
gsave
910.676989 295.806250 translate
0.000000 rotate
0.000000 0.000000 m /two glyphshow
6.362305 0.000000 m /zero glyphshow
grestore
gsave
/o {
gsave
newpath
translate
0.8 setlinewidth
1 setlinejoin
0 setlinecap
0 0 m
0 -3.5 l

gsave
0.000 setgray
fill
grestore
stroke
grestore
} bind def
969.764 310.4 o
grestore
gsave
963.404261 295.806250 translate
0.000000 rotate
0.000000 0.000000 m /three glyphshow
6.362305 0.000000 m /zero glyphshow
grestore
gsave
/o {
gsave
newpath
translate
0.8 setlinewidth
1 setlinejoin
0 setlinecap
0 0 m
0 -3.5 l

gsave
0.000 setgray
fill
grestore
stroke
grestore
} bind def
1022.49 310.4 o
grestore
gsave
1016.131534 295.806250 translate
0.000000 rotate
0.000000 0.000000 m /four glyphshow
6.362305 0.000000 m /zero glyphshow
grestore
gsave
/o {
gsave
newpath
translate
0.8 setlinewidth
1 setlinejoin
0 setlinecap
0 0 m
0 -3.5 l

gsave
0.000 setgray
fill
grestore
stroke
grestore
} bind def
1075.22 310.4 o
grestore
gsave
1068.858807 295.806250 translate
0.000000 rotate
0.000000 0.000000 m /five glyphshow
6.362305 0.000000 m /zero glyphshow
grestore
gsave
/o {
gsave
newpath
translate
0.8 setlinewidth
1 setlinejoin
0 setlinecap
0 0 m
0 -3.5 l

gsave
0.000 setgray
fill
grestore
stroke
grestore
} bind def
1127.95 310.4 o
grestore
gsave
1121.586080 295.806250 translate
0.000000 rotate
0.000000 0.000000 m /six glyphshow
6.362305 0.000000 m /zero glyphshow
grestore
gsave
/o {
gsave
newpath
translate
0.8 setlinewidth
1 setlinejoin
0 setlinecap
0 0 m
-3.5 0 l

gsave
0.000 setgray
fill
grestore
stroke
grestore
} bind def
807.1 332.271 o
grestore
gsave
771.475000 328.474337 translate
0.000000 rotate
0.000000 0.000000 m /zero glyphshow
6.362305 0.000000 m /period glyphshow
9.541016 0.000000 m /eight glyphshow
15.903320 0.000000 m /four glyphshow
22.265625 0.000000 m /zero glyphshow
grestore
gsave
/o {
gsave
newpath
translate
0.8 setlinewidth
1 setlinejoin
0 setlinecap
0 0 m
-3.5 0 l

gsave
0.000 setgray
fill
grestore
stroke
grestore
} bind def
807.1 359.449 o
grestore
gsave
771.475000 355.652007 translate
0.000000 rotate
0.000000 0.000000 m /zero glyphshow
6.362305 0.000000 m /period glyphshow
9.541016 0.000000 m /eight glyphshow
15.903320 0.000000 m /four glyphshow
22.265625 0.000000 m /five glyphshow
grestore
gsave
/o {
gsave
newpath
translate
0.8 setlinewidth
1 setlinejoin
0 setlinecap
0 0 m
-3.5 0 l

gsave
0.000 setgray
fill
grestore
stroke
grestore
} bind def
807.1 386.627 o
grestore
gsave
771.475000 382.829677 translate
0.000000 rotate
0.000000 0.000000 m /zero glyphshow
6.362305 0.000000 m /period glyphshow
9.541016 0.000000 m /eight glyphshow
15.903320 0.000000 m /five glyphshow
22.265625 0.000000 m /zero glyphshow
grestore
gsave
/o {
gsave
newpath
translate
0.8 setlinewidth
1 setlinejoin
0 setlinecap
0 0 m
-3.5 0 l

gsave
0.000 setgray
fill
grestore
stroke
grestore
} bind def
807.1 413.804 o
grestore
gsave
771.475000 410.007347 translate
0.000000 rotate
0.000000 0.000000 m /zero glyphshow
6.362305 0.000000 m /period glyphshow
9.541016 0.000000 m /eight glyphshow
15.903320 0.000000 m /five glyphshow
22.265625 0.000000 m /five glyphshow
grestore
gsave
/o {
gsave
newpath
translate
0.8 setlinewidth
1 setlinejoin
0 setlinecap
0 0 m
-3.5 0 l

gsave
0.000 setgray
fill
grestore
stroke
grestore
} bind def
807.1 440.982 o
grestore
gsave
771.475000 437.185017 translate
0.000000 rotate
0.000000 0.000000 m /zero glyphshow
6.362305 0.000000 m /period glyphshow
9.541016 0.000000 m /eight glyphshow
15.903320 0.000000 m /six glyphshow
22.265625 0.000000 m /zero glyphshow
grestore
gsave
/o {
gsave
newpath
translate
0.8 setlinewidth
1 setlinejoin
0 setlinecap
0 0 m
-3.5 0 l

gsave
0.000 setgray
fill
grestore
stroke
grestore
} bind def
807.1 468.16 o
grestore
gsave
771.475000 464.362687 translate
0.000000 rotate
0.000000 0.000000 m /zero glyphshow
6.362305 0.000000 m /period glyphshow
9.541016 0.000000 m /eight glyphshow
15.903320 0.000000 m /six glyphshow
22.265625 0.000000 m /five glyphshow
grestore
gsave
/o {
gsave
newpath
translate
0.8 setlinewidth
1 setlinejoin
0 setlinecap
0 0 m
-3.5 0 l

gsave
0.000 setgray
fill
grestore
stroke
grestore
} bind def
807.1 495.337 o
grestore
gsave
771.475000 491.540357 translate
0.000000 rotate
0.000000 0.000000 m /zero glyphshow
6.362305 0.000000 m /period glyphshow
9.541016 0.000000 m /eight glyphshow
15.903320 0.000000 m /seven glyphshow
22.265625 0.000000 m /zero glyphshow
grestore
gsave
/o {
gsave
newpath
translate
0.8 setlinewidth
1 setlinejoin
0 setlinecap
0 0 m
-3.5 0 l

gsave
0.000 setgray
fill
grestore
stroke
grestore
} bind def
807.1 522.515 o
grestore
gsave
771.475000 518.718027 translate
0.000000 rotate
0.000000 0.000000 m /zero glyphshow
6.362305 0.000000 m /period glyphshow
9.541016 0.000000 m /eight glyphshow
15.903320 0.000000 m /seven glyphshow
22.265625 0.000000 m /five glyphshow
grestore
gsave
/o {
gsave
newpath
translate
0.8 setlinewidth
1 setlinejoin
0 setlinecap
0 0 m
-3.5 0 l

gsave
0.000 setgray
fill
grestore
stroke
grestore
} bind def
807.1 549.693 o
grestore
gsave
771.475000 545.895697 translate
0.000000 rotate
0.000000 0.000000 m /zero glyphshow
6.362305 0.000000 m /period glyphshow
9.541016 0.000000 m /eight glyphshow
15.903320 0.000000 m /eight glyphshow
22.265625 0.000000 m /zero glyphshow
grestore
1.500 setlinewidth
2 setlinecap
0.122 0.467 0.706 setrgbcolor
gsave
330.6 238.8 807.1 310.4 clipbox
822.127273 369.351157 m
827.4 380.748928 l
832.672727 395.639467 l
837.945455 402.819054 l
843.218182 407.599546 l
848.490909 414.762822 l
853.763636 419.610967 l
859.036364 423.821379 l
864.309091 426.643463 l
869.581818 431.976448 l
874.854545 435.92884 l
880.127273 435.064689 l
885.4 443.511895 l
890.672727 446.952007 l
895.945455 450.276775 l
901.218182 453.665583 l
906.490909 455.862379 l
911.763636 458.572914 l
917.036364 461.372667 l
922.309091 460.612949 l
927.581818 466.086018 l
932.854545 466.594211 l
938.127273 468.055992 l
943.4 470.230201 l
948.672727 475.376832 l
953.945455 475.284476 l
959.218182 479.237124 l
964.490909 481.671249 l
969.763636 483.816119 l
975.036364 487.563366 l
980.309091 488.584351 l
985.581818 491.754913 l
990.854545 493.790533 l
996.127273 495.30132 l
1001.4 496.264177 l
1006.672727 497.756354 l
1011.945455 499.396899 l
1017.218182 504.02428 l
1022.490909 504.392791 l
1027.763636 505.582285 l
1033.036364 507.627173 l
1038.309091 508.847319 l
1043.581818 509.707712 l
1048.854545 513.598729 l
1054.127273 513.0986 l
1059.4 515.739622 l
1064.672727 517.629429 l
1069.945455 521.013712 l
1075.218182 519.60214 l
1080.490909 524.10666 l
1085.763636 525.361472 l
1091.036364 528.119736 l
1096.309091 528.334879 l
1101.581818 529.711421 l
1106.854545 532.915699 l
1112.127273 533.635607 l
1117.4 535.248164 l
1122.672727 538.345455 l
stroke
grestore
1.000 0.498 0.055 setrgbcolor
gsave
330.6 238.8 807.1 310.4 clipbox
822.127273 321.254545 m
827.4 327.188806 l
832.672727 339.243437 l
837.945455 344.626519 l
843.218182 345.34176 l
848.490909 346.32991 l
853.763636 349.445511 l
859.036364 351.050584 l
864.309091 351.016818 l
869.581818 353.955446 l
874.854545 355.108254 l
880.127273 351.201338 l
885.4 353.230273 l
890.672727 357.632951 l
895.945455 357.538605 l
901.218182 355.87474 l
906.490909 359.183998 l
911.763636 358.844949 l
917.036364 357.799199 l
922.309091 359.975908 l
927.581818 361.362893 l
932.854545 359.847002 l
938.127273 358.631429 l
943.4 360.292315 l
948.672727 359.168506 l
953.945455 361.647123 l
959.218182 362.725646 l
964.490909 360.38825 l
969.763636 361.401823 l
975.036364 360.827008 l
980.309091 360.088528 l
985.581818 361.743058 l
990.854545 360.58151 l
996.127273 360.743189 l
1001.4 362.252724 l
1006.672727 360.979551 l
1011.945455 359.901822 l
1017.218182 358.329919 l
1022.490909 357.697504 l
1027.763636 357.514175 l
1033.036364 357.421815 l
1038.309091 358.637785 l
1043.581818 359.618784 l
1048.854545 359.061448 l
1054.127273 359.91215 l
1059.4 357.087929 l
1064.672727 357.789267 l
1069.945455 357.688764 l
1075.218182 359.137123 l
1080.490909 360.401955 l
1085.763636 359.313898 l
1091.036364 357.43691 l
1096.309091 359.277749 l
1101.581818 358.031786 l
1106.854545 357.187042 l
1112.127273 356.498218 l
1117.4 356.41996 l
1122.672727 356.482526 l
stroke
grestore
0.800 setlinewidth
0 setlinejoin
[] 0 setdash
0.000 setgray
gsave
807.1 310.4 m
807.1 549.2 l
stroke
grestore
gsave
1137.7 310.4 m
1137.7 549.2 l
stroke
grestore
gsave
807.1 310.4 m
1137.7 310.4 l
stroke
grestore
gsave
807.1 549.2 m
1137.7 549.2 l
stroke
grestore
/DejaVuSans findfont
12.000 scalefont
setfont
gsave
939.689063 555.200000 translate
0.000000 rotate
0.000000 0.000000 m /zero glyphshow
7.634766 0.000000 m /period glyphshow
11.449219 0.000000 m /four glyphshow
19.083984 0.000000 m /space glyphshow
22.898438 0.000000 m /hyphen glyphshow
27.228516 0.000000 m /space glyphshow
31.042969 0.000000 m /zero glyphshow
38.677734 0.000000 m /period glyphshow
42.492188 0.000000 m /eight glyphshow
50.126953 0.000000 m /four glyphshow
57.761719 0.000000 m /six glyphshow
grestore
1.000 setlinewidth
0 setlinecap
0.800 setgray
gsave
814.1 511.85625 m
879.615625 511.85625 l
880.948958 511.85625 881.615625 512.522917 881.615625 513.85625 c
881.615625 542.2 l
881.615625 543.533333 880.948958 544.2 879.615625 544.2 c
814.1 544.2 l
812.766667 544.2 812.1 543.533333 812.1 542.2 c
812.1 513.85625 l
812.1 512.522917 812.766667 511.85625 814.1 511.85625 c
cl
gsave
1.000 setgray
fill
grestore
stroke
grestore
1.500 setlinewidth
1 setlinejoin
2 setlinecap
[] 0 setdash
0.122 0.467 0.706 setrgbcolor
gsave
816.1 536.10625 m
836.1 536.10625 l
stroke
grestore
0.000 setgray
/DejaVuSans findfont
10.000 scalefont
setfont
gsave
844.100000 532.606250 translate
0.000000 rotate
0.000000 0.000000 m /a glyphshow
6.127930 0.000000 m /u glyphshow
12.465820 0.000000 m /c glyphshow
grestore
1.000 0.498 0.055 setrgbcolor
gsave
816.1 521.434375 m
836.1 521.434375 l
stroke
grestore
0.000 setgray
gsave
844.100000 517.934375 translate
0.000000 rotate
0.000000 0.000000 m /v glyphshow
5.917969 0.000000 m /a glyphshow
12.045898 0.000000 m /l glyphshow
14.824219 0.000000 m /A glyphshow
21.665039 0.000000 m /u glyphshow
28.002930 0.000000 m /c glyphshow
grestore
gsave
46.3 27.8 m
376.9 27.8 l
376.9 266.6 l
46.3 266.6 l
cl
1.000 setgray
fill
grestore
0.800 setlinewidth
0 setlinecap
gsave
/o {
gsave
newpath
translate
0.8 setlinewidth
1 setlinejoin
0 setlinecap
0 0 m
0 -3.5 l

gsave
0.000 setgray
fill
grestore
stroke
grestore
} bind def
50.7818 27.8 o
grestore
gsave
47.602131 13.206250 translate
0.000000 rotate
0.000000 0.000000 m /zero glyphshow
grestore
gsave
/o {
gsave
newpath
translate
0.8 setlinewidth
1 setlinejoin
0 setlinecap
0 0 m
0 -3.5 l

gsave
0.000 setgray
fill
grestore
stroke
grestore
} bind def
103.509 27.8 o
grestore
gsave
97.149716 13.206250 translate
0.000000 rotate
0.000000 0.000000 m /one glyphshow
6.362305 0.000000 m /zero glyphshow
grestore
gsave
/o {
gsave
newpath
translate
0.8 setlinewidth
1 setlinejoin
0 setlinecap
0 0 m
0 -3.5 l

gsave
0.000 setgray
fill
grestore
stroke
grestore
} bind def
156.236 27.8 o
grestore
gsave
149.876989 13.206250 translate
0.000000 rotate
0.000000 0.000000 m /two glyphshow
6.362305 0.000000 m /zero glyphshow
grestore
gsave
/o {
gsave
newpath
translate
0.8 setlinewidth
1 setlinejoin
0 setlinecap
0 0 m
0 -3.5 l

gsave
0.000 setgray
fill
grestore
stroke
grestore
} bind def
208.964 27.8 o
grestore
gsave
202.604261 13.206250 translate
0.000000 rotate
0.000000 0.000000 m /three glyphshow
6.362305 0.000000 m /zero glyphshow
grestore
gsave
/o {
gsave
newpath
translate
0.8 setlinewidth
1 setlinejoin
0 setlinecap
0 0 m
0 -3.5 l

gsave
0.000 setgray
fill
grestore
stroke
grestore
} bind def
261.691 27.8 o
grestore
gsave
255.331534 13.206250 translate
0.000000 rotate
0.000000 0.000000 m /four glyphshow
6.362305 0.000000 m /zero glyphshow
grestore
gsave
/o {
gsave
newpath
translate
0.8 setlinewidth
1 setlinejoin
0 setlinecap
0 0 m
0 -3.5 l

gsave
0.000 setgray
fill
grestore
stroke
grestore
} bind def
314.418 27.8 o
grestore
gsave
308.058807 13.206250 translate
0.000000 rotate
0.000000 0.000000 m /five glyphshow
6.362305 0.000000 m /zero glyphshow
grestore
gsave
/o {
gsave
newpath
translate
0.8 setlinewidth
1 setlinejoin
0 setlinecap
0 0 m
0 -3.5 l

gsave
0.000 setgray
fill
grestore
stroke
grestore
} bind def
367.145 27.8 o
grestore
gsave
360.786080 13.206250 translate
0.000000 rotate
0.000000 0.000000 m /six glyphshow
6.362305 0.000000 m /zero glyphshow
grestore
gsave
/o {
gsave
newpath
translate
0.8 setlinewidth
1 setlinejoin
0 setlinecap
0 0 m
-3.5 0 l

gsave
0.000 setgray
fill
grestore
stroke
grestore
} bind def
46.3 37.4386 o
grestore
gsave
10.675000 33.641752 translate
0.000000 rotate
0.000000 0.000000 m /zero glyphshow
6.362305 0.000000 m /period glyphshow
9.541016 0.000000 m /eight glyphshow
15.903320 0.000000 m /three glyphshow
22.265625 0.000000 m /five glyphshow
grestore
gsave
/o {
gsave
newpath
translate
0.8 setlinewidth
1 setlinejoin
0 setlinecap
0 0 m
-3.5 0 l

gsave
0.000 setgray
fill
grestore
stroke
grestore
} bind def
46.3 68.4197 o
grestore
gsave
10.675000 64.622837 translate
0.000000 rotate
0.000000 0.000000 m /zero glyphshow
6.362305 0.000000 m /period glyphshow
9.541016 0.000000 m /eight glyphshow
15.903320 0.000000 m /four glyphshow
22.265625 0.000000 m /zero glyphshow
grestore
gsave
/o {
gsave
newpath
translate
0.8 setlinewidth
1 setlinejoin
0 setlinecap
0 0 m
-3.5 0 l

gsave
0.000 setgray
fill
grestore
stroke
grestore
} bind def
46.3 99.4008 o
grestore
gsave
10.675000 95.603923 translate
0.000000 rotate
0.000000 0.000000 m /zero glyphshow
6.362305 0.000000 m /period glyphshow
9.541016 0.000000 m /eight glyphshow
15.903320 0.000000 m /four glyphshow
22.265625 0.000000 m /five glyphshow
grestore
gsave
/o {
gsave
newpath
translate
0.8 setlinewidth
1 setlinejoin
0 setlinecap
0 0 m
-3.5 0 l

gsave
0.000 setgray
fill
grestore
stroke
grestore
} bind def
46.3 130.382 o
grestore
gsave
10.675000 126.585008 translate
0.000000 rotate
0.000000 0.000000 m /zero glyphshow
6.362305 0.000000 m /period glyphshow
9.541016 0.000000 m /eight glyphshow
15.903320 0.000000 m /five glyphshow
22.265625 0.000000 m /zero glyphshow
grestore
gsave
/o {
gsave
newpath
translate
0.8 setlinewidth
1 setlinejoin
0 setlinecap
0 0 m
-3.5 0 l

gsave
0.000 setgray
fill
grestore
stroke
grestore
} bind def
46.3 161.363 o
grestore
gsave
10.675000 157.566094 translate
0.000000 rotate
0.000000 0.000000 m /zero glyphshow
6.362305 0.000000 m /period glyphshow
9.541016 0.000000 m /eight glyphshow
15.903320 0.000000 m /five glyphshow
22.265625 0.000000 m /five glyphshow
grestore
gsave
/o {
gsave
newpath
translate
0.8 setlinewidth
1 setlinejoin
0 setlinecap
0 0 m
-3.5 0 l

gsave
0.000 setgray
fill
grestore
stroke
grestore
} bind def
46.3 192.344 o
grestore
gsave
10.675000 188.547179 translate
0.000000 rotate
0.000000 0.000000 m /zero glyphshow
6.362305 0.000000 m /period glyphshow
9.541016 0.000000 m /eight glyphshow
15.903320 0.000000 m /six glyphshow
22.265625 0.000000 m /zero glyphshow
grestore
gsave
/o {
gsave
newpath
translate
0.8 setlinewidth
1 setlinejoin
0 setlinecap
0 0 m
-3.5 0 l

gsave
0.000 setgray
fill
grestore
stroke
grestore
} bind def
46.3 223.325 o
grestore
gsave
10.675000 219.528265 translate
0.000000 rotate
0.000000 0.000000 m /zero glyphshow
6.362305 0.000000 m /period glyphshow
9.541016 0.000000 m /eight glyphshow
15.903320 0.000000 m /six glyphshow
22.265625 0.000000 m /five glyphshow
grestore
gsave
/o {
gsave
newpath
translate
0.8 setlinewidth
1 setlinejoin
0 setlinecap
0 0 m
-3.5 0 l

gsave
0.000 setgray
fill
grestore
stroke
grestore
} bind def
46.3 254.306 o
grestore
gsave
10.675000 250.509350 translate
0.000000 rotate
0.000000 0.000000 m /zero glyphshow
6.362305 0.000000 m /period glyphshow
9.541016 0.000000 m /eight glyphshow
15.903320 0.000000 m /seven glyphshow
22.265625 0.000000 m /zero glyphshow
grestore
1.500 setlinewidth
2 setlinecap
0.122 0.467 0.706 setrgbcolor
gsave
330.6 238.8 46.3 27.8 clipbox
61.327273 90.057995 m
66.6 104.915694 l
71.872727 117.804509 l
77.145455 127.148769 l
82.418182 129.154548 l
87.690909 138.772096 l
92.963636 141.317298 l
98.236364 147.688246 l
103.509091 152.268843 l
108.781818 156.895654 l
114.054545 160.751392 l
119.327273 163.404869 l
124.6 169.267966 l
129.872727 170.576215 l
135.145455 173.679391 l
140.418182 176.33815 l
145.690909 178.720793 l
150.963636 180.715258 l
156.236364 182.551739 l
161.509091 186.149039 l
166.781818 187.803994 l
172.054545 191.779737 l
177.327273 193.795 l
182.6 195.408401 l
187.872727 198.341946 l
193.145455 200.725088 l
198.418182 203.441708 l
203.690909 205.770608 l
208.963636 206.661229 l
214.236364 208.87291 l
219.509091 210.589677 l
224.781818 213.21724 l
230.054545 214.594871 l
235.327273 215.829993 l
240.6 216.786711 l
245.872727 218.948393 l
251.145455 221.215564 l
256.418182 223.30828 l
261.690909 225.169844 l
266.963636 226.358337 l
272.236364 227.592877 l
277.509091 231.679641 l
282.781818 232.866304 l
288.054545 232.794425 l
293.327273 235.854424 l
298.6 237.332927 l
303.872727 239.542237 l
309.145455 242.085941 l
314.418182 243.212788 l
319.690909 244.926519 l
324.963636 245.369853 l
330.236364 245.443853 l
335.509091 249.215941 l
340.781818 251.63315 l
346.054545 253.176834 l
351.327273 253.846869 l
356.6 254.296235 l
361.872727 255.745455 l
stroke
grestore
1.000 0.498 0.055 setrgbcolor
gsave
330.6 238.8 46.3 27.8 clipbox
61.327273 38.654545 m
66.6 50.143529 l
71.872727 61.625494 l
77.145455 68.305325 l
82.418182 68.149096 l
87.690909 71.535427 l
92.963636 72.243894 l
98.236364 76.382165 l
103.509091 76.629189 l
108.781818 79.152183 l
114.054545 80.568664 l
119.327273 81.276452 l
124.6 85.116981 l
129.872727 84.072734 l
135.145455 86.384025 l
140.418182 87.141625 l
145.690909 86.988113 l
150.963636 89.159024 l
156.236364 88.749884 l
161.509091 89.685223 l
166.781818 91.812209 l
172.054545 92.690264 l
177.327273 92.359691 l
182.6 93.748776 l
187.872727 94.255276 l
193.145455 94.691361 l
198.418182 94.717852 l
203.690909 95.185635 l
208.963636 95.498094 l
214.236364 94.855741 l
219.509091 96.311619 l
224.781818 96.356903 l
230.054545 96.58287 l
235.327273 97.409302 l
240.6 97.729006 l
245.872727 99.651988 l
251.145455 96.303015 l
256.418182 98.727969 l
261.690909 97.43783 l
266.963636 98.536418 l
272.236364 95.166162 l
277.509091 98.228035 l
282.781818 98.632873 l
288.054545 98.288262 l
293.327273 99.201186 l
298.6 99.743008 l
303.872727 100.076977 l
309.145455 97.91467 l
314.418182 98.586004 l
319.690909 98.827141 l
324.963636 95.887309 l
330.236364 97.308318 l
335.509091 100.433815 l
340.781818 99.492815 l
346.054545 98.647364 l
351.327273 99.33568 l
356.6 103.226021 l
361.872727 102.85424 l
stroke
grestore
0.800 setlinewidth
0 setlinejoin
[] 0 setdash
0.000 setgray
gsave
46.3 27.8 m
46.3 266.6 l
stroke
grestore
gsave
376.9 27.8 m
376.9 266.6 l
stroke
grestore
gsave
46.3 27.8 m
376.9 27.8 l
stroke
grestore
gsave
46.3 266.6 m
376.9 266.6 l
stroke
grestore
/DejaVuSans findfont
12.000 scalefont
setfont
gsave
178.889062 272.600000 translate
0.000000 rotate
0.000000 0.000000 m /zero glyphshow
7.634766 0.000000 m /period glyphshow
11.449219 0.000000 m /five glyphshow
19.083984 0.000000 m /space glyphshow
22.898438 0.000000 m /hyphen glyphshow
27.228516 0.000000 m /space glyphshow
31.042969 0.000000 m /zero glyphshow
38.677734 0.000000 m /period glyphshow
42.492188 0.000000 m /eight glyphshow
50.126953 0.000000 m /four glyphshow
57.761719 0.000000 m /six glyphshow
grestore
1.000 setlinewidth
0 setlinecap
0.800 setgray
gsave
53.3 229.25625 m
118.815625 229.25625 l
120.148958 229.25625 120.815625 229.922917 120.815625 231.25625 c
120.815625 259.6 l
120.815625 260.933333 120.148958 261.6 118.815625 261.6 c
53.3 261.6 l
51.966667 261.6 51.3 260.933333 51.3 259.6 c
51.3 231.25625 l
51.3 229.922917 51.966667 229.25625 53.3 229.25625 c
cl
gsave
1.000 setgray
fill
grestore
stroke
grestore
1.500 setlinewidth
1 setlinejoin
2 setlinecap
[] 0 setdash
0.122 0.467 0.706 setrgbcolor
gsave
55.3 253.50625 m
75.3 253.50625 l
stroke
grestore
0.000 setgray
/DejaVuSans findfont
10.000 scalefont
setfont
gsave
83.300000 250.006250 translate
0.000000 rotate
0.000000 0.000000 m /a glyphshow
6.127930 0.000000 m /u glyphshow
12.465820 0.000000 m /c glyphshow
grestore
1.000 0.498 0.055 setrgbcolor
gsave
55.3 238.834375 m
75.3 238.834375 l
stroke
grestore
0.000 setgray
gsave
83.300000 235.334375 translate
0.000000 rotate
0.000000 0.000000 m /v glyphshow
5.917969 0.000000 m /a glyphshow
12.045898 0.000000 m /l glyphshow
14.824219 0.000000 m /A glyphshow
21.665039 0.000000 m /u glyphshow
28.002930 0.000000 m /c glyphshow
grestore
gsave
426.7 27.8 m
757.3 27.8 l
757.3 266.6 l
426.7 266.6 l
cl
1.000 setgray
fill
grestore
0.800 setlinewidth
0 setlinecap
gsave
/o {
gsave
newpath
translate
0.8 setlinewidth
1 setlinejoin
0 setlinecap
0 0 m
0 -3.5 l

gsave
0.000 setgray
fill
grestore
stroke
grestore
} bind def
431.182 27.8 o
grestore
gsave
428.002131 13.206250 translate
0.000000 rotate
0.000000 0.000000 m /zero glyphshow
grestore
gsave
/o {
gsave
newpath
translate
0.8 setlinewidth
1 setlinejoin
0 setlinecap
0 0 m
0 -3.5 l

gsave
0.000 setgray
fill
grestore
stroke
grestore
} bind def
483.909 27.8 o
grestore
gsave
477.549716 13.206250 translate
0.000000 rotate
0.000000 0.000000 m /one glyphshow
6.362305 0.000000 m /zero glyphshow
grestore
gsave
/o {
gsave
newpath
translate
0.8 setlinewidth
1 setlinejoin
0 setlinecap
0 0 m
0 -3.5 l

gsave
0.000 setgray
fill
grestore
stroke
grestore
} bind def
536.636 27.8 o
grestore
gsave
530.276989 13.206250 translate
0.000000 rotate
0.000000 0.000000 m /two glyphshow
6.362305 0.000000 m /zero glyphshow
grestore
gsave
/o {
gsave
newpath
translate
0.8 setlinewidth
1 setlinejoin
0 setlinecap
0 0 m
0 -3.5 l

gsave
0.000 setgray
fill
grestore
stroke
grestore
} bind def
589.364 27.8 o
grestore
gsave
583.004261 13.206250 translate
0.000000 rotate
0.000000 0.000000 m /three glyphshow
6.362305 0.000000 m /zero glyphshow
grestore
gsave
/o {
gsave
newpath
translate
0.8 setlinewidth
1 setlinejoin
0 setlinecap
0 0 m
0 -3.5 l

gsave
0.000 setgray
fill
grestore
stroke
grestore
} bind def
642.091 27.8 o
grestore
gsave
635.731534 13.206250 translate
0.000000 rotate
0.000000 0.000000 m /four glyphshow
6.362305 0.000000 m /zero glyphshow
grestore
gsave
/o {
gsave
newpath
translate
0.8 setlinewidth
1 setlinejoin
0 setlinecap
0 0 m
0 -3.5 l

gsave
0.000 setgray
fill
grestore
stroke
grestore
} bind def
694.818 27.8 o
grestore
gsave
688.458807 13.206250 translate
0.000000 rotate
0.000000 0.000000 m /five glyphshow
6.362305 0.000000 m /zero glyphshow
grestore
gsave
/o {
gsave
newpath
translate
0.8 setlinewidth
1 setlinejoin
0 setlinecap
0 0 m
0 -3.5 l

gsave
0.000 setgray
fill
grestore
stroke
grestore
} bind def
747.545 27.8 o
grestore
gsave
741.186080 13.206250 translate
0.000000 rotate
0.000000 0.000000 m /six glyphshow
6.362305 0.000000 m /zero glyphshow
grestore
gsave
/o {
gsave
newpath
translate
0.8 setlinewidth
1 setlinejoin
0 setlinecap
0 0 m
-3.5 0 l

gsave
0.000 setgray
fill
grestore
stroke
grestore
} bind def
426.7 61.4164 o
grestore
gsave
391.075000 57.619512 translate
0.000000 rotate
0.000000 0.000000 m /zero glyphshow
6.362305 0.000000 m /period glyphshow
9.541016 0.000000 m /eight glyphshow
15.903320 0.000000 m /three glyphshow
22.265625 0.000000 m /five glyphshow
grestore
gsave
/o {
gsave
newpath
translate
0.8 setlinewidth
1 setlinejoin
0 setlinecap
0 0 m
-3.5 0 l

gsave
0.000 setgray
fill
grestore
stroke
grestore
} bind def
426.7 96.1856 o
grestore
gsave
391.075000 92.388692 translate
0.000000 rotate
0.000000 0.000000 m /zero glyphshow
6.362305 0.000000 m /period glyphshow
9.541016 0.000000 m /eight glyphshow
15.903320 0.000000 m /four glyphshow
22.265625 0.000000 m /zero glyphshow
grestore
gsave
/o {
gsave
newpath
translate
0.8 setlinewidth
1 setlinejoin
0 setlinecap
0 0 m
-3.5 0 l

gsave
0.000 setgray
fill
grestore
stroke
grestore
} bind def
426.7 130.955 o
grestore
gsave
391.075000 127.157873 translate
0.000000 rotate
0.000000 0.000000 m /zero glyphshow
6.362305 0.000000 m /period glyphshow
9.541016 0.000000 m /eight glyphshow
15.903320 0.000000 m /four glyphshow
22.265625 0.000000 m /five glyphshow
grestore
gsave
/o {
gsave
newpath
translate
0.8 setlinewidth
1 setlinejoin
0 setlinecap
0 0 m
-3.5 0 l

gsave
0.000 setgray
fill
grestore
stroke
grestore
} bind def
426.7 165.724 o
grestore
gsave
391.075000 161.927053 translate
0.000000 rotate
0.000000 0.000000 m /zero glyphshow
6.362305 0.000000 m /period glyphshow
9.541016 0.000000 m /eight glyphshow
15.903320 0.000000 m /five glyphshow
22.265625 0.000000 m /zero glyphshow
grestore
gsave
/o {
gsave
newpath
translate
0.8 setlinewidth
1 setlinejoin
0 setlinecap
0 0 m
-3.5 0 l

gsave
0.000 setgray
fill
grestore
stroke
grestore
} bind def
426.7 200.493 o
grestore
gsave
391.075000 196.696233 translate
0.000000 rotate
0.000000 0.000000 m /zero glyphshow
6.362305 0.000000 m /period glyphshow
9.541016 0.000000 m /eight glyphshow
15.903320 0.000000 m /five glyphshow
22.265625 0.000000 m /five glyphshow
grestore
gsave
/o {
gsave
newpath
translate
0.8 setlinewidth
1 setlinejoin
0 setlinecap
0 0 m
-3.5 0 l

gsave
0.000 setgray
fill
grestore
stroke
grestore
} bind def
426.7 235.262 o
grestore
gsave
391.075000 231.465413 translate
0.000000 rotate
0.000000 0.000000 m /zero glyphshow
6.362305 0.000000 m /period glyphshow
9.541016 0.000000 m /eight glyphshow
15.903320 0.000000 m /six glyphshow
22.265625 0.000000 m /zero glyphshow
grestore
1.500 setlinewidth
2 setlinecap
0.122 0.467 0.706 setrgbcolor
gsave
330.6 238.8 426.7 27.8 clipbox
441.727273 81.849006 m
447 101.633825 l
452.272727 115.754008 l
457.545455 123.597127 l
462.818182 131.190776 l
468.090909 139.732685 l
473.363636 147.002264 l
478.636364 154.640121 l
483.909091 158.526903 l
489.181818 164.704532 l
494.454545 165.194138 l
499.727273 168.677069 l
505 169.616367 l
510.272727 173.700149 l
515.545455 178.130127 l
520.818182 179.973664 l
526.090909 183.375835 l
531.363636 185.044312 l
536.636364 188.075218 l
541.909091 191.161488 l
547.181818 193.613298 l
552.454545 196.55756 l
557.727273 200.168075 l
563 202.156374 l
568.272727 203.72117 l
573.545455 206.909442 l
578.818182 207.319874 l
584.090909 209.606147 l
589.363636 211.662323 l
594.636364 214.317388 l
599.909091 216.459086 l
605.181818 216.963303 l
610.454545 219.499607 l
615.727273 221.536176 l
621 223.221833 l
626.272727 225.255881 l
631.545455 228.028679 l
636.818182 226.936029 l
642.090909 231.102719 l
647.363636 232.641139 l
652.636364 232.526581 l
657.909091 233.356828 l
663.181818 235.705189 l
668.454545 236.763994 l
673.727273 236.440391 l
679 239.457058 l
684.272727 241.346064 l
689.545455 242.827485 l
694.818182 244.395642 l
700.090909 245.389512 l
705.363636 245.41514 l
710.636364 249.956316 l
715.909091 250.325201 l
721.181818 250.287015 l
726.454545 251.79878 l
731.727273 253.953175 l
737 254.891912 l
742.272727 255.745455 l
stroke
grestore
1.000 0.498 0.055 setrgbcolor
gsave
330.6 238.8 426.7 27.8 clipbox
441.727273 38.654545 m
447 51.358485 l
452.272727 63.322982 l
457.545455 67.575416 l
462.818182 71.513269 l
468.090909 75.910034 l
473.363636 80.020423 l
478.636364 85.525591 l
483.909091 87.134071 l
489.181818 92.938319 l
494.454545 91.295789 l
499.727273 95.399064 l
505 94.499027 l
510.272727 98.184554 l
515.545455 100.948192 l
520.818182 102.824243 l
526.090909 103.268925 l
531.363636 105.501993 l
536.636364 107.504588 l
541.909091 108.859472 l
547.181818 108.659746 l
552.454545 112.175532 l
557.727273 114.114093 l
563 115.142961 l
568.272727 115.543429 l
573.545455 115.542921 l
578.818182 114.745796 l
584.090909 114.944506 l
589.363636 115.376737 l
594.636364 117.583886 l
599.909091 117.48631 l
605.181818 118.405913 l
610.454545 120.224791 l
615.727273 119.46629 l
621 117.509433 l
626.272727 119.326024 l
631.545455 119.820257 l
636.818182 118.353059 l
642.090909 122.316323 l
647.363636 124.790789 l
652.636364 124.16366 l
657.909091 123.821128 l
663.181818 124.291475 l
668.454545 125.382344 l
673.727273 123.620894 l
679 125.292899 l
684.272727 126.758572 l
689.545455 125.760959 l
694.818182 126.705211 l
700.090909 127.282027 l
705.363636 128.077119 l
710.636364 129.003329 l
715.909091 126.402826 l
721.181818 126.974053 l
726.454545 126.993365 l
731.727273 128.352822 l
737 127.069596 l
742.272727 128.922524 l
stroke
grestore
0.800 setlinewidth
0 setlinejoin
[] 0 setdash
0.000 setgray
gsave
426.7 27.8 m
426.7 266.6 l
stroke
grestore
gsave
757.3 27.8 m
757.3 266.6 l
stroke
grestore
gsave
426.7 27.8 m
757.3 27.8 l
stroke
grestore
gsave
426.7 266.6 m
757.3 266.6 l
stroke
grestore
/DejaVuSans findfont
12.000 scalefont
setfont
gsave
559.289062 272.600000 translate
0.000000 rotate
0.000000 0.000000 m /zero glyphshow
7.634766 0.000000 m /period glyphshow
11.449219 0.000000 m /six glyphshow
19.083984 0.000000 m /space glyphshow
22.898438 0.000000 m /hyphen glyphshow
27.228516 0.000000 m /space glyphshow
31.042969 0.000000 m /zero glyphshow
38.677734 0.000000 m /period glyphshow
42.492188 0.000000 m /eight glyphshow
50.126953 0.000000 m /four glyphshow
57.761719 0.000000 m /five glyphshow
grestore
1.000 setlinewidth
0 setlinecap
0.800 setgray
gsave
433.7 229.25625 m
499.215625 229.25625 l
500.548958 229.25625 501.215625 229.922917 501.215625 231.25625 c
501.215625 259.6 l
501.215625 260.933333 500.548958 261.6 499.215625 261.6 c
433.7 261.6 l
432.366667 261.6 431.7 260.933333 431.7 259.6 c
431.7 231.25625 l
431.7 229.922917 432.366667 229.25625 433.7 229.25625 c
cl
gsave
1.000 setgray
fill
grestore
stroke
grestore
1.500 setlinewidth
1 setlinejoin
2 setlinecap
[] 0 setdash
0.122 0.467 0.706 setrgbcolor
gsave
435.7 253.50625 m
455.7 253.50625 l
stroke
grestore
0.000 setgray
/DejaVuSans findfont
10.000 scalefont
setfont
gsave
463.700000 250.006250 translate
0.000000 rotate
0.000000 0.000000 m /a glyphshow
6.127930 0.000000 m /u glyphshow
12.465820 0.000000 m /c glyphshow
grestore
1.000 0.498 0.055 setrgbcolor
gsave
435.7 238.834375 m
455.7 238.834375 l
stroke
grestore
0.000 setgray
gsave
463.700000 235.334375 translate
0.000000 rotate
0.000000 0.000000 m /v glyphshow
5.917969 0.000000 m /a glyphshow
12.045898 0.000000 m /l glyphshow
14.824219 0.000000 m /A glyphshow
21.665039 0.000000 m /u glyphshow
28.002930 0.000000 m /c glyphshow
grestore
gsave
807.1 27.8 m
1137.7 27.8 l
1137.7 266.6 l
807.1 266.6 l
cl
1.000 setgray
fill
grestore
0.800 setlinewidth
0 setlinecap
gsave
/o {
gsave
newpath
translate
0.8 setlinewidth
1 setlinejoin
0 setlinecap
0 0 m
0 -3.5 l

gsave
0.000 setgray
fill
grestore
stroke
grestore
} bind def
811.582 27.8 o
grestore
gsave
808.402131 13.206250 translate
0.000000 rotate
0.000000 0.000000 m /zero glyphshow
grestore
gsave
/o {
gsave
newpath
translate
0.8 setlinewidth
1 setlinejoin
0 setlinecap
0 0 m
0 -3.5 l

gsave
0.000 setgray
fill
grestore
stroke
grestore
} bind def
864.309 27.8 o
grestore
gsave
857.949716 13.206250 translate
0.000000 rotate
0.000000 0.000000 m /one glyphshow
6.362305 0.000000 m /zero glyphshow
grestore
gsave
/o {
gsave
newpath
translate
0.8 setlinewidth
1 setlinejoin
0 setlinecap
0 0 m
0 -3.5 l

gsave
0.000 setgray
fill
grestore
stroke
grestore
} bind def
917.036 27.8 o
grestore
gsave
910.676989 13.206250 translate
0.000000 rotate
0.000000 0.000000 m /two glyphshow
6.362305 0.000000 m /zero glyphshow
grestore
gsave
/o {
gsave
newpath
translate
0.8 setlinewidth
1 setlinejoin
0 setlinecap
0 0 m
0 -3.5 l

gsave
0.000 setgray
fill
grestore
stroke
grestore
} bind def
969.764 27.8 o
grestore
gsave
963.404261 13.206250 translate
0.000000 rotate
0.000000 0.000000 m /three glyphshow
6.362305 0.000000 m /zero glyphshow
grestore
gsave
/o {
gsave
newpath
translate
0.8 setlinewidth
1 setlinejoin
0 setlinecap
0 0 m
0 -3.5 l

gsave
0.000 setgray
fill
grestore
stroke
grestore
} bind def
1022.49 27.8 o
grestore
gsave
1016.131534 13.206250 translate
0.000000 rotate
0.000000 0.000000 m /four glyphshow
6.362305 0.000000 m /zero glyphshow
grestore
gsave
/o {
gsave
newpath
translate
0.8 setlinewidth
1 setlinejoin
0 setlinecap
0 0 m
0 -3.5 l

gsave
0.000 setgray
fill
grestore
stroke
grestore
} bind def
1075.22 27.8 o
grestore
gsave
1068.858807 13.206250 translate
0.000000 rotate
0.000000 0.000000 m /five glyphshow
6.362305 0.000000 m /zero glyphshow
grestore
gsave
/o {
gsave
newpath
translate
0.8 setlinewidth
1 setlinejoin
0 setlinecap
0 0 m
0 -3.5 l

gsave
0.000 setgray
fill
grestore
stroke
grestore
} bind def
1127.95 27.8 o
grestore
gsave
1121.586080 13.206250 translate
0.000000 rotate
0.000000 0.000000 m /six glyphshow
6.362305 0.000000 m /zero glyphshow
grestore
gsave
/o {
gsave
newpath
translate
0.8 setlinewidth
1 setlinejoin
0 setlinecap
0 0 m
-3.5 0 l

gsave
0.000 setgray
fill
grestore
stroke
grestore
} bind def
807.1 32.9831 o
grestore
gsave
771.475000 29.186272 translate
0.000000 rotate
0.000000 0.000000 m /zero glyphshow
6.362305 0.000000 m /period glyphshow
9.541016 0.000000 m /eight glyphshow
15.903320 0.000000 m /one glyphshow
22.265625 0.000000 m /five glyphshow
grestore
gsave
/o {
gsave
newpath
translate
0.8 setlinewidth
1 setlinejoin
0 setlinecap
0 0 m
-3.5 0 l

gsave
0.000 setgray
fill
grestore
stroke
grestore
} bind def
807.1 67.8529 o
grestore
gsave
771.475000 64.056040 translate
0.000000 rotate
0.000000 0.000000 m /zero glyphshow
6.362305 0.000000 m /period glyphshow
9.541016 0.000000 m /eight glyphshow
15.903320 0.000000 m /two glyphshow
22.265625 0.000000 m /zero glyphshow
grestore
gsave
/o {
gsave
newpath
translate
0.8 setlinewidth
1 setlinejoin
0 setlinecap
0 0 m
-3.5 0 l

gsave
0.000 setgray
fill
grestore
stroke
grestore
} bind def
807.1 102.723 o
grestore
gsave
771.475000 98.925808 translate
0.000000 rotate
0.000000 0.000000 m /zero glyphshow
6.362305 0.000000 m /period glyphshow
9.541016 0.000000 m /eight glyphshow
15.903320 0.000000 m /two glyphshow
22.265625 0.000000 m /five glyphshow
grestore
gsave
/o {
gsave
newpath
translate
0.8 setlinewidth
1 setlinejoin
0 setlinecap
0 0 m
-3.5 0 l

gsave
0.000 setgray
fill
grestore
stroke
grestore
} bind def
807.1 137.592 o
grestore
gsave
771.475000 133.795576 translate
0.000000 rotate
0.000000 0.000000 m /zero glyphshow
6.362305 0.000000 m /period glyphshow
9.541016 0.000000 m /eight glyphshow
15.903320 0.000000 m /three glyphshow
22.265625 0.000000 m /zero glyphshow
grestore
gsave
/o {
gsave
newpath
translate
0.8 setlinewidth
1 setlinejoin
0 setlinecap
0 0 m
-3.5 0 l

gsave
0.000 setgray
fill
grestore
stroke
grestore
} bind def
807.1 172.462 o
grestore
gsave
771.475000 168.665344 translate
0.000000 rotate
0.000000 0.000000 m /zero glyphshow
6.362305 0.000000 m /period glyphshow
9.541016 0.000000 m /eight glyphshow
15.903320 0.000000 m /three glyphshow
22.265625 0.000000 m /five glyphshow
grestore
gsave
/o {
gsave
newpath
translate
0.8 setlinewidth
1 setlinejoin
0 setlinecap
0 0 m
-3.5 0 l

gsave
0.000 setgray
fill
grestore
stroke
grestore
} bind def
807.1 207.332 o
grestore
gsave
771.475000 203.535112 translate
0.000000 rotate
0.000000 0.000000 m /zero glyphshow
6.362305 0.000000 m /period glyphshow
9.541016 0.000000 m /eight glyphshow
15.903320 0.000000 m /four glyphshow
22.265625 0.000000 m /zero glyphshow
grestore
gsave
/o {
gsave
newpath
translate
0.8 setlinewidth
1 setlinejoin
0 setlinecap
0 0 m
-3.5 0 l

gsave
0.000 setgray
fill
grestore
stroke
grestore
} bind def
807.1 242.202 o
grestore
gsave
771.475000 238.404880 translate
0.000000 rotate
0.000000 0.000000 m /zero glyphshow
6.362305 0.000000 m /period glyphshow
9.541016 0.000000 m /eight glyphshow
15.903320 0.000000 m /four glyphshow
22.265625 0.000000 m /five glyphshow
grestore
1.500 setlinewidth
2 setlinecap
0.122 0.467 0.706 setrgbcolor
gsave
330.6 238.8 807.1 27.8 clipbox
822.127273 80.949142 m
827.4 103.746929 l
832.672727 120.914957 l
837.945455 132.618819 l
843.218182 141.942854 l
848.490909 153.128962 l
853.763636 158.839107 l
859.036364 165.059983 l
864.309091 168.297601 l
869.581818 171.186663 l
874.854545 175.585496 l
880.127273 179.875197 l
885.4 183.838721 l
890.672727 186.717249 l
895.945455 188.811677 l
901.218182 191.147543 l
906.490909 193.827986 l
911.763636 197.026465 l
917.036364 196.683245 l
922.309091 200.09891 l
927.581818 203.097104 l
932.854545 205.026313 l
938.127273 207.380859 l
943.4 210.063409 l
948.672727 211.250748 l
953.945455 213.306552 l
959.218182 215.096198 l
964.490909 217.456737 l
969.763636 221.25888 l
975.036364 222.201317 l
980.309091 223.701724 l
985.581818 224.390784 l
990.854545 226.024388 l
996.127273 229.04908 l
1001.4 230.490919 l
1006.672727 231.34267 l
1011.945455 232.82023 l
1017.218182 235.449689 l
1022.490909 237.989071 l
1027.763636 240.664223 l
1033.036364 242.482382 l
1038.309091 242.74456 l
1043.581818 241.618879 l
1048.854545 243.82375 l
1054.127273 244.723395 l
1059.4 245.981522 l
1064.672727 246.942967 l
1069.945455 247.098354 l
1075.218182 249.021102 l
1080.490909 250.012931 l
1085.763636 249.719011 l
1091.036364 249.826036 l
1096.309091 249.922058 l
1101.581818 250.956445 l
1106.854545 252.71388 l
1112.127273 253.822472 l
1117.4 255.115057 l
1122.672727 255.745455 l
stroke
grestore
1.000 0.498 0.055 setrgbcolor
gsave
330.6 238.8 807.1 27.8 clipbox
822.127273 38.654545 m
827.4 60.915781 l
832.672727 75.133522 l
837.945455 84.236383 l
843.218182 94.10631 l
848.490909 104.513949 l
853.763636 109.376029 l
859.036364 114.207273 l
864.309091 119.420266 l
869.581818 122.280583 l
874.854545 125.137077 l
880.127273 128.336075 l
885.4 132.321762 l
890.672727 132.637763 l
895.945455 133.319203 l
901.218182 135.277134 l
906.490909 138.637955 l
911.763636 142.088735 l
917.036364 142.50871 l
922.309091 145.716882 l
927.581818 147.852436 l
932.854545 146.27549 l
938.127273 149.400585 l
943.4 152.81059 l
948.672727 154.487688 l
953.945455 156.536086 l
959.218182 157.641834 l
964.490909 159.270002 l
969.763636 161.920586 l
975.036364 162.307178 l
980.309091 163.344629 l
985.581818 164.023775 l
990.854545 165.268411 l
996.127273 168.697529 l
1001.4 169.077239 l
1006.672727 168.872094 l
1011.945455 169.724531 l
1017.218182 171.898311 l
1022.490909 173.670209 l
1027.763636 175.923498 l
1033.036364 177.997381 l
1038.309091 177.453299 l
1043.581818 177.438518 l
1048.854545 178.837076 l
1054.127273 179.208887 l
1059.4 180.943578 l
1064.672727 181.660696 l
1069.945455 181.164779 l
1075.218182 181.551115 l
1080.490909 182.327356 l
1085.763636 182.172159 l
1091.036364 181.255756 l
1096.309091 181.836535 l
1101.581818 182.065381 l
1106.854545 184.344664 l
1112.127273 184.932833 l
1117.4 185.447354 l
1122.672727 186.140517 l
stroke
grestore
0.800 setlinewidth
0 setlinejoin
[] 0 setdash
0.000 setgray
gsave
807.1 27.8 m
807.1 266.6 l
stroke
grestore
gsave
1137.7 27.8 m
1137.7 266.6 l
stroke
grestore
gsave
807.1 27.8 m
1137.7 27.8 l
stroke
grestore
gsave
807.1 266.6 m
1137.7 266.6 l
stroke
grestore
/DejaVuSans findfont
12.000 scalefont
setfont
gsave
939.689063 272.600000 translate
0.000000 rotate
0.000000 0.000000 m /zero glyphshow
7.634766 0.000000 m /period glyphshow
11.449219 0.000000 m /eight glyphshow
19.083984 0.000000 m /space glyphshow
22.898438 0.000000 m /hyphen glyphshow
27.228516 0.000000 m /space glyphshow
31.042969 0.000000 m /zero glyphshow
38.677734 0.000000 m /period glyphshow
42.492188 0.000000 m /eight glyphshow
50.126953 0.000000 m /three glyphshow
57.761719 0.000000 m /seven glyphshow
grestore
1.000 setlinewidth
0 setlinecap
0.800 setgray
gsave
814.1 229.25625 m
879.615625 229.25625 l
880.948958 229.25625 881.615625 229.922917 881.615625 231.25625 c
881.615625 259.6 l
881.615625 260.933333 880.948958 261.6 879.615625 261.6 c
814.1 261.6 l
812.766667 261.6 812.1 260.933333 812.1 259.6 c
812.1 231.25625 l
812.1 229.922917 812.766667 229.25625 814.1 229.25625 c
cl
gsave
1.000 setgray
fill
grestore
stroke
grestore
1.500 setlinewidth
1 setlinejoin
2 setlinecap
[] 0 setdash
0.122 0.467 0.706 setrgbcolor
gsave
816.1 253.50625 m
836.1 253.50625 l
stroke
grestore
0.000 setgray
/DejaVuSans findfont
10.000 scalefont
setfont
gsave
844.100000 250.006250 translate
0.000000 rotate
0.000000 0.000000 m /a glyphshow
6.127930 0.000000 m /u glyphshow
12.465820 0.000000 m /c glyphshow
grestore
1.000 0.498 0.055 setrgbcolor
gsave
816.1 238.834375 m
836.1 238.834375 l
stroke
grestore
0.000 setgray
gsave
844.100000 235.334375 translate
0.000000 rotate
0.000000 0.000000 m /v glyphshow
5.917969 0.000000 m /a glyphshow
12.045898 0.000000 m /l glyphshow
14.824219 0.000000 m /A glyphshow
21.665039 0.000000 m /u glyphshow
28.002930 0.000000 m /c glyphshow
grestore

end
showpage
