%!PS-Adobe-3.0 EPSF-3.0
%%Title: imgNets/opti_2_100_40.eps
%%Creator: matplotlib version 2.0.2, http://matplotlib.org/
%%CreationDate: Thu Apr 19 17:01:16 2018
%%Orientation: portrait
%%BoundingBox: -270 108 882 684
%%EndComments
%%BeginProlog
/mpldict 8 dict def
mpldict begin
/m { moveto } bind def
/l { lineto } bind def
/r { rlineto } bind def
/c { curveto } bind def
/cl { closepath } bind def
/box {
m
1 index 0 r
0 exch r
neg 0 r
cl
} bind def
/clipbox {
box
clip
newpath
} bind def
%!PS-Adobe-3.0 Resource-Font
%%Title: DejaVu Sans
%%Copyright: Copyright (c) 2003 by Bitstream, Inc. All Rights Reserved. Copyright (c) 2006 by Tavmjong Bah. All Rights Reserved. DejaVu changes are in public domain 
%%Creator: Converted from TrueType to type 3 by PPR
25 dict begin
/_d{bind def}bind def
/_m{moveto}_d
/_l{lineto}_d
/_cl{closepath eofill}_d
/_c{curveto}_d
/_sc{7 -1 roll{setcachedevice}{pop pop pop pop pop pop}ifelse}_d
/_e{exec}_d
/FontName /DejaVuSans def
/PaintType 0 def
/FontMatrix[.001 0 0 .001 0 0]def
/FontBBox[-1021 -463 1793 1232]def
/FontType 3 def
/Encoding [ /space /hyphen /period /zero /one /two /three /four /five /six /seven /eight /nine /A /D /G /M /R /S /a /c /d /e /g /l /m /o /p /r /t /u /v /x ] def
/FontInfo 10 dict dup begin
/FamilyName (DejaVu Sans) def
/FullName (DejaVu Sans) def
/Notice (Copyright (c) 2003 by Bitstream, Inc. All Rights Reserved. Copyright (c) 2006 by Tavmjong Bah. All Rights Reserved. DejaVu changes are in public domain ) def
/Weight (Book) def
/Version (Version 2.35) def
/ItalicAngle 0.0 def
/isFixedPitch false def
/UnderlinePosition -130 def
/UnderlineThickness 90 def
end readonly def
/CharStrings 33 dict dup begin
/space{318 0 0 0 0 0 _sc
}_d
/hyphen{361 0 49 234 312 314 _sc
49 314 _m
312 314 _l
312 234 _l
49 234 _l
49 314 _l
_cl}_d
/period{318 0 107 0 210 124 _sc
107 124 _m
210 124 _l
210 0 _l
107 0 _l
107 124 _l
_cl}_d
/zero{636 0 66 -13 570 742 _sc
318 664 _m
267 664 229 639 203 589 _c
177 539 165 464 165 364 _c
165 264 177 189 203 139 _c
229 89 267 64 318 64 _c
369 64 407 89 433 139 _c
458 189 471 264 471 364 _c
471 464 458 539 433 589 _c
407 639 369 664 318 664 _c
318 742 _m
399 742 461 709 505 645 _c
548 580 570 486 570 364 _c
570 241 548 147 505 83 _c
461 19 399 -13 318 -13 _c
236 -13 173 19 130 83 _c
87 147 66 241 66 364 _c
66 486 87 580 130 645 _c
173 709 236 742 318 742 _c
_cl}_d
/one{636 0 110 0 544 729 _sc
124 83 _m
285 83 _l
285 639 _l
110 604 _l
110 694 _l
284 729 _l
383 729 _l
383 83 _l
544 83 _l
544 0 _l
124 0 _l
124 83 _l
_cl}_d
/two{{636 0 73 0 536 742 _sc
192 83 _m
536 83 _l
536 0 _l
73 0 _l
73 83 _l
110 121 161 173 226 239 _c
290 304 331 346 348 365 _c
380 400 402 430 414 455 _c
426 479 433 504 433 528 _c
433 566 419 598 392 622 _c
365 646 330 659 286 659 _c
255 659 222 653 188 643 _c
154 632 117 616 78 594 _c
78 694 _l
118 710 155 722 189 730 _c
223 738 255 742 284 742 _c
}_e{359 742 419 723 464 685 _c
509 647 532 597 532 534 _c
532 504 526 475 515 449 _c
504 422 484 390 454 354 _c
446 344 420 317 376 272 _c
332 227 271 164 192 83 _c
_cl}_e}_d
/three{{636 0 76 -13 556 742 _sc
406 393 _m
453 383 490 362 516 330 _c
542 298 556 258 556 212 _c
556 140 531 84 482 45 _c
432 6 362 -13 271 -13 _c
240 -13 208 -10 176 -4 _c
144 1 110 10 76 22 _c
76 117 _l
103 101 133 89 166 81 _c
198 73 232 69 268 69 _c
330 69 377 81 409 105 _c
441 129 458 165 458 212 _c
458 254 443 288 413 312 _c
383 336 341 349 287 349 _c
}_e{202 349 _l
202 430 _l
291 430 _l
339 430 376 439 402 459 _c
428 478 441 506 441 543 _c
441 580 427 609 401 629 _c
374 649 336 659 287 659 _c
260 659 231 656 200 650 _c
169 644 135 635 98 623 _c
98 711 _l
135 721 170 729 203 734 _c
235 739 266 742 296 742 _c
370 742 429 725 473 691 _c
517 657 539 611 539 553 _c
539 513 527 479 504 451 _c
481 423 448 403 406 393 _c
_cl}_e}_d
/four{636 0 49 0 580 729 _sc
378 643 _m
129 254 _l
378 254 _l
378 643 _l
352 729 _m
476 729 _l
476 254 _l
580 254 _l
580 172 _l
476 172 _l
476 0 _l
378 0 _l
378 172 _l
49 172 _l
49 267 _l
352 729 _l
_cl}_d
/five{{636 0 77 -13 549 729 _sc
108 729 _m
495 729 _l
495 646 _l
198 646 _l
198 467 _l
212 472 227 476 241 478 _c
255 480 270 482 284 482 _c
365 482 429 459 477 415 _c
525 370 549 310 549 234 _c
549 155 524 94 475 51 _c
426 8 357 -13 269 -13 _c
238 -13 207 -10 175 -6 _c
143 -1 111 6 77 17 _c
77 116 _l
106 100 136 88 168 80 _c
199 72 232 69 267 69 _c
}_e{323 69 368 83 401 113 _c
433 143 450 183 450 234 _c
450 284 433 324 401 354 _c
368 384 323 399 267 399 _c
241 399 214 396 188 390 _c
162 384 135 375 108 363 _c
108 729 _l
_cl}_e}_d
/six{{636 0 70 -13 573 742 _sc
330 404 _m
286 404 251 388 225 358 _c
199 328 186 286 186 234 _c
186 181 199 139 225 109 _c
251 79 286 64 330 64 _c
374 64 409 79 435 109 _c
461 139 474 181 474 234 _c
474 286 461 328 435 358 _c
409 388 374 404 330 404 _c
526 713 _m
526 623 _l
501 635 476 644 451 650 _c
425 656 400 659 376 659 _c
310 659 260 637 226 593 _c
}_e{192 549 172 482 168 394 _c
187 422 211 444 240 459 _c
269 474 301 482 336 482 _c
409 482 467 459 509 415 _c
551 371 573 310 573 234 _c
573 159 550 99 506 54 _c
462 9 403 -13 330 -13 _c
246 -13 181 19 137 83 _c
92 147 70 241 70 364 _c
70 479 97 571 152 639 _c
206 707 280 742 372 742 _c
396 742 421 739 447 735 _c
472 730 498 723 526 713 _c
_cl}_e}_d
/seven{636 0 82 0 551 729 _sc
82 729 _m
551 729 _l
551 687 _l
286 0 _l
183 0 _l
432 646 _l
82 646 _l
82 729 _l
_cl}_d
/eight{{636 0 68 -13 568 742 _sc
318 346 _m
271 346 234 333 207 308 _c
180 283 167 249 167 205 _c
167 161 180 126 207 101 _c
234 76 271 64 318 64 _c
364 64 401 76 428 102 _c
455 127 469 161 469 205 _c
469 249 455 283 429 308 _c
402 333 365 346 318 346 _c
219 388 _m
177 398 144 418 120 447 _c
96 476 85 511 85 553 _c
85 611 105 657 147 691 _c
188 725 245 742 318 742 _c
}_e{390 742 447 725 489 691 _c
530 657 551 611 551 553 _c
551 511 539 476 515 447 _c
491 418 459 398 417 388 _c
464 377 501 355 528 323 _c
554 291 568 251 568 205 _c
568 134 546 80 503 43 _c
459 5 398 -13 318 -13 _c
237 -13 175 5 132 43 _c
89 80 68 134 68 205 _c
68 251 81 291 108 323 _c
134 355 171 377 219 388 _c
183 544 _m
183 506 194 476 218 455 _c
}_e{242 434 275 424 318 424 _c
360 424 393 434 417 455 _c
441 476 453 506 453 544 _c
453 582 441 611 417 632 _c
393 653 360 664 318 664 _c
275 664 242 653 218 632 _c
194 611 183 582 183 544 _c
_cl}_e}_d
/nine{{636 0 63 -13 566 742 _sc
110 15 _m
110 105 _l
134 93 159 84 185 78 _c
210 72 235 69 260 69 _c
324 69 374 90 408 134 _c
442 178 462 244 468 334 _c
448 306 424 284 396 269 _c
367 254 335 247 300 247 _c
226 247 168 269 126 313 _c
84 357 63 417 63 494 _c
63 568 85 628 129 674 _c
173 719 232 742 306 742 _c
390 742 455 709 499 645 _c
543 580 566 486 566 364 _c
}_e{566 248 538 157 484 89 _c
429 21 356 -13 264 -13 _c
239 -13 214 -10 189 -6 _c
163 -2 137 5 110 15 _c
306 324 _m
350 324 385 339 411 369 _c
437 399 450 441 450 494 _c
450 546 437 588 411 618 _c
385 648 350 664 306 664 _c
262 664 227 648 201 618 _c
175 588 162 546 162 494 _c
162 441 175 399 201 369 _c
227 339 262 324 306 324 _c
_cl}_e}_d
/A{684 0 8 0 676 729 _sc
342 632 _m
208 269 _l
476 269 _l
342 632 _l
286 729 _m
398 729 _l
676 0 _l
573 0 _l
507 187 _l
178 187 _l
112 0 _l
8 0 _l
286 729 _l
_cl}_d
/D{770 0 98 0 711 729 _sc
197 648 _m
197 81 _l
316 81 _l
416 81 490 103 537 149 _c
583 195 607 267 607 365 _c
607 463 583 534 537 580 _c
490 625 416 648 316 648 _c
197 648 _l
98 729 _m
301 729 _l
442 729 546 699 612 641 _c
678 582 711 490 711 365 _c
711 239 677 147 611 88 _c
545 29 441 0 301 0 _c
98 0 _l
98 729 _l
_cl}_d
/G{{775 0 56 -13 693 742 _sc
595 104 _m
595 300 _l
434 300 _l
434 381 _l
693 381 _l
693 68 _l
655 40 613 20 567 7 _c
521 -6 472 -13 420 -13 _c
306 -13 216 20 152 86 _c
88 152 56 245 56 364 _c
56 482 88 575 152 642 _c
216 708 306 742 420 742 _c
467 742 512 736 555 724 _c
598 712 638 695 674 673 _c
674 568 _l
637 598 598 621 557 637 _c
516 653 473 661 428 661 _c
}_e{338 661 271 636 227 586 _c
182 536 160 462 160 364 _c
160 265 182 191 227 141 _c
271 91 338 67 428 67 _c
462 67 493 70 521 76 _c
549 82 573 91 595 104 _c
_cl}_e}_d
/M{863 0 98 0 765 729 _sc
98 729 _m
245 729 _l
431 233 _l
618 729 _l
765 729 _l
765 0 _l
669 0 _l
669 640 _l
481 140 _l
382 140 _l
194 640 _l
194 0 _l
98 0 _l
98 729 _l
_cl}_d
/R{{695 0 98 0 666 729 _sc
444 342 _m
465 334 486 319 506 296 _c
526 272 546 240 566 199 _c
666 0 _l
560 0 _l
467 187 _l
443 235 419 268 397 284 _c
374 300 343 308 304 308 _c
197 308 _l
197 0 _l
98 0 _l
98 729 _l
321 729 _l
404 729 466 711 507 677 _c
548 642 569 589 569 519 _c
569 473 558 434 537 404 _c
515 374 484 353 444 342 _c
197 648 _m
197 389 _l
321 389 _l
}_e{368 389 404 400 428 422 _c
452 444 465 476 465 519 _c
465 561 452 593 428 615 _c
404 637 368 648 321 648 _c
197 648 _l
_cl}_e}_d
/S{{635 0 66 -13 579 742 _sc
535 705 _m
535 609 _l
497 627 462 640 429 649 _c
395 657 363 662 333 662 _c
279 662 237 651 208 631 _c
179 610 165 580 165 542 _c
165 510 174 485 194 469 _c
213 452 250 439 304 429 _c
364 417 _l
437 403 491 378 526 343 _c
561 307 579 260 579 201 _c
579 130 555 77 508 41 _c
460 5 391 -13 300 -13 _c
265 -13 228 -9 189 -2 _c
}_e{150 5 110 16 69 32 _c
69 134 _l
109 111 148 94 186 83 _c
224 71 262 66 300 66 _c
356 66 399 77 430 99 _c
460 121 476 152 476 194 _c
476 230 465 258 443 278 _c
421 298 385 313 335 323 _c
275 335 _l
201 349 148 372 115 404 _c
82 435 66 478 66 534 _c
66 598 88 649 134 686 _c
179 723 242 742 322 742 _c
356 742 390 739 426 733 _c
461 727 497 717 535 705 _c
}_e{_cl}_e}_d
/a{{613 0 60 -13 522 560 _sc
343 275 _m
270 275 220 266 192 250 _c
164 233 150 205 150 165 _c
150 133 160 107 181 89 _c
202 70 231 61 267 61 _c
317 61 357 78 387 114 _c
417 149 432 196 432 255 _c
432 275 _l
343 275 _l
522 312 _m
522 0 _l
432 0 _l
432 83 _l
411 49 385 25 355 10 _c
325 -5 287 -13 243 -13 _c
187 -13 142 2 109 33 _c
76 64 60 106 60 159 _c
}_e{60 220 80 266 122 298 _c
163 329 224 345 306 345 _c
432 345 _l
432 354 _l
432 395 418 427 391 450 _c
364 472 326 484 277 484 _c
245 484 215 480 185 472 _c
155 464 127 453 100 439 _c
100 522 _l
132 534 164 544 195 550 _c
226 556 256 560 286 560 _c
365 560 424 539 463 498 _c
502 457 522 395 522 312 _c
_cl}_e}_d
/c{{550 0 55 -13 488 560 _sc
488 526 _m
488 442 _l
462 456 437 466 411 473 _c
385 480 360 484 334 484 _c
276 484 230 465 198 428 _c
166 391 150 339 150 273 _c
150 206 166 154 198 117 _c
230 80 276 62 334 62 _c
360 62 385 65 411 72 _c
437 79 462 90 488 104 _c
488 21 _l
462 9 436 0 410 -5 _c
383 -10 354 -13 324 -13 _c
242 -13 176 12 128 64 _c
}_e{79 115 55 185 55 273 _c
55 362 79 432 128 483 _c
177 534 244 560 330 560 _c
358 560 385 557 411 551 _c
437 545 463 537 488 526 _c
_cl}_e}_d
/d{{635 0 55 -13 544 760 _sc
454 464 _m
454 760 _l
544 760 _l
544 0 _l
454 0 _l
454 82 _l
435 49 411 25 382 10 _c
353 -5 319 -13 279 -13 _c
213 -13 159 13 117 65 _c
75 117 55 187 55 273 _c
55 359 75 428 117 481 _c
159 533 213 560 279 560 _c
319 560 353 552 382 536 _c
411 520 435 496 454 464 _c
148 273 _m
148 207 161 155 188 117 _c
215 79 253 61 301 61 _c
}_e{348 61 385 79 413 117 _c
440 155 454 207 454 273 _c
454 339 440 390 413 428 _c
385 466 348 485 301 485 _c
253 485 215 466 188 428 _c
161 390 148 339 148 273 _c
_cl}_e}_d
/e{{615 0 55 -13 562 560 _sc
562 296 _m
562 252 _l
149 252 _l
153 190 171 142 205 110 _c
238 78 284 62 344 62 _c
378 62 412 66 444 74 _c
476 82 509 95 541 113 _c
541 28 _l
509 14 476 3 442 -3 _c
408 -9 373 -13 339 -13 _c
251 -13 182 12 131 62 _c
80 112 55 181 55 268 _c
55 357 79 428 127 481 _c
175 533 241 560 323 560 _c
397 560 455 536 498 489 _c
}_e{540 441 562 377 562 296 _c
472 322 _m
471 371 457 410 431 440 _c
404 469 368 484 324 484 _c
274 484 234 469 204 441 _c
174 413 156 373 152 322 _c
472 322 _l
_cl}_e}_d
/g{{635 0 55 -207 544 560 _sc
454 280 _m
454 344 440 395 414 431 _c
387 467 349 485 301 485 _c
253 485 215 467 188 431 _c
161 395 148 344 148 280 _c
148 215 161 165 188 129 _c
215 93 253 75 301 75 _c
349 75 387 93 414 129 _c
440 165 454 215 454 280 _c
544 68 _m
544 -24 523 -93 482 -139 _c
440 -184 377 -207 292 -207 _c
260 -207 231 -204 203 -200 _c
175 -195 147 -188 121 -178 _c
}_e{121 -91 _l
147 -105 173 -115 199 -122 _c
225 -129 251 -133 278 -133 _c
336 -133 380 -117 410 -87 _c
439 -56 454 -10 454 52 _c
454 96 _l
435 64 411 40 382 24 _c
353 8 319 0 279 0 _c
211 0 157 25 116 76 _c
75 127 55 195 55 280 _c
55 364 75 432 116 483 _c
157 534 211 560 279 560 _c
319 560 353 552 382 536 _c
411 520 435 496 454 464 _c
454 547 _l
544 547 _l
}_e{544 68 _l
_cl}_e}_d
/l{278 0 94 0 184 760 _sc
94 760 _m
184 760 _l
184 0 _l
94 0 _l
94 760 _l
_cl}_d
/m{{974 0 91 0 889 560 _sc
520 442 _m
542 482 569 511 600 531 _c
631 550 668 560 711 560 _c
767 560 811 540 842 500 _c
873 460 889 403 889 330 _c
889 0 _l
799 0 _l
799 327 _l
799 379 789 418 771 444 _c
752 469 724 482 686 482 _c
639 482 602 466 575 435 _c
548 404 535 362 535 309 _c
535 0 _l
445 0 _l
445 327 _l
445 379 435 418 417 444 _c
398 469 369 482 331 482 _c
}_e{285 482 248 466 221 435 _c
194 404 181 362 181 309 _c
181 0 _l
91 0 _l
91 547 _l
181 547 _l
181 462 _l
201 495 226 520 255 536 _c
283 552 317 560 357 560 _c
397 560 430 550 458 530 _c
486 510 506 480 520 442 _c
_cl}_e}_d
/o{612 0 55 -13 557 560 _sc
306 484 _m
258 484 220 465 192 427 _c
164 389 150 338 150 273 _c
150 207 163 156 191 118 _c
219 80 257 62 306 62 _c
354 62 392 80 420 118 _c
448 156 462 207 462 273 _c
462 337 448 389 420 427 _c
392 465 354 484 306 484 _c
306 560 _m
384 560 445 534 490 484 _c
534 433 557 363 557 273 _c
557 183 534 113 490 63 _c
445 12 384 -13 306 -13 _c
227 -13 165 12 121 63 _c
77 113 55 183 55 273 _c
55 363 77 433 121 484 _c
165 534 227 560 306 560 _c
_cl}_d
/p{{635 0 91 -207 580 560 _sc
181 82 _m
181 -207 _l
91 -207 _l
91 547 _l
181 547 _l
181 464 _l
199 496 223 520 252 536 _c
281 552 316 560 356 560 _c
422 560 476 533 518 481 _c
559 428 580 359 580 273 _c
580 187 559 117 518 65 _c
476 13 422 -13 356 -13 _c
316 -13 281 -5 252 10 _c
223 25 199 49 181 82 _c
487 273 _m
487 339 473 390 446 428 _c
418 466 381 485 334 485 _c
}_e{286 485 249 466 222 428 _c
194 390 181 339 181 273 _c
181 207 194 155 222 117 _c
249 79 286 61 334 61 _c
381 61 418 79 446 117 _c
473 155 487 207 487 273 _c
_cl}_e}_d
/r{411 0 91 0 411 560 _sc
411 463 _m
401 469 390 473 378 476 _c
366 478 353 480 339 480 _c
288 480 249 463 222 430 _c
194 397 181 350 181 288 _c
181 0 _l
91 0 _l
91 547 _l
181 547 _l
181 462 _l
199 495 224 520 254 536 _c
284 552 321 560 365 560 _c
371 560 378 559 386 559 _c
393 558 401 557 411 555 _c
411 463 _l
_cl}_d
/t{392 0 27 0 368 702 _sc
183 702 _m
183 547 _l
368 547 _l
368 477 _l
183 477 _l
183 180 _l
183 135 189 106 201 94 _c
213 81 238 75 276 75 _c
368 75 _l
368 0 _l
276 0 _l
206 0 158 13 132 39 _c
106 65 93 112 93 180 _c
93 477 _l
27 477 _l
27 547 _l
93 547 _l
93 702 _l
183 702 _l
_cl}_d
/u{634 0 85 -13 543 560 _sc
85 216 _m
85 547 _l
175 547 _l
175 219 _l
175 167 185 129 205 103 _c
225 77 255 64 296 64 _c
344 64 383 79 411 110 _c
439 141 453 183 453 237 _c
453 547 _l
543 547 _l
543 0 _l
453 0 _l
453 84 _l
431 50 405 26 377 10 _c
348 -5 315 -13 277 -13 _c
214 -13 166 6 134 45 _c
101 83 85 140 85 216 _c
311 560 _m
311 560 _l
_cl}_d
/v{592 0 30 0 562 547 _sc
30 547 _m
125 547 _l
296 88 _l
467 547 _l
562 547 _l
357 0 _l
235 0 _l
30 547 _l
_cl}_d
/x{592 0 29 0 559 547 _sc
549 547 _m
351 281 _l
559 0 _l
453 0 _l
294 215 _l
135 0 _l
29 0 _l
241 286 _l
47 547 _l
153 547 _l
298 352 _l
443 547 _l
549 547 _l
_cl}_d
end readonly def

/BuildGlyph
 {exch begin
 CharStrings exch
 2 copy known not{pop /.notdef}if
 true 3 1 roll get exec
 end}_d

/BuildChar {
 1 index /Encoding get exch get
 1 index /BuildGlyph get exec
}_d

FontName currentdict end definefont pop
end
%%EndProlog
mpldict begin
-270 108 translate
1152 576 0 0 clipbox
gsave
0 0 m
1152 0 l
1152 576 l
0 576 l
cl
1.000 setgray
fill
grestore
gsave
39.925 310.4 m
372.566667 310.4 l
372.566667 549.2 l
39.925 549.2 l
cl
1.000 setgray
fill
grestore
0.800 setlinewidth
1 setlinejoin
0 setlinecap
[] 0 setdash
0.000 setgray
gsave
/o {
gsave
newpath
translate
0.8 setlinewidth
1 setlinejoin
0 setlinecap
0 0 m
0 -3.5 l

gsave
0.000 setgray
fill
grestore
stroke
grestore
} bind def
47.1905 310.4 o
grestore
/DejaVuSans findfont
10.000 scalefont
setfont
gsave
44.010803 295.806250 translate
0.000000 rotate
0.000000 0.000000 m /zero glyphshow
grestore
gsave
/o {
gsave
newpath
translate
0.8 setlinewidth
1 setlinejoin
0 setlinecap
0 0 m
0 -3.5 l

gsave
0.000 setgray
fill
grestore
stroke
grestore
} bind def
86.4634 310.4 o
grestore
gsave
80.104040 295.806250 translate
0.000000 rotate
0.000000 0.000000 m /one glyphshow
6.362305 0.000000 m /zero glyphshow
grestore
gsave
/o {
gsave
newpath
translate
0.8 setlinewidth
1 setlinejoin
0 setlinecap
0 0 m
0 -3.5 l

gsave
0.000 setgray
fill
grestore
stroke
grestore
} bind def
125.736 310.4 o
grestore
gsave
119.376964 295.806250 translate
0.000000 rotate
0.000000 0.000000 m /two glyphshow
6.362305 0.000000 m /zero glyphshow
grestore
gsave
/o {
gsave
newpath
translate
0.8 setlinewidth
1 setlinejoin
0 setlinecap
0 0 m
0 -3.5 l

gsave
0.000 setgray
fill
grestore
stroke
grestore
} bind def
165.009 310.4 o
grestore
gsave
158.649888 295.806250 translate
0.000000 rotate
0.000000 0.000000 m /three glyphshow
6.362305 0.000000 m /zero glyphshow
grestore
gsave
/o {
gsave
newpath
translate
0.8 setlinewidth
1 setlinejoin
0 setlinecap
0 0 m
0 -3.5 l

gsave
0.000 setgray
fill
grestore
stroke
grestore
} bind def
204.282 310.4 o
grestore
gsave
197.922812 295.806250 translate
0.000000 rotate
0.000000 0.000000 m /four glyphshow
6.362305 0.000000 m /zero glyphshow
grestore
gsave
/o {
gsave
newpath
translate
0.8 setlinewidth
1 setlinejoin
0 setlinecap
0 0 m
0 -3.5 l

gsave
0.000 setgray
fill
grestore
stroke
grestore
} bind def
243.555 310.4 o
grestore
gsave
237.195736 295.806250 translate
0.000000 rotate
0.000000 0.000000 m /five glyphshow
6.362305 0.000000 m /zero glyphshow
grestore
gsave
/o {
gsave
newpath
translate
0.8 setlinewidth
1 setlinejoin
0 setlinecap
0 0 m
0 -3.5 l

gsave
0.000 setgray
fill
grestore
stroke
grestore
} bind def
282.828 310.4 o
grestore
gsave
276.468660 295.806250 translate
0.000000 rotate
0.000000 0.000000 m /six glyphshow
6.362305 0.000000 m /zero glyphshow
grestore
gsave
/o {
gsave
newpath
translate
0.8 setlinewidth
1 setlinejoin
0 setlinecap
0 0 m
0 -3.5 l

gsave
0.000 setgray
fill
grestore
stroke
grestore
} bind def
322.101 310.4 o
grestore
gsave
315.741584 295.806250 translate
0.000000 rotate
0.000000 0.000000 m /seven glyphshow
6.362305 0.000000 m /zero glyphshow
grestore
gsave
/o {
gsave
newpath
translate
0.8 setlinewidth
1 setlinejoin
0 setlinecap
0 0 m
0 -3.5 l

gsave
0.000 setgray
fill
grestore
stroke
grestore
} bind def
361.374 310.4 o
grestore
gsave
355.014508 295.806250 translate
0.000000 rotate
0.000000 0.000000 m /eight glyphshow
6.362305 0.000000 m /zero glyphshow
grestore
gsave
/o {
gsave
newpath
translate
0.8 setlinewidth
1 setlinejoin
0 setlinecap
0 0 m
-3.5 0 l

gsave
0.000 setgray
fill
grestore
stroke
grestore
} bind def
39.925 350.751 o
grestore
gsave
10.659375 346.954076 translate
0.000000 rotate
0.000000 0.000000 m /zero glyphshow
6.362305 0.000000 m /period glyphshow
9.541016 0.000000 m /eight glyphshow
15.903320 0.000000 m /two glyphshow
grestore
gsave
/o {
gsave
newpath
translate
0.8 setlinewidth
1 setlinejoin
0 setlinecap
0 0 m
-3.5 0 l

gsave
0.000 setgray
fill
grestore
stroke
grestore
} bind def
39.925 397.937 o
grestore
gsave
10.659375 394.140158 translate
0.000000 rotate
0.000000 0.000000 m /zero glyphshow
6.362305 0.000000 m /period glyphshow
9.541016 0.000000 m /eight glyphshow
15.903320 0.000000 m /three glyphshow
grestore
gsave
/o {
gsave
newpath
translate
0.8 setlinewidth
1 setlinejoin
0 setlinecap
0 0 m
-3.5 0 l

gsave
0.000 setgray
fill
grestore
stroke
grestore
} bind def
39.925 445.123 o
grestore
gsave
10.659375 441.326240 translate
0.000000 rotate
0.000000 0.000000 m /zero glyphshow
6.362305 0.000000 m /period glyphshow
9.541016 0.000000 m /eight glyphshow
15.903320 0.000000 m /four glyphshow
grestore
gsave
/o {
gsave
newpath
translate
0.8 setlinewidth
1 setlinejoin
0 setlinecap
0 0 m
-3.5 0 l

gsave
0.000 setgray
fill
grestore
stroke
grestore
} bind def
39.925 492.309 o
grestore
gsave
10.659375 488.512322 translate
0.000000 rotate
0.000000 0.000000 m /zero glyphshow
6.362305 0.000000 m /period glyphshow
9.541016 0.000000 m /eight glyphshow
15.903320 0.000000 m /five glyphshow
grestore
gsave
/o {
gsave
newpath
translate
0.8 setlinewidth
1 setlinejoin
0 setlinecap
0 0 m
-3.5 0 l

gsave
0.000 setgray
fill
grestore
stroke
grestore
} bind def
39.925 539.495 o
grestore
gsave
10.659375 535.698404 translate
0.000000 rotate
0.000000 0.000000 m /zero glyphshow
6.362305 0.000000 m /period glyphshow
9.541016 0.000000 m /eight glyphshow
15.903320 0.000000 m /six glyphshow
grestore
1.500 setlinewidth
2 setlinecap
0.122 0.467 0.706 setrgbcolor
gsave
332.6 238.8 39.93 310.4 clipbox
55.045076 347.078302 m
58.972368 369.588694 l
62.899661 384.544295 l
66.826953 396.751985 l
70.754245 406.463658 l
74.681538 415.89629 l
78.60883 421.769606 l
82.536123 429.775983 l
86.463415 435.896918 l
90.390707 441.010083 l
94.318 445.44232 l
98.245292 449.668213 l
102.172585 452.284031 l
106.099877 456.843008 l
110.027169 460.542874 l
113.954462 463.508754 l
117.881754 466.302185 l
121.809047 468.371671 l
125.736339 471.706777 l
129.663631 473.303611 l
133.590924 476.090643 l
137.518216 476.596334 l
141.445509 478.419247 l
145.372801 481.602272 l
149.300093 482.794465 l
153.227386 484.879821 l
157.154678 486.972241 l
161.081971 487.379765 l
165.009263 488.593974 l
168.936555 490.75792 l
172.863848 492.377657 l
176.79114 493.312095 l
180.718433 495.265675 l
184.645725 496.351561 l
188.573018 496.608872 l
192.50031 497.779842 l
196.427602 499.971823 l
200.354895 499.941983 l
204.282187 499.924497 l
208.20948 503.790636 l
212.136772 500.381627 l
216.064064 505.750298 l
219.991357 504.899677 l
223.918649 506.598036 l
227.845942 507.978105 l
231.773234 508.202505 l
235.700526 510.719934 l
239.627819 511.867083 l
243.555111 512.56879 l
247.482404 513.402812 l
251.409696 514.738914 l
255.336988 514.76717 l
259.264281 515.782891 l
263.191573 516.661007 l
267.118866 518.6424 l
271.046158 519.985724 l
274.97345 520.290361 l
278.900743 520.115029 l
282.828035 522.308086 l
286.755328 522.193384 l
290.68262 523.388302 l
294.609912 524.673403 l
298.537205 525.326994 l
302.464497 526.208468 l
306.39179 528.027484 l
310.319082 528.004138 l
314.246374 528.738061 l
318.173667 531.252165 l
322.100959 532.199875 l
326.028252 532.651874 l
329.955544 534.285897 l
333.882836 535.113362 l
337.810129 535.668215 l
341.737421 537.116041 l
345.664714 538.107149 l
349.592006 537.932957 l
353.519299 538.345455 l
357.446591 538.313714 l
stroke
grestore
1.000 0.498 0.055 setrgbcolor
gsave
332.6 238.8 39.93 310.4 clipbox
55.045076 321.254545 m
58.972368 342.672888 l
62.899661 357.239389 l
66.826953 369.052083 l
70.754245 378.663249 l
74.681538 386.307558 l
78.60883 390.635436 l
82.536123 397.747296 l
86.463415 403.309051 l
90.390707 407.428639 l
94.318 411.664097 l
98.245292 414.809827 l
102.172585 416.811341 l
106.099877 421.042317 l
110.027169 424.660492 l
113.954462 426.11059 l
117.881754 426.812879 l
121.809047 428.699558 l
125.736339 432.177206 l
129.663631 432.802421 l
133.590924 434.661857 l
137.518216 433.432636 l
141.445509 435.621577 l
145.372801 436.828555 l
149.300093 437.610504 l
153.227386 438.48815 l
157.154678 441.508526 l
161.081971 440.448627 l
165.009263 442.20409 l
168.936555 443.282266 l
172.863848 444.339924 l
176.79114 444.710466 l
180.718433 446.211257 l
184.645725 446.675771 l
188.573018 446.528693 l
192.50031 447.838264 l
196.427602 448.994031 l
200.354895 448.940407 l
204.282187 448.406578 l
208.20948 452.100965 l
212.136772 449.826329 l
216.064064 453.44278 l
219.991357 451.670936 l
223.918649 454.455607 l
227.845942 454.493023 l
231.773234 453.973506 l
235.700526 455.973985 l
239.627819 456.775764 l
243.555111 456.037783 l
247.482404 455.77742 l
251.409696 457.009573 l
255.336988 455.65155 l
259.264281 456.664377 l
263.191573 457.902047 l
267.118866 459.568711 l
271.046158 461.051052 l
274.97345 460.991221 l
278.900743 460.275655 l
282.828035 462.163369 l
286.755328 460.982255 l
290.68262 461.018119 l
294.609912 461.503669 l
298.537205 460.765343 l
302.464497 461.961976 l
306.39179 463.021358 l
310.319082 463.77934 l
314.246374 463.011185 l
318.173667 463.922625 l
322.100959 464.608189 l
326.028252 464.348516 l
329.955544 464.961316 l
333.882836 467.072666 l
337.810129 465.470489 l
341.737421 465.718436 l
345.664714 466.972487 l
349.592006 466.041906 l
353.519299 464.805616 l
357.446591 463.934868 l
stroke
grestore
0.800 setlinewidth
0 setlinejoin
[] 0 setdash
0.000 setgray
gsave
39.925 310.4 m
39.925 549.2 l
stroke
grestore
gsave
372.566667 310.4 m
372.566667 549.2 l
stroke
grestore
gsave
39.925 310.4 m
372.566667 310.4 l
stroke
grestore
gsave
39.925 549.2 m
372.566667 549.2 l
stroke
grestore
/DejaVuSans findfont
12.000 scalefont
setfont
gsave
170.003646 555.200000 translate
0.000000 rotate
0.000000 0.000000 m /S glyphshow
7.617188 0.000000 m /G glyphshow
16.916016 0.000000 m /D glyphshow
26.156250 0.000000 m /space glyphshow
29.970703 0.000000 m /hyphen glyphshow
34.300781 0.000000 m /space glyphshow
38.115234 0.000000 m /zero glyphshow
45.750000 0.000000 m /period glyphshow
49.564453 0.000000 m /eight glyphshow
57.199219 0.000000 m /four glyphshow
64.833984 0.000000 m /five glyphshow
grestore
1.000 setlinewidth
0 setlinecap
0.800 setgray
gsave
46.925 511.85625 m
112.440625 511.85625 l
113.773958 511.85625 114.440625 512.522917 114.440625 513.85625 c
114.440625 542.2 l
114.440625 543.533333 113.773958 544.2 112.440625 544.2 c
46.925 544.2 l
45.591667 544.2 44.925 543.533333 44.925 542.2 c
44.925 513.85625 l
44.925 512.522917 45.591667 511.85625 46.925 511.85625 c
cl
gsave
1.000 setgray
fill
grestore
stroke
grestore
1.500 setlinewidth
1 setlinejoin
2 setlinecap
[] 0 setdash
0.122 0.467 0.706 setrgbcolor
gsave
48.925 536.10625 m
68.925 536.10625 l
stroke
grestore
0.000 setgray
/DejaVuSans findfont
10.000 scalefont
setfont
gsave
76.925000 532.606250 translate
0.000000 rotate
0.000000 0.000000 m /a glyphshow
6.127930 0.000000 m /u glyphshow
12.465820 0.000000 m /c glyphshow
grestore
1.000 0.498 0.055 setrgbcolor
gsave
48.925 521.434375 m
68.925 521.434375 l
stroke
grestore
0.000 setgray
gsave
76.925000 517.934375 translate
0.000000 rotate
0.000000 0.000000 m /v glyphshow
5.917969 0.000000 m /a glyphshow
12.045898 0.000000 m /l glyphshow
14.824219 0.000000 m /A glyphshow
21.665039 0.000000 m /u glyphshow
28.002930 0.000000 m /c glyphshow
grestore
gsave
422.491667 310.4 m
755.133333 310.4 l
755.133333 549.2 l
422.491667 549.2 l
cl
1.000 setgray
fill
grestore
0.800 setlinewidth
0 setlinecap
gsave
/o {
gsave
newpath
translate
0.8 setlinewidth
1 setlinejoin
0 setlinecap
0 0 m
0 -3.5 l

gsave
0.000 setgray
fill
grestore
stroke
grestore
} bind def
429.757 310.4 o
grestore
gsave
426.577470 295.806250 translate
0.000000 rotate
0.000000 0.000000 m /zero glyphshow
grestore
gsave
/o {
gsave
newpath
translate
0.8 setlinewidth
1 setlinejoin
0 setlinecap
0 0 m
0 -3.5 l

gsave
0.000 setgray
fill
grestore
stroke
grestore
} bind def
469.03 310.4 o
grestore
gsave
462.670707 295.806250 translate
0.000000 rotate
0.000000 0.000000 m /one glyphshow
6.362305 0.000000 m /zero glyphshow
grestore
gsave
/o {
gsave
newpath
translate
0.8 setlinewidth
1 setlinejoin
0 setlinecap
0 0 m
0 -3.5 l

gsave
0.000 setgray
fill
grestore
stroke
grestore
} bind def
508.303 310.4 o
grestore
gsave
501.943631 295.806250 translate
0.000000 rotate
0.000000 0.000000 m /two glyphshow
6.362305 0.000000 m /zero glyphshow
grestore
gsave
/o {
gsave
newpath
translate
0.8 setlinewidth
1 setlinejoin
0 setlinecap
0 0 m
0 -3.5 l

gsave
0.000 setgray
fill
grestore
stroke
grestore
} bind def
547.576 310.4 o
grestore
gsave
541.216555 295.806250 translate
0.000000 rotate
0.000000 0.000000 m /three glyphshow
6.362305 0.000000 m /zero glyphshow
grestore
gsave
/o {
gsave
newpath
translate
0.8 setlinewidth
1 setlinejoin
0 setlinecap
0 0 m
0 -3.5 l

gsave
0.000 setgray
fill
grestore
stroke
grestore
} bind def
586.849 310.4 o
grestore
gsave
580.489479 295.806250 translate
0.000000 rotate
0.000000 0.000000 m /four glyphshow
6.362305 0.000000 m /zero glyphshow
grestore
gsave
/o {
gsave
newpath
translate
0.8 setlinewidth
1 setlinejoin
0 setlinecap
0 0 m
0 -3.5 l

gsave
0.000 setgray
fill
grestore
stroke
grestore
} bind def
626.122 310.4 o
grestore
gsave
619.762403 295.806250 translate
0.000000 rotate
0.000000 0.000000 m /five glyphshow
6.362305 0.000000 m /zero glyphshow
grestore
gsave
/o {
gsave
newpath
translate
0.8 setlinewidth
1 setlinejoin
0 setlinecap
0 0 m
0 -3.5 l

gsave
0.000 setgray
fill
grestore
stroke
grestore
} bind def
665.395 310.4 o
grestore
gsave
659.035327 295.806250 translate
0.000000 rotate
0.000000 0.000000 m /six glyphshow
6.362305 0.000000 m /zero glyphshow
grestore
gsave
/o {
gsave
newpath
translate
0.8 setlinewidth
1 setlinejoin
0 setlinecap
0 0 m
0 -3.5 l

gsave
0.000 setgray
fill
grestore
stroke
grestore
} bind def
704.668 310.4 o
grestore
gsave
698.308251 295.806250 translate
0.000000 rotate
0.000000 0.000000 m /seven glyphshow
6.362305 0.000000 m /zero glyphshow
grestore
gsave
/o {
gsave
newpath
translate
0.8 setlinewidth
1 setlinejoin
0 setlinecap
0 0 m
0 -3.5 l

gsave
0.000 setgray
fill
grestore
stroke
grestore
} bind def
743.941 310.4 o
grestore
gsave
737.581175 295.806250 translate
0.000000 rotate
0.000000 0.000000 m /eight glyphshow
6.362305 0.000000 m /zero glyphshow
grestore
gsave
/o {
gsave
newpath
translate
0.8 setlinewidth
1 setlinejoin
0 setlinecap
0 0 m
-3.5 0 l

gsave
0.000 setgray
fill
grestore
stroke
grestore
} bind def
422.492 312.095 o
grestore
gsave
386.866667 308.297942 translate
0.000000 rotate
0.000000 0.000000 m /zero glyphshow
6.362305 0.000000 m /period glyphshow
9.541016 0.000000 m /seven glyphshow
15.903320 0.000000 m /five glyphshow
22.265625 0.000000 m /zero glyphshow
grestore
gsave
/o {
gsave
newpath
translate
0.8 setlinewidth
1 setlinejoin
0 setlinecap
0 0 m
-3.5 0 l

gsave
0.000 setgray
fill
grestore
stroke
grestore
} bind def
422.492 339.081 o
grestore
gsave
386.866667 335.284341 translate
0.000000 rotate
0.000000 0.000000 m /zero glyphshow
6.362305 0.000000 m /period glyphshow
9.541016 0.000000 m /seven glyphshow
15.903320 0.000000 m /seven glyphshow
22.265625 0.000000 m /five glyphshow
grestore
gsave
/o {
gsave
newpath
translate
0.8 setlinewidth
1 setlinejoin
0 setlinecap
0 0 m
-3.5 0 l

gsave
0.000 setgray
fill
grestore
stroke
grestore
} bind def
422.492 366.068 o
grestore
gsave
386.866667 362.270740 translate
0.000000 rotate
0.000000 0.000000 m /zero glyphshow
6.362305 0.000000 m /period glyphshow
9.541016 0.000000 m /eight glyphshow
15.903320 0.000000 m /zero glyphshow
22.265625 0.000000 m /zero glyphshow
grestore
gsave
/o {
gsave
newpath
translate
0.8 setlinewidth
1 setlinejoin
0 setlinecap
0 0 m
-3.5 0 l

gsave
0.000 setgray
fill
grestore
stroke
grestore
} bind def
422.492 393.054 o
grestore
gsave
386.866667 389.257140 translate
0.000000 rotate
0.000000 0.000000 m /zero glyphshow
6.362305 0.000000 m /period glyphshow
9.541016 0.000000 m /eight glyphshow
15.903320 0.000000 m /two glyphshow
22.265625 0.000000 m /five glyphshow
grestore
gsave
/o {
gsave
newpath
translate
0.8 setlinewidth
1 setlinejoin
0 setlinecap
0 0 m
-3.5 0 l

gsave
0.000 setgray
fill
grestore
stroke
grestore
} bind def
422.492 420.04 o
grestore
gsave
386.866667 416.243539 translate
0.000000 rotate
0.000000 0.000000 m /zero glyphshow
6.362305 0.000000 m /period glyphshow
9.541016 0.000000 m /eight glyphshow
15.903320 0.000000 m /five glyphshow
22.265625 0.000000 m /zero glyphshow
grestore
gsave
/o {
gsave
newpath
translate
0.8 setlinewidth
1 setlinejoin
0 setlinecap
0 0 m
-3.5 0 l

gsave
0.000 setgray
fill
grestore
stroke
grestore
} bind def
422.492 447.027 o
grestore
gsave
386.866667 443.229939 translate
0.000000 rotate
0.000000 0.000000 m /zero glyphshow
6.362305 0.000000 m /period glyphshow
9.541016 0.000000 m /eight glyphshow
15.903320 0.000000 m /seven glyphshow
22.265625 0.000000 m /five glyphshow
grestore
gsave
/o {
gsave
newpath
translate
0.8 setlinewidth
1 setlinejoin
0 setlinecap
0 0 m
-3.5 0 l

gsave
0.000 setgray
fill
grestore
stroke
grestore
} bind def
422.492 474.013 o
grestore
gsave
386.866667 470.216338 translate
0.000000 rotate
0.000000 0.000000 m /zero glyphshow
6.362305 0.000000 m /period glyphshow
9.541016 0.000000 m /nine glyphshow
15.903320 0.000000 m /zero glyphshow
22.265625 0.000000 m /zero glyphshow
grestore
gsave
/o {
gsave
newpath
translate
0.8 setlinewidth
1 setlinejoin
0 setlinecap
0 0 m
-3.5 0 l

gsave
0.000 setgray
fill
grestore
stroke
grestore
} bind def
422.492 501 o
grestore
gsave
386.866667 497.202737 translate
0.000000 rotate
0.000000 0.000000 m /zero glyphshow
6.362305 0.000000 m /period glyphshow
9.541016 0.000000 m /nine glyphshow
15.903320 0.000000 m /two glyphshow
22.265625 0.000000 m /five glyphshow
grestore
gsave
/o {
gsave
newpath
translate
0.8 setlinewidth
1 setlinejoin
0 setlinecap
0 0 m
-3.5 0 l

gsave
0.000 setgray
fill
grestore
stroke
grestore
} bind def
422.492 527.986 o
grestore
gsave
386.866667 524.189137 translate
0.000000 rotate
0.000000 0.000000 m /zero glyphshow
6.362305 0.000000 m /period glyphshow
9.541016 0.000000 m /nine glyphshow
15.903320 0.000000 m /five glyphshow
22.265625 0.000000 m /zero glyphshow
grestore
1.500 setlinewidth
2 setlinecap
0.122 0.467 0.706 setrgbcolor
gsave
332.6 238.8 422.5 310.4 clipbox
437.611742 420.992003 m
441.539035 423.333784 l
445.466327 424.513958 l
449.39362 430.162167 l
453.320912 432.87275 l
457.248204 433.42397 l
461.175497 436.084972 l
465.102789 436.30958 l
469.030082 441.568538 l
472.957374 442.486993 l
476.884666 444.778266 l
480.811959 444.533005 l
484.739251 448.45177 l
488.666544 449.702801 l
492.593836 454.168597 l
496.521128 453.277157 l
500.448421 456.521778 l
504.375713 457.540867 l
508.303006 458.724802 l
512.230298 462.852964 l
516.157591 462.973374 l
520.084883 464.148265 l
524.012175 462.735874 l
527.939468 463.52434 l
531.86676 471.900727 l
535.794053 469.455789 l
539.721345 473.874396 l
543.648637 476.481446 l
547.57593 477.348292 l
551.503222 481.327493 l
555.430515 480.616297 l
559.357807 481.743267 l
563.285099 482.647215 l
567.212392 485.795978 l
571.139684 488.962777 l
575.066977 487.020385 l
578.994269 490.879169 l
582.921561 491.141286 l
586.848854 489.163305 l
590.776146 492.796605 l
594.703439 497.289206 l
598.630731 501.492103 l
602.558023 499.633162 l
606.485316 495.166098 l
610.412608 501.784612 l
614.339901 503.708243 l
618.267193 504.800957 l
622.194485 506.216537 l
626.121778 511.53004 l
630.04907 506.920812 l
633.976363 513.955571 l
637.903655 509.885685 l
641.830947 511.784533 l
645.75824 516.636841 l
649.685532 518.99245 l
653.612825 517.382393 l
657.540117 518.384822 l
661.467409 519.125475 l
665.394702 520.379144 l
669.321994 516.250967 l
673.249287 521.309694 l
677.176579 521.742447 l
681.103872 527.402033 l
685.031164 525.287874 l
688.958456 530.100217 l
692.885749 528.660789 l
696.813041 529.418761 l
700.740334 529.446479 l
704.667626 530.6334 l
708.594918 534.120217 l
712.522211 532.04195 l
716.449503 534.09244 l
720.376796 536.19957 l
724.304088 532.923332 l
728.23138 535.504013 l
732.158673 533.675565 l
736.085965 538.345455 l
740.013258 538.041735 l
stroke
grestore
1.000 0.498 0.055 setrgbcolor
gsave
332.6 238.8 422.5 310.4 clipbox
437.611742 409.349153 m
441.539035 408.677404 l
445.466327 407.08134 l
449.39362 410.321986 l
453.320912 409.894086 l
457.248204 410.481304 l
461.175497 411.043712 l
465.102789 406.960283 l
469.030082 409.592923 l
472.957374 410.453535 l
476.884666 408.104031 l
480.811959 404.004903 l
484.739251 406.903955 l
488.666544 406.736472 l
492.593836 406.647799 l
496.521128 406.017625 l
500.448421 403.717507 l
504.375713 402.359414 l
508.303006 403.949601 l
512.230298 402.887465 l
516.157591 399.11293 l
520.084883 402.316656 l
524.012175 400.741694 l
527.939468 401.564952 l
531.86676 400.175342 l
535.794053 395.601848 l
539.721345 396.569041 l
543.648637 392.784447 l
547.57593 395.372988 l
551.503222 388.495155 l
555.430515 379.726248 l
559.357807 394.107316 l
563.285099 383.335113 l
567.212392 382.653858 l
571.139684 383.042707 l
575.066977 384.739633 l
578.994269 385.424477 l
582.921561 379.533992 l
586.848854 387.474515 l
590.776146 376.847865 l
594.703439 371.384727 l
598.630731 374.29652 l
602.558023 381.434849 l
606.485316 382.641946 l
610.412608 360.553278 l
614.339901 380.166139 l
618.267193 373.919978 l
622.194485 372.962647 l
626.121778 361.966476 l
630.04907 369.988531 l
633.976363 366.232101 l
637.903655 355.567505 l
641.830947 367.374942 l
645.75824 356.149556 l
649.685532 356.200322 l
653.612825 351.181848 l
657.540117 350.753791 l
661.467409 359.532204 l
665.394702 358.574479 l
669.321994 371.095003 l
673.249287 358.036843 l
677.176579 363.190574 l
681.103872 354.121056 l
685.031164 354.20744 l
688.958456 342.333933 l
692.885749 346.299855 l
696.813041 347.025288 l
700.740334 349.799694 l
704.667626 343.877653 l
708.594918 342.739309 l
712.522211 337.384843 l
716.449503 339.793948 l
720.376796 346.477831 l
724.304088 332.152301 l
728.23138 321.254545 l
732.158673 335.24779 l
736.085965 323.395661 l
740.013258 347.024657 l
stroke
grestore
0.800 setlinewidth
0 setlinejoin
[] 0 setdash
0.000 setgray
gsave
422.491667 310.4 m
422.491667 549.2 l
stroke
grestore
gsave
755.133333 310.4 m
755.133333 549.2 l
stroke
grestore
gsave
422.491667 310.4 m
755.133333 310.4 l
stroke
grestore
gsave
422.491667 549.2 m
755.133333 549.2 l
stroke
grestore
/DejaVuSans findfont
12.000 scalefont
setfont
gsave
538.718750 555.200000 translate
0.000000 rotate
0.000000 0.000000 m /R glyphshow
8.337891 0.000000 m /M glyphshow
18.691406 0.000000 m /S glyphshow
26.308594 0.000000 m /p glyphshow
33.925781 0.000000 m /r glyphshow
38.859375 0.000000 m /o glyphshow
46.201172 0.000000 m /p glyphshow
53.818359 0.000000 m /space glyphshow
57.632812 0.000000 m /hyphen glyphshow
61.962891 0.000000 m /space glyphshow
65.777344 0.000000 m /zero glyphshow
73.412109 0.000000 m /period glyphshow
77.226562 0.000000 m /eight glyphshow
84.861328 0.000000 m /four glyphshow
92.496094 0.000000 m /two glyphshow
grestore
1.000 setlinewidth
0 setlinecap
0.800 setgray
gsave
429.491667 511.85625 m
495.007292 511.85625 l
496.340625 511.85625 497.007292 512.522917 497.007292 513.85625 c
497.007292 542.2 l
497.007292 543.533333 496.340625 544.2 495.007292 544.2 c
429.491667 544.2 l
428.158333 544.2 427.491667 543.533333 427.491667 542.2 c
427.491667 513.85625 l
427.491667 512.522917 428.158333 511.85625 429.491667 511.85625 c
cl
gsave
1.000 setgray
fill
grestore
stroke
grestore
1.500 setlinewidth
1 setlinejoin
2 setlinecap
[] 0 setdash
0.122 0.467 0.706 setrgbcolor
gsave
431.491667 536.10625 m
451.491667 536.10625 l
stroke
grestore
0.000 setgray
/DejaVuSans findfont
10.000 scalefont
setfont
gsave
459.491667 532.606250 translate
0.000000 rotate
0.000000 0.000000 m /a glyphshow
6.127930 0.000000 m /u glyphshow
12.465820 0.000000 m /c glyphshow
grestore
1.000 0.498 0.055 setrgbcolor
gsave
431.491667 521.434375 m
451.491667 521.434375 l
stroke
grestore
0.000 setgray
gsave
459.491667 517.934375 translate
0.000000 rotate
0.000000 0.000000 m /v glyphshow
5.917969 0.000000 m /a glyphshow
12.045898 0.000000 m /l glyphshow
14.824219 0.000000 m /A glyphshow
21.665039 0.000000 m /u glyphshow
28.002930 0.000000 m /c glyphshow
grestore
gsave
805.058333 310.4 m
1137.7 310.4 l
1137.7 549.2 l
805.058333 549.2 l
cl
1.000 setgray
fill
grestore
0.800 setlinewidth
0 setlinecap
gsave
/o {
gsave
newpath
translate
0.8 setlinewidth
1 setlinejoin
0 setlinecap
0 0 m
0 -3.5 l

gsave
0.000 setgray
fill
grestore
stroke
grestore
} bind def
812.324 310.4 o
grestore
gsave
809.144137 295.806250 translate
0.000000 rotate
0.000000 0.000000 m /zero glyphshow
grestore
gsave
/o {
gsave
newpath
translate
0.8 setlinewidth
1 setlinejoin
0 setlinecap
0 0 m
0 -3.5 l

gsave
0.000 setgray
fill
grestore
stroke
grestore
} bind def
851.597 310.4 o
grestore
gsave
845.237373 295.806250 translate
0.000000 rotate
0.000000 0.000000 m /one glyphshow
6.362305 0.000000 m /zero glyphshow
grestore
gsave
/o {
gsave
newpath
translate
0.8 setlinewidth
1 setlinejoin
0 setlinecap
0 0 m
0 -3.5 l

gsave
0.000 setgray
fill
grestore
stroke
grestore
} bind def
890.87 310.4 o
grestore
gsave
884.510297 295.806250 translate
0.000000 rotate
0.000000 0.000000 m /two glyphshow
6.362305 0.000000 m /zero glyphshow
grestore
gsave
/o {
gsave
newpath
translate
0.8 setlinewidth
1 setlinejoin
0 setlinecap
0 0 m
0 -3.5 l

gsave
0.000 setgray
fill
grestore
stroke
grestore
} bind def
930.143 310.4 o
grestore
gsave
923.783221 295.806250 translate
0.000000 rotate
0.000000 0.000000 m /three glyphshow
6.362305 0.000000 m /zero glyphshow
grestore
gsave
/o {
gsave
newpath
translate
0.8 setlinewidth
1 setlinejoin
0 setlinecap
0 0 m
0 -3.5 l

gsave
0.000 setgray
fill
grestore
stroke
grestore
} bind def
969.416 310.4 o
grestore
gsave
963.056145 295.806250 translate
0.000000 rotate
0.000000 0.000000 m /four glyphshow
6.362305 0.000000 m /zero glyphshow
grestore
gsave
/o {
gsave
newpath
translate
0.8 setlinewidth
1 setlinejoin
0 setlinecap
0 0 m
0 -3.5 l

gsave
0.000 setgray
fill
grestore
stroke
grestore
} bind def
1008.69 310.4 o
grestore
gsave
1002.329070 295.806250 translate
0.000000 rotate
0.000000 0.000000 m /five glyphshow
6.362305 0.000000 m /zero glyphshow
grestore
gsave
/o {
gsave
newpath
translate
0.8 setlinewidth
1 setlinejoin
0 setlinecap
0 0 m
0 -3.5 l

gsave
0.000 setgray
fill
grestore
stroke
grestore
} bind def
1047.96 310.4 o
grestore
gsave
1041.601994 295.806250 translate
0.000000 rotate
0.000000 0.000000 m /six glyphshow
6.362305 0.000000 m /zero glyphshow
grestore
gsave
/o {
gsave
newpath
translate
0.8 setlinewidth
1 setlinejoin
0 setlinecap
0 0 m
0 -3.5 l

gsave
0.000 setgray
fill
grestore
stroke
grestore
} bind def
1087.23 310.4 o
grestore
gsave
1080.874918 295.806250 translate
0.000000 rotate
0.000000 0.000000 m /seven glyphshow
6.362305 0.000000 m /zero glyphshow
grestore
gsave
/o {
gsave
newpath
translate
0.8 setlinewidth
1 setlinejoin
0 setlinecap
0 0 m
0 -3.5 l

gsave
0.000 setgray
fill
grestore
stroke
grestore
} bind def
1126.51 310.4 o
grestore
gsave
1120.147842 295.806250 translate
0.000000 rotate
0.000000 0.000000 m /eight glyphshow
6.362305 0.000000 m /zero glyphshow
grestore
gsave
/o {
gsave
newpath
translate
0.8 setlinewidth
1 setlinejoin
0 setlinecap
0 0 m
-3.5 0 l

gsave
0.000 setgray
fill
grestore
stroke
grestore
} bind def
805.058 340.044 o
grestore
gsave
775.792708 336.247380 translate
0.000000 rotate
0.000000 0.000000 m /zero glyphshow
6.362305 0.000000 m /period glyphshow
9.541016 0.000000 m /eight glyphshow
15.903320 0.000000 m /four glyphshow
grestore
gsave
/o {
gsave
newpath
translate
0.8 setlinewidth
1 setlinejoin
0 setlinecap
0 0 m
-3.5 0 l

gsave
0.000 setgray
fill
grestore
stroke
grestore
} bind def
805.058 377.197 o
grestore
gsave
775.792708 373.400286 translate
0.000000 rotate
0.000000 0.000000 m /zero glyphshow
6.362305 0.000000 m /period glyphshow
9.541016 0.000000 m /eight glyphshow
15.903320 0.000000 m /five glyphshow
grestore
gsave
/o {
gsave
newpath
translate
0.8 setlinewidth
1 setlinejoin
0 setlinecap
0 0 m
-3.5 0 l

gsave
0.000 setgray
fill
grestore
stroke
grestore
} bind def
805.058 414.35 o
grestore
gsave
775.792708 410.553193 translate
0.000000 rotate
0.000000 0.000000 m /zero glyphshow
6.362305 0.000000 m /period glyphshow
9.541016 0.000000 m /eight glyphshow
15.903320 0.000000 m /six glyphshow
grestore
gsave
/o {
gsave
newpath
translate
0.8 setlinewidth
1 setlinejoin
0 setlinecap
0 0 m
-3.5 0 l

gsave
0.000 setgray
fill
grestore
stroke
grestore
} bind def
805.058 451.503 o
grestore
gsave
775.792708 447.706099 translate
0.000000 rotate
0.000000 0.000000 m /zero glyphshow
6.362305 0.000000 m /period glyphshow
9.541016 0.000000 m /eight glyphshow
15.903320 0.000000 m /seven glyphshow
grestore
gsave
/o {
gsave
newpath
translate
0.8 setlinewidth
1 setlinejoin
0 setlinecap
0 0 m
-3.5 0 l

gsave
0.000 setgray
fill
grestore
stroke
grestore
} bind def
805.058 488.656 o
grestore
gsave
775.792708 484.859005 translate
0.000000 rotate
0.000000 0.000000 m /zero glyphshow
6.362305 0.000000 m /period glyphshow
9.541016 0.000000 m /eight glyphshow
15.903320 0.000000 m /eight glyphshow
grestore
gsave
/o {
gsave
newpath
translate
0.8 setlinewidth
1 setlinejoin
0 setlinecap
0 0 m
-3.5 0 l

gsave
0.000 setgray
fill
grestore
stroke
grestore
} bind def
805.058 525.809 o
grestore
gsave
775.792708 522.011912 translate
0.000000 rotate
0.000000 0.000000 m /zero glyphshow
6.362305 0.000000 m /period glyphshow
9.541016 0.000000 m /eight glyphshow
15.903320 0.000000 m /nine glyphshow
grestore
1.500 setlinewidth
2 setlinecap
0.122 0.467 0.706 setrgbcolor
gsave
332.6 238.8 805.1 310.4 clipbox
820.178409 381.097488 m
824.105701 385.602117 l
828.032994 393.82754 l
831.960286 398.202099 l
835.887579 404.52566 l
839.814871 407.854324 l
843.742164 411.989121 l
847.669456 417.40157 l
851.596748 420.770289 l
855.524041 424.257706 l
859.451333 424.835974 l
863.378626 431.415708 l
867.305918 435.056265 l
871.23321 437.696843 l
875.160503 441.406338 l
879.087795 444.158405 l
883.015088 446.000557 l
886.94238 445.436007 l
890.869672 451.016162 l
894.796965 452.06333 l
898.724257 456.000366 l
902.65155 456.493559 l
906.578842 460.066275 l
910.506134 462.578504 l
914.433427 464.034388 l
918.360719 465.929541 l
922.288012 468.599375 l
926.215304 470.982333 l
930.142596 470.75993 l
934.069889 473.903404 l
937.997181 476.962325 l
941.924474 477.488366 l
945.851766 479.870152 l
949.779058 479.002612 l
953.706351 481.875296 l
957.633643 484.578927 l
961.560936 486.521169 l
965.488228 488.448147 l
969.41552 490.376397 l
973.342813 491.160507 l
977.270105 492.332008 l
981.197398 493.488569 l
985.12469 495.85741 l
989.051982 496.802816 l
992.979275 499.16642 l
996.906567 501.348798 l
1000.83386 502.184911 l
1004.761152 503.821596 l
1008.688445 503.898515 l
1012.615737 506.362932 l
1016.543029 505.936358 l
1020.470322 509.04207 l
1024.397614 509.255669 l
1028.324907 510.1373 l
1032.252199 512.837039 l
1036.179491 514.28125 l
1040.106784 515.020515 l
1044.034076 515.559251 l
1047.961369 517.559557 l
1051.888661 518.283558 l
1055.815953 520.565728 l
1059.743246 521.304444 l
1063.670538 521.76015 l
1067.597831 522.923495 l
1071.525123 524.056336 l
1075.452415 524.722673 l
1079.379708 526.704871 l
1083.307 527.675069 l
1087.234293 529.158314 l
1091.161585 529.22386 l
1095.088877 530.18029 l
1099.01617 530.386058 l
1102.943462 532.725193 l
1106.870755 535.336964 l
1110.798047 535.024373 l
1114.725339 534.330152 l
1118.652632 537.005175 l
1122.579924 538.345455 l
stroke
grestore
1.000 0.498 0.055 setrgbcolor
gsave
332.6 238.8 805.1 310.4 clipbox
820.178409 341.063126 m
824.105701 343.857256 l
828.032994 349.187704 l
831.960286 350.116049 l
835.887579 352.204621 l
839.814871 352.283092 l
843.742164 354.304597 l
847.669456 356.023216 l
851.596748 355.9571 l
855.524041 356.588667 l
859.451333 351.603192 l
863.378626 355.293492 l
867.305918 354.088734 l
871.23321 354.244183 l
875.160503 354.896658 l
879.087795 355.498901 l
883.015088 354.301203 l
886.94238 352.424013 l
890.869672 354.340981 l
894.796965 354.762932 l
898.724257 353.567406 l
902.65155 354.418909 l
906.578842 351.830459 l
910.506134 351.929023 l
914.433427 351.747372 l
918.360719 352.397404 l
922.288012 349.688532 l
926.215304 350.686931 l
930.142596 350.961035 l
934.069889 350.287381 l
937.997181 347.740203 l
941.924474 349.258844 l
945.851766 346.458061 l
949.779058 347.397674 l
953.706351 346.390451 l
957.633643 347.574573 l
961.560936 345.253846 l
965.488228 344.071625 l
969.41552 343.036843 l
973.342813 344.110046 l
977.270105 343.637728 l
981.197398 344.431939 l
985.12469 339.62635 l
989.051982 342.986475 l
992.979275 341.831814 l
996.906567 338.865944 l
1000.83386 337.879221 l
1004.761152 338.897984 l
1008.688445 340.668057 l
1012.615737 335.197774 l
1016.543029 337.23109 l
1020.470322 335.014358 l
1024.397614 336.941101 l
1028.324907 334.244313 l
1032.252199 334.123755 l
1036.179491 333.68307 l
1040.106784 333.53794 l
1044.034076 331.433619 l
1047.961369 333.29411 l
1051.888661 331.817013 l
1055.815953 330.840608 l
1059.743246 331.909196 l
1063.670538 329.693007 l
1067.597831 330.553334 l
1071.525123 329.674 l
1075.452415 331.501093 l
1079.379708 328.683476 l
1083.307 327.388029 l
1087.234293 326.527294 l
1091.161585 325.344802 l
1095.088877 326.957118 l
1099.01617 325.41309 l
1102.943462 326.724829 l
1106.870755 321.254545 l
1110.798047 324.664359 l
1114.725339 325.673347 l
1118.652632 322.386263 l
1122.579924 322.690099 l
stroke
grestore
0.800 setlinewidth
0 setlinejoin
[] 0 setdash
0.000 setgray
gsave
805.058333 310.4 m
805.058333 549.2 l
stroke
grestore
gsave
1137.7 310.4 m
1137.7 549.2 l
stroke
grestore
gsave
805.058333 310.4 m
1137.7 310.4 l
stroke
grestore
gsave
805.058333 549.2 m
1137.7 549.2 l
stroke
grestore
/DejaVuSans findfont
12.000 scalefont
setfont
gsave
922.847917 555.200000 translate
0.000000 rotate
0.000000 0.000000 m /A glyphshow
8.208984 0.000000 m /d glyphshow
15.826172 0.000000 m /a glyphshow
23.179688 0.000000 m /g glyphshow
30.796875 0.000000 m /r glyphshow
35.730469 0.000000 m /a glyphshow
43.083984 0.000000 m /d glyphshow
50.701172 0.000000 m /space glyphshow
54.515625 0.000000 m /hyphen glyphshow
58.845703 0.000000 m /space glyphshow
62.660156 0.000000 m /zero glyphshow
70.294922 0.000000 m /period glyphshow
74.109375 0.000000 m /eight glyphshow
81.744141 0.000000 m /four glyphshow
89.378906 0.000000 m /four glyphshow
grestore
1.000 setlinewidth
0 setlinecap
0.800 setgray
gsave
812.058333 511.85625 m
877.573958 511.85625 l
878.907292 511.85625 879.573958 512.522917 879.573958 513.85625 c
879.573958 542.2 l
879.573958 543.533333 878.907292 544.2 877.573958 544.2 c
812.058333 544.2 l
810.725 544.2 810.058333 543.533333 810.058333 542.2 c
810.058333 513.85625 l
810.058333 512.522917 810.725 511.85625 812.058333 511.85625 c
cl
gsave
1.000 setgray
fill
grestore
stroke
grestore
1.500 setlinewidth
1 setlinejoin
2 setlinecap
[] 0 setdash
0.122 0.467 0.706 setrgbcolor
gsave
814.058333 536.10625 m
834.058333 536.10625 l
stroke
grestore
0.000 setgray
/DejaVuSans findfont
10.000 scalefont
setfont
gsave
842.058333 532.606250 translate
0.000000 rotate
0.000000 0.000000 m /a glyphshow
6.127930 0.000000 m /u glyphshow
12.465820 0.000000 m /c glyphshow
grestore
1.000 0.498 0.055 setrgbcolor
gsave
814.058333 521.434375 m
834.058333 521.434375 l
stroke
grestore
0.000 setgray
gsave
842.058333 517.934375 translate
0.000000 rotate
0.000000 0.000000 m /v glyphshow
5.917969 0.000000 m /a glyphshow
12.045898 0.000000 m /l glyphshow
14.824219 0.000000 m /A glyphshow
21.665039 0.000000 m /u glyphshow
28.002930 0.000000 m /c glyphshow
grestore
gsave
39.925 27.8 m
372.566667 27.8 l
372.566667 266.6 l
39.925 266.6 l
cl
1.000 setgray
fill
grestore
0.800 setlinewidth
0 setlinecap
gsave
/o {
gsave
newpath
translate
0.8 setlinewidth
1 setlinejoin
0 setlinecap
0 0 m
0 -3.5 l

gsave
0.000 setgray
fill
grestore
stroke
grestore
} bind def
47.1905 27.8 o
grestore
gsave
44.010803 13.206250 translate
0.000000 rotate
0.000000 0.000000 m /zero glyphshow
grestore
gsave
/o {
gsave
newpath
translate
0.8 setlinewidth
1 setlinejoin
0 setlinecap
0 0 m
0 -3.5 l

gsave
0.000 setgray
fill
grestore
stroke
grestore
} bind def
86.4634 27.8 o
grestore
gsave
80.104040 13.206250 translate
0.000000 rotate
0.000000 0.000000 m /one glyphshow
6.362305 0.000000 m /zero glyphshow
grestore
gsave
/o {
gsave
newpath
translate
0.8 setlinewidth
1 setlinejoin
0 setlinecap
0 0 m
0 -3.5 l

gsave
0.000 setgray
fill
grestore
stroke
grestore
} bind def
125.736 27.8 o
grestore
gsave
119.376964 13.206250 translate
0.000000 rotate
0.000000 0.000000 m /two glyphshow
6.362305 0.000000 m /zero glyphshow
grestore
gsave
/o {
gsave
newpath
translate
0.8 setlinewidth
1 setlinejoin
0 setlinecap
0 0 m
0 -3.5 l

gsave
0.000 setgray
fill
grestore
stroke
grestore
} bind def
165.009 27.8 o
grestore
gsave
158.649888 13.206250 translate
0.000000 rotate
0.000000 0.000000 m /three glyphshow
6.362305 0.000000 m /zero glyphshow
grestore
gsave
/o {
gsave
newpath
translate
0.8 setlinewidth
1 setlinejoin
0 setlinecap
0 0 m
0 -3.5 l

gsave
0.000 setgray
fill
grestore
stroke
grestore
} bind def
204.282 27.8 o
grestore
gsave
197.922812 13.206250 translate
0.000000 rotate
0.000000 0.000000 m /four glyphshow
6.362305 0.000000 m /zero glyphshow
grestore
gsave
/o {
gsave
newpath
translate
0.8 setlinewidth
1 setlinejoin
0 setlinecap
0 0 m
0 -3.5 l

gsave
0.000 setgray
fill
grestore
stroke
grestore
} bind def
243.555 27.8 o
grestore
gsave
237.195736 13.206250 translate
0.000000 rotate
0.000000 0.000000 m /five glyphshow
6.362305 0.000000 m /zero glyphshow
grestore
gsave
/o {
gsave
newpath
translate
0.8 setlinewidth
1 setlinejoin
0 setlinecap
0 0 m
0 -3.5 l

gsave
0.000 setgray
fill
grestore
stroke
grestore
} bind def
282.828 27.8 o
grestore
gsave
276.468660 13.206250 translate
0.000000 rotate
0.000000 0.000000 m /six glyphshow
6.362305 0.000000 m /zero glyphshow
grestore
gsave
/o {
gsave
newpath
translate
0.8 setlinewidth
1 setlinejoin
0 setlinecap
0 0 m
0 -3.5 l

gsave
0.000 setgray
fill
grestore
stroke
grestore
} bind def
322.101 27.8 o
grestore
gsave
315.741584 13.206250 translate
0.000000 rotate
0.000000 0.000000 m /seven glyphshow
6.362305 0.000000 m /zero glyphshow
grestore
gsave
/o {
gsave
newpath
translate
0.8 setlinewidth
1 setlinejoin
0 setlinecap
0 0 m
0 -3.5 l

gsave
0.000 setgray
fill
grestore
stroke
grestore
} bind def
361.374 27.8 o
grestore
gsave
355.014508 13.206250 translate
0.000000 rotate
0.000000 0.000000 m /eight glyphshow
6.362305 0.000000 m /zero glyphshow
grestore
gsave
/o {
gsave
newpath
translate
0.8 setlinewidth
1 setlinejoin
0 setlinecap
0 0 m
-3.5 0 l

gsave
0.000 setgray
fill
grestore
stroke
grestore
} bind def
39.925 45.697 o
grestore
gsave
10.659375 41.900146 translate
0.000000 rotate
0.000000 0.000000 m /zero glyphshow
6.362305 0.000000 m /period glyphshow
9.541016 0.000000 m /eight glyphshow
15.903320 0.000000 m /two glyphshow
grestore
gsave
/o {
gsave
newpath
translate
0.8 setlinewidth
1 setlinejoin
0 setlinecap
0 0 m
-3.5 0 l

gsave
0.000 setgray
fill
grestore
stroke
grestore
} bind def
39.925 91.365 o
grestore
gsave
10.659375 87.568160 translate
0.000000 rotate
0.000000 0.000000 m /zero glyphshow
6.362305 0.000000 m /period glyphshow
9.541016 0.000000 m /eight glyphshow
15.903320 0.000000 m /four glyphshow
grestore
gsave
/o {
gsave
newpath
translate
0.8 setlinewidth
1 setlinejoin
0 setlinecap
0 0 m
-3.5 0 l

gsave
0.000 setgray
fill
grestore
stroke
grestore
} bind def
39.925 137.033 o
grestore
gsave
10.659375 133.236173 translate
0.000000 rotate
0.000000 0.000000 m /zero glyphshow
6.362305 0.000000 m /period glyphshow
9.541016 0.000000 m /eight glyphshow
15.903320 0.000000 m /six glyphshow
grestore
gsave
/o {
gsave
newpath
translate
0.8 setlinewidth
1 setlinejoin
0 setlinecap
0 0 m
-3.5 0 l

gsave
0.000 setgray
fill
grestore
stroke
grestore
} bind def
39.925 182.701 o
grestore
gsave
10.659375 178.904186 translate
0.000000 rotate
0.000000 0.000000 m /zero glyphshow
6.362305 0.000000 m /period glyphshow
9.541016 0.000000 m /eight glyphshow
15.903320 0.000000 m /eight glyphshow
grestore
gsave
/o {
gsave
newpath
translate
0.8 setlinewidth
1 setlinejoin
0 setlinecap
0 0 m
-3.5 0 l

gsave
0.000 setgray
fill
grestore
stroke
grestore
} bind def
39.925 228.369 o
grestore
gsave
10.659375 224.572200 translate
0.000000 rotate
0.000000 0.000000 m /zero glyphshow
6.362305 0.000000 m /period glyphshow
9.541016 0.000000 m /nine glyphshow
15.903320 0.000000 m /zero glyphshow
grestore
1.500 setlinewidth
2 setlinecap
0.122 0.467 0.706 setrgbcolor
gsave
332.6 238.8 39.93 27.8 clipbox
55.045076 104.888231 m
58.972368 111.542344 l
62.899661 116.130901 l
66.826953 120.606009 l
70.754245 122.811089 l
74.681538 126.901134 l
78.60883 130.313197 l
82.536123 132.729233 l
86.463415 134.705299 l
90.390707 136.888198 l
94.318 139.766784 l
98.245292 139.509273 l
102.172585 143.895198 l
106.099877 145.845051 l
110.027169 147.366798 l
113.954462 150.698032 l
117.881754 150.408652 l
121.809047 154.272397 l
125.736339 155.046063 l
129.663631 156.67614 l
133.590924 159.435237 l
137.518216 161.362112 l
141.445509 162.102192 l
145.372801 164.785426 l
149.300093 167.674896 l
153.227386 169.377019 l
157.154678 168.326344 l
161.081971 172.289098 l
165.009263 174.994284 l
168.936555 176.052868 l
172.863848 178.657526 l
176.79114 178.982377 l
180.718433 182.745947 l
184.645725 185.015101 l
188.573018 184.140801 l
192.50031 185.884741 l
196.427602 190.896055 l
200.354895 189.932939 l
204.282187 193.838777 l
208.20948 194.606434 l
212.136772 194.75865 l
216.064064 199.120416 l
219.991357 198.236872 l
223.918649 201.883468 l
227.845942 205.079562 l
231.773234 203.992496 l
235.700526 208.741869 l
239.627819 207.754886 l
243.555111 212.287968 l
247.482404 212.285132 l
251.409696 215.108044 l
255.336988 217.811604 l
259.264281 217.833571 l
263.191573 217.233152 l
267.118866 220.363393 l
271.046158 222.602442 l
274.97345 221.152694 l
278.900743 225.454095 l
282.828035 225.877725 l
286.755328 230.08007 l
290.68262 230.205813 l
294.609912 234.169487 l
298.537205 233.608633 l
302.464497 235.415559 l
306.39179 238.057681 l
310.319082 238.364045 l
314.246374 242.41494 l
318.173667 241.364496 l
322.100959 242.936292 l
326.028252 245.404523 l
329.955544 246.529083 l
333.882836 249.990674 l
337.810129 247.430101 l
341.737421 253.21882 l
345.664714 251.260735 l
349.592006 250.742664 l
353.519299 255.745455 l
357.446591 255.655351 l
stroke
grestore
1.000 0.498 0.055 setrgbcolor
gsave
332.6 238.8 39.93 27.8 clipbox
55.045076 85.999968 m
58.972368 90.292575 l
62.899661 94.026641 l
66.826953 93.855591 l
70.754245 96.331145 l
74.681538 96.475662 l
78.60883 97.396913 l
82.536123 99.160314 l
86.463415 99.773091 l
90.390707 97.515563 l
94.318 99.300826 l
98.245292 96.602406 l
102.172585 100.25103 l
106.099877 98.062924 l
110.027169 99.688984 l
113.954462 100.311774 l
117.881754 97.861084 l
121.809047 99.728868 l
125.736339 99.233574 l
129.663631 95.297419 l
133.590924 98.386667 l
137.518216 97.666755 l
141.445509 97.41335 l
145.372801 93.873447 l
149.300093 96.125969 l
153.227386 97.422612 l
157.154678 93.918004 l
161.081971 93.698726 l
165.009263 92.481516 l
168.936555 89.575166 l
172.863848 92.43988 l
176.79114 92.984571 l
180.718433 91.400229 l
184.645725 88.584744 l
188.573018 86.142315 l
192.50031 88.755961 l
196.427602 86.31203 l
200.354895 84.829485 l
204.282187 83.650657 l
208.20948 80.462283 l
212.136772 82.181963 l
216.064064 82.496862 l
219.991357 81.441023 l
223.918649 83.960884 l
227.845942 79.014281 l
231.773234 74.661598 l
235.700526 78.223445 l
239.627819 76.487328 l
243.555111 72.662397 l
247.482404 77.394395 l
251.409696 76.036507 l
255.336988 72.573618 l
259.264281 66.834594 l
263.191573 72.776876 l
267.118866 64.293374 l
271.046158 71.411312 l
274.97345 59.061993 l
278.900743 66.568507 l
282.828035 68.01459 l
286.755328 62.541069 l
290.68262 64.123825 l
294.609912 62.321792 l
298.537205 61.598208 l
302.464497 59.602345 l
306.39179 57.475483 l
310.319082 62.74925 l
314.246374 58.163354 l
318.173667 48.576704 l
322.100959 48.967366 l
326.028252 55.995023 l
329.955544 54.468672 l
333.882836 42.106671 l
337.810129 46.40879 l
341.737421 47.039089 l
345.664714 55.073105 l
349.592006 38.654545 l
353.519299 44.430282 l
357.446591 49.112133 l
stroke
grestore
0.800 setlinewidth
0 setlinejoin
[] 0 setdash
0.000 setgray
gsave
39.925 27.8 m
39.925 266.6 l
stroke
grestore
gsave
372.566667 27.8 m
372.566667 266.6 l
stroke
grestore
gsave
39.925 27.8 m
372.566667 27.8 l
stroke
grestore
gsave
39.925 266.6 m
372.566667 266.6 l
stroke
grestore
/DejaVuSans findfont
12.000 scalefont
setfont
gsave
156.284896 272.600000 translate
0.000000 rotate
0.000000 0.000000 m /A glyphshow
8.208984 0.000000 m /d glyphshow
15.826172 0.000000 m /a glyphshow
23.179688 0.000000 m /d glyphshow
30.796875 0.000000 m /e glyphshow
38.179688 0.000000 m /l glyphshow
41.513672 0.000000 m /t glyphshow
46.218750 0.000000 m /a glyphshow
53.572266 0.000000 m /space glyphshow
57.386719 0.000000 m /hyphen glyphshow
61.716797 0.000000 m /space glyphshow
65.531250 0.000000 m /zero glyphshow
73.166016 0.000000 m /period glyphshow
76.980469 0.000000 m /eight glyphshow
84.615234 0.000000 m /four glyphshow
92.250000 0.000000 m /four glyphshow
grestore
1.000 setlinewidth
0 setlinecap
0.800 setgray
gsave
46.925 229.25625 m
112.440625 229.25625 l
113.773958 229.25625 114.440625 229.922917 114.440625 231.25625 c
114.440625 259.6 l
114.440625 260.933333 113.773958 261.6 112.440625 261.6 c
46.925 261.6 l
45.591667 261.6 44.925 260.933333 44.925 259.6 c
44.925 231.25625 l
44.925 229.922917 45.591667 229.25625 46.925 229.25625 c
cl
gsave
1.000 setgray
fill
grestore
stroke
grestore
1.500 setlinewidth
1 setlinejoin
2 setlinecap
[] 0 setdash
0.122 0.467 0.706 setrgbcolor
gsave
48.925 253.50625 m
68.925 253.50625 l
stroke
grestore
0.000 setgray
/DejaVuSans findfont
10.000 scalefont
setfont
gsave
76.925000 250.006250 translate
0.000000 rotate
0.000000 0.000000 m /a glyphshow
6.127930 0.000000 m /u glyphshow
12.465820 0.000000 m /c glyphshow
grestore
1.000 0.498 0.055 setrgbcolor
gsave
48.925 238.834375 m
68.925 238.834375 l
stroke
grestore
0.000 setgray
gsave
76.925000 235.334375 translate
0.000000 rotate
0.000000 0.000000 m /v glyphshow
5.917969 0.000000 m /a glyphshow
12.045898 0.000000 m /l glyphshow
14.824219 0.000000 m /A glyphshow
21.665039 0.000000 m /u glyphshow
28.002930 0.000000 m /c glyphshow
grestore
gsave
422.491667 27.8 m
755.133333 27.8 l
755.133333 266.6 l
422.491667 266.6 l
cl
1.000 setgray
fill
grestore
0.800 setlinewidth
0 setlinecap
gsave
/o {
gsave
newpath
translate
0.8 setlinewidth
1 setlinejoin
0 setlinecap
0 0 m
0 -3.5 l

gsave
0.000 setgray
fill
grestore
stroke
grestore
} bind def
429.757 27.8 o
grestore
gsave
426.577470 13.206250 translate
0.000000 rotate
0.000000 0.000000 m /zero glyphshow
grestore
gsave
/o {
gsave
newpath
translate
0.8 setlinewidth
1 setlinejoin
0 setlinecap
0 0 m
0 -3.5 l

gsave
0.000 setgray
fill
grestore
stroke
grestore
} bind def
469.03 27.8 o
grestore
gsave
462.670707 13.206250 translate
0.000000 rotate
0.000000 0.000000 m /one glyphshow
6.362305 0.000000 m /zero glyphshow
grestore
gsave
/o {
gsave
newpath
translate
0.8 setlinewidth
1 setlinejoin
0 setlinecap
0 0 m
0 -3.5 l

gsave
0.000 setgray
fill
grestore
stroke
grestore
} bind def
508.303 27.8 o
grestore
gsave
501.943631 13.206250 translate
0.000000 rotate
0.000000 0.000000 m /two glyphshow
6.362305 0.000000 m /zero glyphshow
grestore
gsave
/o {
gsave
newpath
translate
0.8 setlinewidth
1 setlinejoin
0 setlinecap
0 0 m
0 -3.5 l

gsave
0.000 setgray
fill
grestore
stroke
grestore
} bind def
547.576 27.8 o
grestore
gsave
541.216555 13.206250 translate
0.000000 rotate
0.000000 0.000000 m /three glyphshow
6.362305 0.000000 m /zero glyphshow
grestore
gsave
/o {
gsave
newpath
translate
0.8 setlinewidth
1 setlinejoin
0 setlinecap
0 0 m
0 -3.5 l

gsave
0.000 setgray
fill
grestore
stroke
grestore
} bind def
586.849 27.8 o
grestore
gsave
580.489479 13.206250 translate
0.000000 rotate
0.000000 0.000000 m /four glyphshow
6.362305 0.000000 m /zero glyphshow
grestore
gsave
/o {
gsave
newpath
translate
0.8 setlinewidth
1 setlinejoin
0 setlinecap
0 0 m
0 -3.5 l

gsave
0.000 setgray
fill
grestore
stroke
grestore
} bind def
626.122 27.8 o
grestore
gsave
619.762403 13.206250 translate
0.000000 rotate
0.000000 0.000000 m /five glyphshow
6.362305 0.000000 m /zero glyphshow
grestore
gsave
/o {
gsave
newpath
translate
0.8 setlinewidth
1 setlinejoin
0 setlinecap
0 0 m
0 -3.5 l

gsave
0.000 setgray
fill
grestore
stroke
grestore
} bind def
665.395 27.8 o
grestore
gsave
659.035327 13.206250 translate
0.000000 rotate
0.000000 0.000000 m /six glyphshow
6.362305 0.000000 m /zero glyphshow
grestore
gsave
/o {
gsave
newpath
translate
0.8 setlinewidth
1 setlinejoin
0 setlinecap
0 0 m
0 -3.5 l

gsave
0.000 setgray
fill
grestore
stroke
grestore
} bind def
704.668 27.8 o
grestore
gsave
698.308251 13.206250 translate
0.000000 rotate
0.000000 0.000000 m /seven glyphshow
6.362305 0.000000 m /zero glyphshow
grestore
gsave
/o {
gsave
newpath
translate
0.8 setlinewidth
1 setlinejoin
0 setlinecap
0 0 m
0 -3.5 l

gsave
0.000 setgray
fill
grestore
stroke
grestore
} bind def
743.941 27.8 o
grestore
gsave
737.581175 13.206250 translate
0.000000 rotate
0.000000 0.000000 m /eight glyphshow
6.362305 0.000000 m /zero glyphshow
grestore
gsave
/o {
gsave
newpath
translate
0.8 setlinewidth
1 setlinejoin
0 setlinecap
0 0 m
-3.5 0 l

gsave
0.000 setgray
fill
grestore
stroke
grestore
} bind def
422.492 60.4763 o
grestore
gsave
393.226042 56.679400 translate
0.000000 rotate
0.000000 0.000000 m /zero glyphshow
6.362305 0.000000 m /period glyphshow
9.541016 0.000000 m /seven glyphshow
15.903320 0.000000 m /five glyphshow
grestore
gsave
/o {
gsave
newpath
translate
0.8 setlinewidth
1 setlinejoin
0 setlinecap
0 0 m
-3.5 0 l

gsave
0.000 setgray
fill
grestore
stroke
grestore
} bind def
422.492 105.044 o
grestore
gsave
393.226042 101.247440 translate
0.000000 rotate
0.000000 0.000000 m /zero glyphshow
6.362305 0.000000 m /period glyphshow
9.541016 0.000000 m /eight glyphshow
15.903320 0.000000 m /zero glyphshow
grestore
gsave
/o {
gsave
newpath
translate
0.8 setlinewidth
1 setlinejoin
0 setlinecap
0 0 m
-3.5 0 l

gsave
0.000 setgray
fill
grestore
stroke
grestore
} bind def
422.492 149.612 o
grestore
gsave
393.226042 145.815480 translate
0.000000 rotate
0.000000 0.000000 m /zero glyphshow
6.362305 0.000000 m /period glyphshow
9.541016 0.000000 m /eight glyphshow
15.903320 0.000000 m /five glyphshow
grestore
gsave
/o {
gsave
newpath
translate
0.8 setlinewidth
1 setlinejoin
0 setlinecap
0 0 m
-3.5 0 l

gsave
0.000 setgray
fill
grestore
stroke
grestore
} bind def
422.492 194.18 o
grestore
gsave
393.226042 190.383520 translate
0.000000 rotate
0.000000 0.000000 m /zero glyphshow
6.362305 0.000000 m /period glyphshow
9.541016 0.000000 m /nine glyphshow
15.903320 0.000000 m /zero glyphshow
grestore
gsave
/o {
gsave
newpath
translate
0.8 setlinewidth
1 setlinejoin
0 setlinecap
0 0 m
-3.5 0 l

gsave
0.000 setgray
fill
grestore
stroke
grestore
} bind def
422.492 238.748 o
grestore
gsave
393.226042 234.951561 translate
0.000000 rotate
0.000000 0.000000 m /zero glyphshow
6.362305 0.000000 m /period glyphshow
9.541016 0.000000 m /nine glyphshow
15.903320 0.000000 m /five glyphshow
grestore
1.500 setlinewidth
2 setlinecap
0.122 0.467 0.706 setrgbcolor
gsave
332.6 238.8 422.5 27.8 clipbox
437.611742 149.42463 m
441.539035 152.489711 l
445.466327 155.855481 l
449.39362 157.017891 l
453.320912 158.895638 l
457.248204 161.932301 l
461.175497 162.995786 l
465.102789 165.226415 l
469.030082 167.013201 l
472.957374 168.914118 l
476.884666 170.919884 l
480.811959 173.042563 l
484.739251 174.528732 l
488.666544 175.746487 l
492.593836 178.460708 l
496.521128 181.19515 l
500.448421 181.6863 l
504.375713 184.73024 l
508.303006 185.258688 l
512.230298 188.077227 l
516.157591 188.923664 l
520.084883 191.208812 l
524.012175 196.229274 l
527.939468 195.858005 l
531.86676 196.597014 l
535.794053 201.160391 l
539.721345 201.857831 l
543.648637 203.328177 l
547.57593 204.288069 l
551.503222 208.578857 l
555.430515 210.388975 l
559.357807 213.11888 l
563.285099 212.035714 l
567.212392 213.538284 l
571.139684 216.593922 l
575.066977 217.978005 l
578.994269 218.669054 l
582.921561 223.122891 l
586.848854 223.219524 l
590.776146 224.36068 l
594.703439 226.995495 l
598.630731 226.97816 l
602.558023 228.92249 l
606.485316 230.074901 l
610.412608 232.215658 l
614.339901 233.16588 l
618.267193 234.133976 l
622.194485 235.299282 l
626.121778 236.257768 l
630.04907 233.562079 l
633.976363 233.60168 l
637.903655 238.687899 l
641.830947 241.041945 l
645.75824 236.270903 l
649.685532 240.817394 l
653.612825 242.716492 l
657.540117 242.081842 l
661.467409 243.812678 l
665.394702 242.56559 l
669.321994 241.198789 l
673.249287 242.640221 l
677.176579 244.271893 l
681.103872 248.814316 l
685.031164 247.765701 l
688.958456 247.228707 l
692.885749 246.618047 l
696.813041 245.674802 l
700.740334 251.326438 l
704.667626 248.621874 l
708.594918 251.349739 l
712.522211 251.583403 l
716.449503 253.24247 l
720.376796 250.225787 l
724.304088 253.717386 l
728.23138 249.912884 l
732.158673 253.404908 l
736.085965 251.981906 l
740.013258 255.745455 l
stroke
grestore
1.000 0.498 0.055 setrgbcolor
gsave
332.6 238.8 422.5 27.8 clipbox
437.611742 139.431016 m
441.539035 142.307622 l
445.466327 142.859517 l
449.39362 142.396315 l
453.320912 143.793023 l
457.248204 144.129815 l
461.175497 143.104913 l
465.102789 143.266273 l
469.030082 143.517206 l
472.957374 142.078024 l
476.884666 142.885444 l
480.811959 143.592903 l
484.739251 143.205755 l
488.666544 141.88699 l
492.593836 137.905128 l
496.521128 140.758152 l
500.448421 138.475589 l
504.375713 136.703068 l
508.303006 135.879329 l
512.230298 134.885337 l
516.157591 133.37365 l
520.084883 133.632563 l
524.012175 125.993741 l
527.939468 131.80291 l
531.86676 128.423853 l
535.794053 130.22748 l
539.721345 128.844289 l
543.648637 125.428035 l
547.57593 119.709154 l
551.503222 121.026095 l
555.430515 118.02298 l
559.357807 112.830198 l
563.285099 118.909518 l
567.212392 112.352925 l
571.139684 119.286764 l
575.066977 113.154157 l
578.994269 112.81287 l
582.921561 104.682182 l
586.848854 98.198517 l
590.776146 104.666418 l
594.703439 92.970688 l
598.630731 97.284978 l
602.558023 91.188884 l
606.485316 93.033714 l
610.412608 84.939605 l
614.339901 86.051018 l
618.267193 95.106547 l
622.194485 92.425926 l
626.121778 92.841443 l
630.04907 93.451121 l
633.976363 98.436096 l
637.903655 75.320063 l
641.830947 73.203356 l
645.75824 94.718422 l
649.685532 85.399127 l
653.612825 82.742348 l
657.540117 84.011506 l
661.467409 55.855192 l
665.394702 81.496707 l
669.321994 67.327903 l
673.249287 84.794595 l
677.176579 72.297862 l
681.103872 65.625378 l
685.031164 74.275227 l
688.958456 80.070456 l
692.885749 38.654545 l
696.813041 77.457225 l
700.740334 56.504086 l
704.667626 72.375252 l
708.594918 66.950559 l
712.522211 65.269532 l
716.449503 55.733732 l
720.376796 63.635929 l
724.304088 55.173628 l
728.23138 68.376713 l
732.158673 53.631813 l
736.085965 64.020959 l
740.013258 46.486974 l
stroke
grestore
0.800 setlinewidth
0 setlinejoin
[] 0 setdash
0.000 setgray
gsave
422.491667 27.8 m
422.491667 266.6 l
stroke
grestore
gsave
755.133333 27.8 m
755.133333 266.6 l
stroke
grestore
gsave
422.491667 27.8 m
755.133333 27.8 l
stroke
grestore
gsave
422.491667 266.6 m
755.133333 266.6 l
stroke
grestore
/DejaVuSans findfont
12.000 scalefont
setfont
gsave
548.210938 272.600000 translate
0.000000 rotate
0.000000 0.000000 m /A glyphshow
8.208984 0.000000 m /d glyphshow
15.826172 0.000000 m /a glyphshow
23.179688 0.000000 m /m glyphshow
34.869141 0.000000 m /space glyphshow
38.683594 0.000000 m /hyphen glyphshow
43.013672 0.000000 m /space glyphshow
46.828125 0.000000 m /zero glyphshow
54.462891 0.000000 m /period glyphshow
58.277344 0.000000 m /eight glyphshow
65.912109 0.000000 m /four glyphshow
73.546875 0.000000 m /four glyphshow
grestore
1.000 setlinewidth
0 setlinecap
0.800 setgray
gsave
429.491667 229.25625 m
495.007292 229.25625 l
496.340625 229.25625 497.007292 229.922917 497.007292 231.25625 c
497.007292 259.6 l
497.007292 260.933333 496.340625 261.6 495.007292 261.6 c
429.491667 261.6 l
428.158333 261.6 427.491667 260.933333 427.491667 259.6 c
427.491667 231.25625 l
427.491667 229.922917 428.158333 229.25625 429.491667 229.25625 c
cl
gsave
1.000 setgray
fill
grestore
stroke
grestore
1.500 setlinewidth
1 setlinejoin
2 setlinecap
[] 0 setdash
0.122 0.467 0.706 setrgbcolor
gsave
431.491667 253.50625 m
451.491667 253.50625 l
stroke
grestore
0.000 setgray
/DejaVuSans findfont
10.000 scalefont
setfont
gsave
459.491667 250.006250 translate
0.000000 rotate
0.000000 0.000000 m /a glyphshow
6.127930 0.000000 m /u glyphshow
12.465820 0.000000 m /c glyphshow
grestore
1.000 0.498 0.055 setrgbcolor
gsave
431.491667 238.834375 m
451.491667 238.834375 l
stroke
grestore
0.000 setgray
gsave
459.491667 235.334375 translate
0.000000 rotate
0.000000 0.000000 m /v glyphshow
5.917969 0.000000 m /a glyphshow
12.045898 0.000000 m /l glyphshow
14.824219 0.000000 m /A glyphshow
21.665039 0.000000 m /u glyphshow
28.002930 0.000000 m /c glyphshow
grestore
gsave
805.058333 27.8 m
1137.7 27.8 l
1137.7 266.6 l
805.058333 266.6 l
cl
1.000 setgray
fill
grestore
0.800 setlinewidth
0 setlinecap
gsave
/o {
gsave
newpath
translate
0.8 setlinewidth
1 setlinejoin
0 setlinecap
0 0 m
0 -3.5 l

gsave
0.000 setgray
fill
grestore
stroke
grestore
} bind def
812.324 27.8 o
grestore
gsave
809.144137 13.206250 translate
0.000000 rotate
0.000000 0.000000 m /zero glyphshow
grestore
gsave
/o {
gsave
newpath
translate
0.8 setlinewidth
1 setlinejoin
0 setlinecap
0 0 m
0 -3.5 l

gsave
0.000 setgray
fill
grestore
stroke
grestore
} bind def
851.597 27.8 o
grestore
gsave
845.237373 13.206250 translate
0.000000 rotate
0.000000 0.000000 m /one glyphshow
6.362305 0.000000 m /zero glyphshow
grestore
gsave
/o {
gsave
newpath
translate
0.8 setlinewidth
1 setlinejoin
0 setlinecap
0 0 m
0 -3.5 l

gsave
0.000 setgray
fill
grestore
stroke
grestore
} bind def
890.87 27.8 o
grestore
gsave
884.510297 13.206250 translate
0.000000 rotate
0.000000 0.000000 m /two glyphshow
6.362305 0.000000 m /zero glyphshow
grestore
gsave
/o {
gsave
newpath
translate
0.8 setlinewidth
1 setlinejoin
0 setlinecap
0 0 m
0 -3.5 l

gsave
0.000 setgray
fill
grestore
stroke
grestore
} bind def
930.143 27.8 o
grestore
gsave
923.783221 13.206250 translate
0.000000 rotate
0.000000 0.000000 m /three glyphshow
6.362305 0.000000 m /zero glyphshow
grestore
gsave
/o {
gsave
newpath
translate
0.8 setlinewidth
1 setlinejoin
0 setlinecap
0 0 m
0 -3.5 l

gsave
0.000 setgray
fill
grestore
stroke
grestore
} bind def
969.416 27.8 o
grestore
gsave
963.056145 13.206250 translate
0.000000 rotate
0.000000 0.000000 m /four glyphshow
6.362305 0.000000 m /zero glyphshow
grestore
gsave
/o {
gsave
newpath
translate
0.8 setlinewidth
1 setlinejoin
0 setlinecap
0 0 m
0 -3.5 l

gsave
0.000 setgray
fill
grestore
stroke
grestore
} bind def
1008.69 27.8 o
grestore
gsave
1002.329070 13.206250 translate
0.000000 rotate
0.000000 0.000000 m /five glyphshow
6.362305 0.000000 m /zero glyphshow
grestore
gsave
/o {
gsave
newpath
translate
0.8 setlinewidth
1 setlinejoin
0 setlinecap
0 0 m
0 -3.5 l

gsave
0.000 setgray
fill
grestore
stroke
grestore
} bind def
1047.96 27.8 o
grestore
gsave
1041.601994 13.206250 translate
0.000000 rotate
0.000000 0.000000 m /six glyphshow
6.362305 0.000000 m /zero glyphshow
grestore
gsave
/o {
gsave
newpath
translate
0.8 setlinewidth
1 setlinejoin
0 setlinecap
0 0 m
0 -3.5 l

gsave
0.000 setgray
fill
grestore
stroke
grestore
} bind def
1087.23 27.8 o
grestore
gsave
1080.874918 13.206250 translate
0.000000 rotate
0.000000 0.000000 m /seven glyphshow
6.362305 0.000000 m /zero glyphshow
grestore
gsave
/o {
gsave
newpath
translate
0.8 setlinewidth
1 setlinejoin
0 setlinecap
0 0 m
0 -3.5 l

gsave
0.000 setgray
fill
grestore
stroke
grestore
} bind def
1126.51 27.8 o
grestore
gsave
1120.147842 13.206250 translate
0.000000 rotate
0.000000 0.000000 m /eight glyphshow
6.362305 0.000000 m /zero glyphshow
grestore
gsave
/o {
gsave
newpath
translate
0.8 setlinewidth
1 setlinejoin
0 setlinecap
0 0 m
-3.5 0 l

gsave
0.000 setgray
fill
grestore
stroke
grestore
} bind def
805.058 29.3865 o
grestore
gsave
775.792708 25.589588 translate
0.000000 rotate
0.000000 0.000000 m /zero glyphshow
6.362305 0.000000 m /period glyphshow
9.541016 0.000000 m /seven glyphshow
15.903320 0.000000 m /eight glyphshow
grestore
gsave
/o {
gsave
newpath
translate
0.8 setlinewidth
1 setlinejoin
0 setlinecap
0 0 m
-3.5 0 l

gsave
0.000 setgray
fill
grestore
stroke
grestore
} bind def
805.058 56.7537 o
grestore
gsave
775.792708 52.956857 translate
0.000000 rotate
0.000000 0.000000 m /zero glyphshow
6.362305 0.000000 m /period glyphshow
9.541016 0.000000 m /eight glyphshow
15.903320 0.000000 m /zero glyphshow
grestore
gsave
/o {
gsave
newpath
translate
0.8 setlinewidth
1 setlinejoin
0 setlinecap
0 0 m
-3.5 0 l

gsave
0.000 setgray
fill
grestore
stroke
grestore
} bind def
805.058 84.121 o
grestore
gsave
775.792708 80.324126 translate
0.000000 rotate
0.000000 0.000000 m /zero glyphshow
6.362305 0.000000 m /period glyphshow
9.541016 0.000000 m /eight glyphshow
15.903320 0.000000 m /two glyphshow
grestore
gsave
/o {
gsave
newpath
translate
0.8 setlinewidth
1 setlinejoin
0 setlinecap
0 0 m
-3.5 0 l

gsave
0.000 setgray
fill
grestore
stroke
grestore
} bind def
805.058 111.488 o
grestore
gsave
775.792708 107.691396 translate
0.000000 rotate
0.000000 0.000000 m /zero glyphshow
6.362305 0.000000 m /period glyphshow
9.541016 0.000000 m /eight glyphshow
15.903320 0.000000 m /four glyphshow
grestore
gsave
/o {
gsave
newpath
translate
0.8 setlinewidth
1 setlinejoin
0 setlinecap
0 0 m
-3.5 0 l

gsave
0.000 setgray
fill
grestore
stroke
grestore
} bind def
805.058 138.856 o
grestore
gsave
775.792708 135.058665 translate
0.000000 rotate
0.000000 0.000000 m /zero glyphshow
6.362305 0.000000 m /period glyphshow
9.541016 0.000000 m /eight glyphshow
15.903320 0.000000 m /six glyphshow
grestore
gsave
/o {
gsave
newpath
translate
0.8 setlinewidth
1 setlinejoin
0 setlinecap
0 0 m
-3.5 0 l

gsave
0.000 setgray
fill
grestore
stroke
grestore
} bind def
805.058 166.223 o
grestore
gsave
775.792708 162.425934 translate
0.000000 rotate
0.000000 0.000000 m /zero glyphshow
6.362305 0.000000 m /period glyphshow
9.541016 0.000000 m /eight glyphshow
15.903320 0.000000 m /eight glyphshow
grestore
gsave
/o {
gsave
newpath
translate
0.8 setlinewidth
1 setlinejoin
0 setlinecap
0 0 m
-3.5 0 l

gsave
0.000 setgray
fill
grestore
stroke
grestore
} bind def
805.058 193.59 o
grestore
gsave
775.792708 189.793204 translate
0.000000 rotate
0.000000 0.000000 m /zero glyphshow
6.362305 0.000000 m /period glyphshow
9.541016 0.000000 m /nine glyphshow
15.903320 0.000000 m /zero glyphshow
grestore
gsave
/o {
gsave
newpath
translate
0.8 setlinewidth
1 setlinejoin
0 setlinecap
0 0 m
-3.5 0 l

gsave
0.000 setgray
fill
grestore
stroke
grestore
} bind def
805.058 220.957 o
grestore
gsave
775.792708 217.160473 translate
0.000000 rotate
0.000000 0.000000 m /zero glyphshow
6.362305 0.000000 m /period glyphshow
9.541016 0.000000 m /nine glyphshow
15.903320 0.000000 m /two glyphshow
grestore
gsave
/o {
gsave
newpath
translate
0.8 setlinewidth
1 setlinejoin
0 setlinecap
0 0 m
-3.5 0 l

gsave
0.000 setgray
fill
grestore
stroke
grestore
} bind def
805.058 248.325 o
grestore
gsave
775.792708 244.527742 translate
0.000000 rotate
0.000000 0.000000 m /zero glyphshow
6.362305 0.000000 m /period glyphshow
9.541016 0.000000 m /nine glyphshow
15.903320 0.000000 m /four glyphshow
grestore
1.500 setlinewidth
2 setlinecap
0.122 0.467 0.706 setrgbcolor
gsave
332.6 238.8 805.1 27.8 clipbox
820.178409 118.667888 m
824.105701 125.398813 l
828.032994 129.024811 l
831.960286 132.921073 l
835.887579 132.622718 l
839.814871 135.882586 l
843.742164 138.480449 l
847.669456 138.883976 l
851.596748 145.014754 l
855.524041 146.551192 l
859.451333 147.731192 l
863.378626 150.422955 l
867.305918 151.550731 l
871.23321 152.972141 l
875.160503 155.120015 l
879.087795 156.968633 l
883.015088 161.564829 l
886.94238 161.948661 l
890.869672 163.263089 l
894.796965 164.947515 l
898.724257 167.739003 l
902.65155 169.481053 l
906.578842 172.612261 l
910.506134 173.122594 l
914.433427 173.991102 l
918.360719 175.399063 l
922.288012 178.977845 l
926.215304 180.239068 l
930.142596 179.683805 l
934.069889 180.341254 l
937.997181 187.569687 l
941.924474 188.730754 l
945.851766 189.293274 l
949.779058 191.949423 l
953.706351 192.590437 l
957.633643 193.996488 l
961.560936 199.171729 l
965.488228 198.283811 l
969.41552 201.338407 l
973.342813 205.760086 l
977.270105 205.868031 l
981.197398 205.603242 l
985.12469 207.044916 l
989.051982 208.348818 l
992.979275 213.60892 l
996.906567 213.530774 l
1000.83386 215.83527 l
1004.761152 216.778792 l
1008.688445 217.106763 l
1012.615737 221.21233 l
1016.543029 219.662233 l
1020.470322 222.251323 l
1024.397614 219.156906 l
1028.324907 226.483199 l
1032.252199 227.966679 l
1036.179491 229.131531 l
1040.106784 231.871934 l
1044.034076 230.99435 l
1047.961369 230.499413 l
1051.888661 233.343133 l
1055.815953 231.287883 l
1059.743246 232.878473 l
1063.670538 237.308438 l
1067.597831 236.375663 l
1071.525123 241.709337 l
1075.452415 241.176213 l
1079.379708 241.399243 l
1083.307 244.59027 l
1087.234293 242.536481 l
1091.161585 245.171226 l
1095.088877 245.656794 l
1099.01617 247.183412 l
1102.943462 250.421031 l
1106.870755 249.153911 l
1110.798047 251.070919 l
1114.725339 253.075425 l
1118.652632 253.213253 l
1122.579924 255.745455 l
stroke
grestore
1.000 0.498 0.055 setrgbcolor
gsave
332.6 238.8 805.1 27.8 clipbox
820.178409 107.701846 m
824.105701 111.511212 l
828.032994 113.836513 l
831.960286 114.906709 l
835.887579 113.677856 l
839.814871 114.620147 l
843.742164 112.991376 l
847.669456 112.564557 l
851.596748 114.831006 l
855.524041 115.427582 l
859.451333 114.049922 l
863.378626 115.313277 l
867.305918 114.443789 l
871.23321 115.880102 l
875.160503 113.246387 l
879.087795 112.17124 l
883.015088 113.132882 l
886.94238 113.429895 l
890.869672 111.121345 l
894.796965 108.910549 l
898.724257 112.320347 l
902.65155 112.85407 l
906.578842 109.347718 l
910.506134 109.823338 l
914.433427 108.652887 l
918.360719 106.240883 l
922.288012 107.911255 l
926.215304 106.592048 l
930.142596 105.323643 l
934.069889 106.589398 l
937.997181 103.577717 l
941.924474 103.752574 l
945.851766 97.861268 l
949.779058 99.154575 l
953.706351 97.820617 l
957.633643 95.432513 l
961.560936 95.36016 l
965.488228 99.51519 l
969.41552 91.641148 l
973.342813 92.114319 l
977.270105 83.971815 l
981.197398 88.062593 l
985.12469 91.501542 l
989.051982 87.059299 l
992.979275 85.123065 l
996.906567 88.996383 l
1000.83386 83.509795 l
1004.761152 79.809834 l
1008.688445 86.15651 l
1012.615737 77.799397 l
1016.543029 77.260123 l
1020.470322 81.479407 l
1024.397614 69.716745 l
1028.324907 73.306501 l
1032.252199 67.593353 l
1036.179491 73.885827 l
1040.106784 70.490429 l
1044.034076 73.653166 l
1047.961369 77.18797 l
1051.888661 68.620898 l
1055.815953 62.829846 l
1059.743246 72.299658 l
1063.670538 60.422141 l
1067.597831 67.372894 l
1071.525123 56.577824 l
1075.452415 53.129675 l
1079.379708 68.231731 l
1083.307 46.160272 l
1087.234293 64.777381 l
1091.161585 63.200012 l
1095.088877 53.95211 l
1099.01617 62.70074 l
1102.943462 48.829388 l
1106.870755 54.071215 l
1110.798047 56.0162 l
1114.725339 45.603047 l
1118.652632 46.775948 l
1122.579924 38.654545 l
stroke
grestore
0.800 setlinewidth
0 setlinejoin
[] 0 setdash
0.000 setgray
gsave
805.058333 27.8 m
805.058333 266.6 l
stroke
grestore
gsave
1137.7 27.8 m
1137.7 266.6 l
stroke
grestore
gsave
805.058333 27.8 m
1137.7 27.8 l
stroke
grestore
gsave
805.058333 266.6 m
1137.7 266.6 l
stroke
grestore
/DejaVuSans findfont
12.000 scalefont
setfont
gsave
923.543229 272.600000 translate
0.000000 rotate
0.000000 0.000000 m /A glyphshow
8.208984 0.000000 m /d glyphshow
15.826172 0.000000 m /a glyphshow
23.179688 0.000000 m /m glyphshow
34.869141 0.000000 m /a glyphshow
42.222656 0.000000 m /x glyphshow
49.324219 0.000000 m /space glyphshow
53.138672 0.000000 m /hyphen glyphshow
57.468750 0.000000 m /space glyphshow
61.283203 0.000000 m /zero glyphshow
68.917969 0.000000 m /period glyphshow
72.732422 0.000000 m /eight glyphshow
80.367188 0.000000 m /four glyphshow
88.001953 0.000000 m /three glyphshow
grestore
1.000 setlinewidth
0 setlinecap
0.800 setgray
gsave
812.058333 229.25625 m
877.573958 229.25625 l
878.907292 229.25625 879.573958 229.922917 879.573958 231.25625 c
879.573958 259.6 l
879.573958 260.933333 878.907292 261.6 877.573958 261.6 c
812.058333 261.6 l
810.725 261.6 810.058333 260.933333 810.058333 259.6 c
810.058333 231.25625 l
810.058333 229.922917 810.725 229.25625 812.058333 229.25625 c
cl
gsave
1.000 setgray
fill
grestore
stroke
grestore
1.500 setlinewidth
1 setlinejoin
2 setlinecap
[] 0 setdash
0.122 0.467 0.706 setrgbcolor
gsave
814.058333 253.50625 m
834.058333 253.50625 l
stroke
grestore
0.000 setgray
/DejaVuSans findfont
10.000 scalefont
setfont
gsave
842.058333 250.006250 translate
0.000000 rotate
0.000000 0.000000 m /a glyphshow
6.127930 0.000000 m /u glyphshow
12.465820 0.000000 m /c glyphshow
grestore
1.000 0.498 0.055 setrgbcolor
gsave
814.058333 238.834375 m
834.058333 238.834375 l
stroke
grestore
0.000 setgray
gsave
842.058333 235.334375 translate
0.000000 rotate
0.000000 0.000000 m /v glyphshow
5.917969 0.000000 m /a glyphshow
12.045898 0.000000 m /l glyphshow
14.824219 0.000000 m /A glyphshow
21.665039 0.000000 m /u glyphshow
28.002930 0.000000 m /c glyphshow
grestore

end
showpage
