%!PS-Adobe-3.0 EPSF-3.0
%%Title: imgNets/batchSize.eps
%%Creator: matplotlib version 2.0.2, http://matplotlib.org/
%%CreationDate: Thu Apr 19 17:38:30 2018
%%Orientation: portrait
%%BoundingBox: -270 108 882 684
%%EndComments
%%BeginProlog
/mpldict 8 dict def
mpldict begin
/m { moveto } bind def
/l { lineto } bind def
/r { rlineto } bind def
/c { curveto } bind def
/cl { closepath } bind def
/box {
m
1 index 0 r
0 exch r
neg 0 r
cl
} bind def
/clipbox {
box
clip
newpath
} bind def
%!PS-Adobe-3.0 Resource-Font
%%Title: DejaVu Sans
%%Copyright: Copyright (c) 2003 by Bitstream, Inc. All Rights Reserved. Copyright (c) 2006 by Tavmjong Bah. All Rights Reserved. DejaVu changes are in public domain 
%%Creator: Converted from TrueType to type 3 by PPR
25 dict begin
/_d{bind def}bind def
/_m{moveto}_d
/_l{lineto}_d
/_cl{closepath eofill}_d
/_c{curveto}_d
/_sc{7 -1 roll{setcachedevice}{pop pop pop pop pop pop}ifelse}_d
/_e{exec}_d
/FontName /DejaVuSans def
/PaintType 0 def
/FontMatrix[.001 0 0 .001 0 0]def
/FontBBox[-1021 -463 1793 1232]def
/FontType 3 def
/Encoding [ /space /hyphen /period /zero /one /two /three /four /five /six /seven /eight /nine /A /D /G /S /a /c /d /g /l /r /u /v ] def
/FontInfo 10 dict dup begin
/FamilyName (DejaVu Sans) def
/FullName (DejaVu Sans) def
/Notice (Copyright (c) 2003 by Bitstream, Inc. All Rights Reserved. Copyright (c) 2006 by Tavmjong Bah. All Rights Reserved. DejaVu changes are in public domain ) def
/Weight (Book) def
/Version (Version 2.35) def
/ItalicAngle 0.0 def
/isFixedPitch false def
/UnderlinePosition -130 def
/UnderlineThickness 90 def
end readonly def
/CharStrings 25 dict dup begin
/space{318 0 0 0 0 0 _sc
}_d
/hyphen{361 0 49 234 312 314 _sc
49 314 _m
312 314 _l
312 234 _l
49 234 _l
49 314 _l
_cl}_d
/period{318 0 107 0 210 124 _sc
107 124 _m
210 124 _l
210 0 _l
107 0 _l
107 124 _l
_cl}_d
/zero{636 0 66 -13 570 742 _sc
318 664 _m
267 664 229 639 203 589 _c
177 539 165 464 165 364 _c
165 264 177 189 203 139 _c
229 89 267 64 318 64 _c
369 64 407 89 433 139 _c
458 189 471 264 471 364 _c
471 464 458 539 433 589 _c
407 639 369 664 318 664 _c
318 742 _m
399 742 461 709 505 645 _c
548 580 570 486 570 364 _c
570 241 548 147 505 83 _c
461 19 399 -13 318 -13 _c
236 -13 173 19 130 83 _c
87 147 66 241 66 364 _c
66 486 87 580 130 645 _c
173 709 236 742 318 742 _c
_cl}_d
/one{636 0 110 0 544 729 _sc
124 83 _m
285 83 _l
285 639 _l
110 604 _l
110 694 _l
284 729 _l
383 729 _l
383 83 _l
544 83 _l
544 0 _l
124 0 _l
124 83 _l
_cl}_d
/two{{636 0 73 0 536 742 _sc
192 83 _m
536 83 _l
536 0 _l
73 0 _l
73 83 _l
110 121 161 173 226 239 _c
290 304 331 346 348 365 _c
380 400 402 430 414 455 _c
426 479 433 504 433 528 _c
433 566 419 598 392 622 _c
365 646 330 659 286 659 _c
255 659 222 653 188 643 _c
154 632 117 616 78 594 _c
78 694 _l
118 710 155 722 189 730 _c
223 738 255 742 284 742 _c
}_e{359 742 419 723 464 685 _c
509 647 532 597 532 534 _c
532 504 526 475 515 449 _c
504 422 484 390 454 354 _c
446 344 420 317 376 272 _c
332 227 271 164 192 83 _c
_cl}_e}_d
/three{{636 0 76 -13 556 742 _sc
406 393 _m
453 383 490 362 516 330 _c
542 298 556 258 556 212 _c
556 140 531 84 482 45 _c
432 6 362 -13 271 -13 _c
240 -13 208 -10 176 -4 _c
144 1 110 10 76 22 _c
76 117 _l
103 101 133 89 166 81 _c
198 73 232 69 268 69 _c
330 69 377 81 409 105 _c
441 129 458 165 458 212 _c
458 254 443 288 413 312 _c
383 336 341 349 287 349 _c
}_e{202 349 _l
202 430 _l
291 430 _l
339 430 376 439 402 459 _c
428 478 441 506 441 543 _c
441 580 427 609 401 629 _c
374 649 336 659 287 659 _c
260 659 231 656 200 650 _c
169 644 135 635 98 623 _c
98 711 _l
135 721 170 729 203 734 _c
235 739 266 742 296 742 _c
370 742 429 725 473 691 _c
517 657 539 611 539 553 _c
539 513 527 479 504 451 _c
481 423 448 403 406 393 _c
_cl}_e}_d
/four{636 0 49 0 580 729 _sc
378 643 _m
129 254 _l
378 254 _l
378 643 _l
352 729 _m
476 729 _l
476 254 _l
580 254 _l
580 172 _l
476 172 _l
476 0 _l
378 0 _l
378 172 _l
49 172 _l
49 267 _l
352 729 _l
_cl}_d
/five{{636 0 77 -13 549 729 _sc
108 729 _m
495 729 _l
495 646 _l
198 646 _l
198 467 _l
212 472 227 476 241 478 _c
255 480 270 482 284 482 _c
365 482 429 459 477 415 _c
525 370 549 310 549 234 _c
549 155 524 94 475 51 _c
426 8 357 -13 269 -13 _c
238 -13 207 -10 175 -6 _c
143 -1 111 6 77 17 _c
77 116 _l
106 100 136 88 168 80 _c
199 72 232 69 267 69 _c
}_e{323 69 368 83 401 113 _c
433 143 450 183 450 234 _c
450 284 433 324 401 354 _c
368 384 323 399 267 399 _c
241 399 214 396 188 390 _c
162 384 135 375 108 363 _c
108 729 _l
_cl}_e}_d
/six{{636 0 70 -13 573 742 _sc
330 404 _m
286 404 251 388 225 358 _c
199 328 186 286 186 234 _c
186 181 199 139 225 109 _c
251 79 286 64 330 64 _c
374 64 409 79 435 109 _c
461 139 474 181 474 234 _c
474 286 461 328 435 358 _c
409 388 374 404 330 404 _c
526 713 _m
526 623 _l
501 635 476 644 451 650 _c
425 656 400 659 376 659 _c
310 659 260 637 226 593 _c
}_e{192 549 172 482 168 394 _c
187 422 211 444 240 459 _c
269 474 301 482 336 482 _c
409 482 467 459 509 415 _c
551 371 573 310 573 234 _c
573 159 550 99 506 54 _c
462 9 403 -13 330 -13 _c
246 -13 181 19 137 83 _c
92 147 70 241 70 364 _c
70 479 97 571 152 639 _c
206 707 280 742 372 742 _c
396 742 421 739 447 735 _c
472 730 498 723 526 713 _c
_cl}_e}_d
/seven{636 0 82 0 551 729 _sc
82 729 _m
551 729 _l
551 687 _l
286 0 _l
183 0 _l
432 646 _l
82 646 _l
82 729 _l
_cl}_d
/eight{{636 0 68 -13 568 742 _sc
318 346 _m
271 346 234 333 207 308 _c
180 283 167 249 167 205 _c
167 161 180 126 207 101 _c
234 76 271 64 318 64 _c
364 64 401 76 428 102 _c
455 127 469 161 469 205 _c
469 249 455 283 429 308 _c
402 333 365 346 318 346 _c
219 388 _m
177 398 144 418 120 447 _c
96 476 85 511 85 553 _c
85 611 105 657 147 691 _c
188 725 245 742 318 742 _c
}_e{390 742 447 725 489 691 _c
530 657 551 611 551 553 _c
551 511 539 476 515 447 _c
491 418 459 398 417 388 _c
464 377 501 355 528 323 _c
554 291 568 251 568 205 _c
568 134 546 80 503 43 _c
459 5 398 -13 318 -13 _c
237 -13 175 5 132 43 _c
89 80 68 134 68 205 _c
68 251 81 291 108 323 _c
134 355 171 377 219 388 _c
183 544 _m
183 506 194 476 218 455 _c
}_e{242 434 275 424 318 424 _c
360 424 393 434 417 455 _c
441 476 453 506 453 544 _c
453 582 441 611 417 632 _c
393 653 360 664 318 664 _c
275 664 242 653 218 632 _c
194 611 183 582 183 544 _c
_cl}_e}_d
/nine{{636 0 63 -13 566 742 _sc
110 15 _m
110 105 _l
134 93 159 84 185 78 _c
210 72 235 69 260 69 _c
324 69 374 90 408 134 _c
442 178 462 244 468 334 _c
448 306 424 284 396 269 _c
367 254 335 247 300 247 _c
226 247 168 269 126 313 _c
84 357 63 417 63 494 _c
63 568 85 628 129 674 _c
173 719 232 742 306 742 _c
390 742 455 709 499 645 _c
543 580 566 486 566 364 _c
}_e{566 248 538 157 484 89 _c
429 21 356 -13 264 -13 _c
239 -13 214 -10 189 -6 _c
163 -2 137 5 110 15 _c
306 324 _m
350 324 385 339 411 369 _c
437 399 450 441 450 494 _c
450 546 437 588 411 618 _c
385 648 350 664 306 664 _c
262 664 227 648 201 618 _c
175 588 162 546 162 494 _c
162 441 175 399 201 369 _c
227 339 262 324 306 324 _c
_cl}_e}_d
/A{684 0 8 0 676 729 _sc
342 632 _m
208 269 _l
476 269 _l
342 632 _l
286 729 _m
398 729 _l
676 0 _l
573 0 _l
507 187 _l
178 187 _l
112 0 _l
8 0 _l
286 729 _l
_cl}_d
/D{770 0 98 0 711 729 _sc
197 648 _m
197 81 _l
316 81 _l
416 81 490 103 537 149 _c
583 195 607 267 607 365 _c
607 463 583 534 537 580 _c
490 625 416 648 316 648 _c
197 648 _l
98 729 _m
301 729 _l
442 729 546 699 612 641 _c
678 582 711 490 711 365 _c
711 239 677 147 611 88 _c
545 29 441 0 301 0 _c
98 0 _l
98 729 _l
_cl}_d
/G{{775 0 56 -13 693 742 _sc
595 104 _m
595 300 _l
434 300 _l
434 381 _l
693 381 _l
693 68 _l
655 40 613 20 567 7 _c
521 -6 472 -13 420 -13 _c
306 -13 216 20 152 86 _c
88 152 56 245 56 364 _c
56 482 88 575 152 642 _c
216 708 306 742 420 742 _c
467 742 512 736 555 724 _c
598 712 638 695 674 673 _c
674 568 _l
637 598 598 621 557 637 _c
516 653 473 661 428 661 _c
}_e{338 661 271 636 227 586 _c
182 536 160 462 160 364 _c
160 265 182 191 227 141 _c
271 91 338 67 428 67 _c
462 67 493 70 521 76 _c
549 82 573 91 595 104 _c
_cl}_e}_d
/S{{635 0 66 -13 579 742 _sc
535 705 _m
535 609 _l
497 627 462 640 429 649 _c
395 657 363 662 333 662 _c
279 662 237 651 208 631 _c
179 610 165 580 165 542 _c
165 510 174 485 194 469 _c
213 452 250 439 304 429 _c
364 417 _l
437 403 491 378 526 343 _c
561 307 579 260 579 201 _c
579 130 555 77 508 41 _c
460 5 391 -13 300 -13 _c
265 -13 228 -9 189 -2 _c
}_e{150 5 110 16 69 32 _c
69 134 _l
109 111 148 94 186 83 _c
224 71 262 66 300 66 _c
356 66 399 77 430 99 _c
460 121 476 152 476 194 _c
476 230 465 258 443 278 _c
421 298 385 313 335 323 _c
275 335 _l
201 349 148 372 115 404 _c
82 435 66 478 66 534 _c
66 598 88 649 134 686 _c
179 723 242 742 322 742 _c
356 742 390 739 426 733 _c
461 727 497 717 535 705 _c
}_e{_cl}_e}_d
/a{{613 0 60 -13 522 560 _sc
343 275 _m
270 275 220 266 192 250 _c
164 233 150 205 150 165 _c
150 133 160 107 181 89 _c
202 70 231 61 267 61 _c
317 61 357 78 387 114 _c
417 149 432 196 432 255 _c
432 275 _l
343 275 _l
522 312 _m
522 0 _l
432 0 _l
432 83 _l
411 49 385 25 355 10 _c
325 -5 287 -13 243 -13 _c
187 -13 142 2 109 33 _c
76 64 60 106 60 159 _c
}_e{60 220 80 266 122 298 _c
163 329 224 345 306 345 _c
432 345 _l
432 354 _l
432 395 418 427 391 450 _c
364 472 326 484 277 484 _c
245 484 215 480 185 472 _c
155 464 127 453 100 439 _c
100 522 _l
132 534 164 544 195 550 _c
226 556 256 560 286 560 _c
365 560 424 539 463 498 _c
502 457 522 395 522 312 _c
_cl}_e}_d
/c{{550 0 55 -13 488 560 _sc
488 526 _m
488 442 _l
462 456 437 466 411 473 _c
385 480 360 484 334 484 _c
276 484 230 465 198 428 _c
166 391 150 339 150 273 _c
150 206 166 154 198 117 _c
230 80 276 62 334 62 _c
360 62 385 65 411 72 _c
437 79 462 90 488 104 _c
488 21 _l
462 9 436 0 410 -5 _c
383 -10 354 -13 324 -13 _c
242 -13 176 12 128 64 _c
}_e{79 115 55 185 55 273 _c
55 362 79 432 128 483 _c
177 534 244 560 330 560 _c
358 560 385 557 411 551 _c
437 545 463 537 488 526 _c
_cl}_e}_d
/d{{635 0 55 -13 544 760 _sc
454 464 _m
454 760 _l
544 760 _l
544 0 _l
454 0 _l
454 82 _l
435 49 411 25 382 10 _c
353 -5 319 -13 279 -13 _c
213 -13 159 13 117 65 _c
75 117 55 187 55 273 _c
55 359 75 428 117 481 _c
159 533 213 560 279 560 _c
319 560 353 552 382 536 _c
411 520 435 496 454 464 _c
148 273 _m
148 207 161 155 188 117 _c
215 79 253 61 301 61 _c
}_e{348 61 385 79 413 117 _c
440 155 454 207 454 273 _c
454 339 440 390 413 428 _c
385 466 348 485 301 485 _c
253 485 215 466 188 428 _c
161 390 148 339 148 273 _c
_cl}_e}_d
/g{{635 0 55 -207 544 560 _sc
454 280 _m
454 344 440 395 414 431 _c
387 467 349 485 301 485 _c
253 485 215 467 188 431 _c
161 395 148 344 148 280 _c
148 215 161 165 188 129 _c
215 93 253 75 301 75 _c
349 75 387 93 414 129 _c
440 165 454 215 454 280 _c
544 68 _m
544 -24 523 -93 482 -139 _c
440 -184 377 -207 292 -207 _c
260 -207 231 -204 203 -200 _c
175 -195 147 -188 121 -178 _c
}_e{121 -91 _l
147 -105 173 -115 199 -122 _c
225 -129 251 -133 278 -133 _c
336 -133 380 -117 410 -87 _c
439 -56 454 -10 454 52 _c
454 96 _l
435 64 411 40 382 24 _c
353 8 319 0 279 0 _c
211 0 157 25 116 76 _c
75 127 55 195 55 280 _c
55 364 75 432 116 483 _c
157 534 211 560 279 560 _c
319 560 353 552 382 536 _c
411 520 435 496 454 464 _c
454 547 _l
544 547 _l
}_e{544 68 _l
_cl}_e}_d
/l{278 0 94 0 184 760 _sc
94 760 _m
184 760 _l
184 0 _l
94 0 _l
94 760 _l
_cl}_d
/r{411 0 91 0 411 560 _sc
411 463 _m
401 469 390 473 378 476 _c
366 478 353 480 339 480 _c
288 480 249 463 222 430 _c
194 397 181 350 181 288 _c
181 0 _l
91 0 _l
91 547 _l
181 547 _l
181 462 _l
199 495 224 520 254 536 _c
284 552 321 560 365 560 _c
371 560 378 559 386 559 _c
393 558 401 557 411 555 _c
411 463 _l
_cl}_d
/u{634 0 85 -13 543 560 _sc
85 216 _m
85 547 _l
175 547 _l
175 219 _l
175 167 185 129 205 103 _c
225 77 255 64 296 64 _c
344 64 383 79 411 110 _c
439 141 453 183 453 237 _c
453 547 _l
543 547 _l
543 0 _l
453 0 _l
453 84 _l
431 50 405 26 377 10 _c
348 -5 315 -13 277 -13 _c
214 -13 166 6 134 45 _c
101 83 85 140 85 216 _c
311 560 _m
311 560 _l
_cl}_d
/v{592 0 30 0 562 547 _sc
30 547 _m
125 547 _l
296 88 _l
467 547 _l
562 547 _l
357 0 _l
235 0 _l
30 547 _l
_cl}_d
end readonly def

/BuildGlyph
 {exch begin
 CharStrings exch
 2 copy known not{pop /.notdef}if
 true 3 1 roll get exec
 end}_d

/BuildChar {
 1 index /Encoding get exch get
 1 index /BuildGlyph get exec
}_d

FontName currentdict end definefont pop
end
%%EndProlog
mpldict begin
-270 108 translate
1152 576 0 0 clipbox
gsave
0 0 m
1152 0 l
1152 576 l
0 576 l
cl
1.000 setgray
fill
grestore
gsave
39.925 310.4 m
276.925 310.4 l
276.925 549.2 l
39.925 549.2 l
cl
1.000 setgray
fill
grestore
0.800 setlinewidth
1 setlinejoin
0 setlinecap
[] 0 setdash
0.000 setgray
gsave
/o {
gsave
newpath
translate
0.8 setlinewidth
1 setlinejoin
0 setlinecap
0 0 m
0 -3.5 l

gsave
0.000 setgray
fill
grestore
stroke
grestore
} bind def
45.1015 310.4 o
grestore
/DejaVuSans findfont
10.000 scalefont
setfont
gsave
41.921818 295.806250 translate
0.000000 rotate
0.000000 0.000000 m /zero glyphshow
grestore
gsave
/o {
gsave
newpath
translate
0.8 setlinewidth
1 setlinejoin
0 setlinecap
0 0 m
0 -3.5 l

gsave
0.000 setgray
fill
grestore
stroke
grestore
} bind def
101.064 310.4 o
grestore
gsave
94.704350 295.806250 translate
0.000000 rotate
0.000000 0.000000 m /two glyphshow
6.362305 0.000000 m /zero glyphshow
grestore
gsave
/o {
gsave
newpath
translate
0.8 setlinewidth
1 setlinejoin
0 setlinecap
0 0 m
0 -3.5 l

gsave
0.000 setgray
fill
grestore
stroke
grestore
} bind def
157.026 310.4 o
grestore
gsave
150.666570 295.806250 translate
0.000000 rotate
0.000000 0.000000 m /four glyphshow
6.362305 0.000000 m /zero glyphshow
grestore
gsave
/o {
gsave
newpath
translate
0.8 setlinewidth
1 setlinejoin
0 setlinecap
0 0 m
0 -3.5 l

gsave
0.000 setgray
fill
grestore
stroke
grestore
} bind def
212.988 310.4 o
grestore
gsave
206.628789 295.806250 translate
0.000000 rotate
0.000000 0.000000 m /six glyphshow
6.362305 0.000000 m /zero glyphshow
grestore
gsave
/o {
gsave
newpath
translate
0.8 setlinewidth
1 setlinejoin
0 setlinecap
0 0 m
0 -3.5 l

gsave
0.000 setgray
fill
grestore
stroke
grestore
} bind def
268.95 310.4 o
grestore
gsave
262.591009 295.806250 translate
0.000000 rotate
0.000000 0.000000 m /eight glyphshow
6.362305 0.000000 m /zero glyphshow
grestore
gsave
/o {
gsave
newpath
translate
0.8 setlinewidth
1 setlinejoin
0 setlinecap
0 0 m
-3.5 0 l

gsave
0.000 setgray
fill
grestore
stroke
grestore
} bind def
39.925 315.282 o
grestore
gsave
10.659375 311.485163 translate
0.000000 rotate
0.000000 0.000000 m /zero glyphshow
6.362305 0.000000 m /period glyphshow
9.541016 0.000000 m /eight glyphshow
15.903320 0.000000 m /two glyphshow
grestore
gsave
/o {
gsave
newpath
translate
0.8 setlinewidth
1 setlinejoin
0 setlinecap
0 0 m
-3.5 0 l

gsave
0.000 setgray
fill
grestore
stroke
grestore
} bind def
39.925 364.273 o
grestore
gsave
10.659375 360.475680 translate
0.000000 rotate
0.000000 0.000000 m /zero glyphshow
6.362305 0.000000 m /period glyphshow
9.541016 0.000000 m /eight glyphshow
15.903320 0.000000 m /three glyphshow
grestore
gsave
/o {
gsave
newpath
translate
0.8 setlinewidth
1 setlinejoin
0 setlinecap
0 0 m
-3.5 0 l

gsave
0.000 setgray
fill
grestore
stroke
grestore
} bind def
39.925 413.263 o
grestore
gsave
10.659375 409.466197 translate
0.000000 rotate
0.000000 0.000000 m /zero glyphshow
6.362305 0.000000 m /period glyphshow
9.541016 0.000000 m /eight glyphshow
15.903320 0.000000 m /four glyphshow
grestore
gsave
/o {
gsave
newpath
translate
0.8 setlinewidth
1 setlinejoin
0 setlinecap
0 0 m
-3.5 0 l

gsave
0.000 setgray
fill
grestore
stroke
grestore
} bind def
39.925 462.254 o
grestore
gsave
10.659375 458.456714 translate
0.000000 rotate
0.000000 0.000000 m /zero glyphshow
6.362305 0.000000 m /period glyphshow
9.541016 0.000000 m /eight glyphshow
15.903320 0.000000 m /five glyphshow
grestore
gsave
/o {
gsave
newpath
translate
0.8 setlinewidth
1 setlinejoin
0 setlinecap
0 0 m
-3.5 0 l

gsave
0.000 setgray
fill
grestore
stroke
grestore
} bind def
39.925 511.244 o
grestore
gsave
10.659375 507.447231 translate
0.000000 rotate
0.000000 0.000000 m /zero glyphshow
6.362305 0.000000 m /period glyphshow
9.541016 0.000000 m /eight glyphshow
15.903320 0.000000 m /six glyphshow
grestore
1.500 setlinewidth
2 setlinecap
0.122 0.467 0.706 setrgbcolor
gsave
237 238.8 39.93 310.4 clipbox
50.697727 343.411465 m
53.495838 359.598292 l
56.293949 372.796034 l
59.09206 385.081125 l
61.890171 395.031971 l
64.688282 402.580655 l
67.486393 411.128157 l
70.284504 417.24357 l
73.082615 425.169517 l
75.880726 428.008039 l
78.678837 435.062347 l
81.476948 438.191733 l
84.275059 444.733477 l
87.07317 446.879339 l
89.871281 448.047926 l
92.669392 451.957423 l
95.467503 453.395332 l
98.265614 458.882348 l
101.063725 458.22159 l
103.861836 462.184135 l
106.659947 462.279709 l
109.458058 466.265276 l
112.256169 465.975168 l
115.05428 471.437453 l
117.852391 470.918772 l
120.650502 475.354284 l
123.448613 474.053486 l
126.246724 476.925555 l
129.044835 479.517382 l
131.842946 479.644101 l
134.641057 481.484957 l
137.439168 484.298221 l
140.237279 483.006928 l
143.03539 487.342953 l
145.833501 487.222713 l
148.631612 489.65056 l
151.429723 491.205321 l
154.227834 491.457081 l
157.025945 492.962476 l
159.824055 495.809649 l
162.622166 495.968236 l
165.420277 495.873024 l
168.218388 497.348459 l
171.016499 500.238978 l
173.81461 495.75854 l
176.612721 502.457918 l
179.410832 505.532512 l
182.208943 506.791805 l
185.007054 506.85153 l
187.805165 505.778418 l
190.603276 503.294497 l
193.401387 509.209489 l
196.199498 509.005351 l
198.997609 514.431162 l
201.79572 514.543871 l
204.593831 514.761821 l
207.391942 518.135173 l
210.190053 514.53874 l
212.988164 516.930705 l
215.786275 520.861941 l
218.584386 522.832114 l
221.382497 523.46403 l
224.180608 522.111861 l
226.978719 524.608312 l
229.77683 523.144586 l
232.574941 528.35761 l
235.373052 527.264469 l
238.171163 530.426579 l
240.969274 532.220307 l
243.767385 533.204423 l
246.565496 530.74132 l
249.363607 531.883267 l
252.161718 534.369458 l
254.959829 536.620102 l
257.75794 535.519791 l
260.556051 537.900936 l
263.354162 538.345455 l
266.152273 537.799114 l
stroke
grestore
1.000 0.498 0.055 setrgbcolor
gsave
237 238.8 39.93 310.4 clipbox
50.697727 321.254545 m
53.495838 333.533467 l
56.293949 345.692804 l
59.09206 357.086297 l
61.890171 367.009149 l
64.688282 372.416779 l
67.486393 380.518111 l
70.284504 385.427531 l
73.082615 392.887616 l
75.880726 394.306343 l
78.678837 399.869362 l
81.476948 402.629121 l
84.275059 407.741191 l
87.07317 408.552148 l
89.871281 410.910546 l
92.669392 412.235287 l
95.467503 411.99755 l
98.265614 415.998985 l
101.063725 416.019393 l
103.861836 420.627883 l
106.659947 420.196626 l
109.458058 421.911808 l
112.256169 423.077759 l
115.05428 424.457639 l
117.852391 424.251588 l
120.650502 427.739775 l
123.448613 425.035334 l
126.246724 426.709699 l
129.044835 428.847904 l
131.842946 427.571139 l
134.641057 430.190189 l
137.439168 429.624489 l
140.237279 427.783814 l
143.03539 432.029432 l
145.833501 429.891764 l
148.631612 433.020482 l
151.429723 431.621984 l
154.227834 431.463015 l
157.025945 431.859006 l
159.824055 434.131116 l
162.622166 432.024061 l
165.420277 431.537845 l
168.218388 433.653672 l
171.016499 432.807807 l
173.81461 431.786324 l
176.612721 435.036058 l
179.410832 434.724744 l
182.208943 436.581709 l
185.007054 434.808525 l
187.805165 435.270036 l
190.603276 429.63344 l
193.401387 434.598356 l
196.199498 434.531045 l
198.997609 436.894814 l
201.79572 435.618049 l
204.593831 433.329827 l
207.391942 437.707918 l
210.190053 435.859009 l
212.988164 435.599789 l
215.786275 438.404303 l
218.584386 436.413252 l
221.382497 435.932586 l
224.180608 432.468745 l
226.978719 436.561301 l
229.77683 437.025498 l
232.574941 437.119662 l
235.373052 434.043397 l
238.171163 435.88801 l
240.969274 440.817481 l
243.767385 440.524784 l
246.565496 435.652063 l
249.363607 435.091733 l
252.161718 438.279706 l
254.959829 438.081352 l
257.75794 437.791699 l
260.556051 437.104982 l
263.354162 438.702191 l
266.152273 435.453173 l
stroke
grestore
0.800 setlinewidth
0 setlinejoin
[] 0 setdash
0.000 setgray
gsave
39.925 310.4 m
39.925 549.2 l
stroke
grestore
gsave
276.925 310.4 m
276.925 549.2 l
stroke
grestore
gsave
39.925 310.4 m
276.925 310.4 l
stroke
grestore
gsave
39.925 549.2 m
276.925 549.2 l
stroke
grestore
/DejaVuSans findfont
12.000 scalefont
setfont
gsave
108.565625 555.200000 translate
0.000000 rotate
0.000000 0.000000 m /S glyphshow
7.617188 0.000000 m /G glyphshow
16.916016 0.000000 m /D glyphshow
26.156250 0.000000 m /space glyphshow
29.970703 0.000000 m /hyphen glyphshow
34.300781 0.000000 m /space glyphshow
38.115234 0.000000 m /five glyphshow
45.750000 0.000000 m /zero glyphshow
53.384766 0.000000 m /space glyphshow
57.199219 0.000000 m /hyphen glyphshow
61.529297 0.000000 m /space glyphshow
65.343750 0.000000 m /zero glyphshow
72.978516 0.000000 m /period glyphshow
76.792969 0.000000 m /eight glyphshow
84.427734 0.000000 m /four glyphshow
92.062500 0.000000 m /six glyphshow
grestore
1.000 setlinewidth
0 setlinecap
0.800 setgray
gsave
46.925 511.85625 m
112.440625 511.85625 l
113.773958 511.85625 114.440625 512.522917 114.440625 513.85625 c
114.440625 542.2 l
114.440625 543.533333 113.773958 544.2 112.440625 544.2 c
46.925 544.2 l
45.591667 544.2 44.925 543.533333 44.925 542.2 c
44.925 513.85625 l
44.925 512.522917 45.591667 511.85625 46.925 511.85625 c
cl
gsave
1.000 setgray
fill
grestore
stroke
grestore
1.500 setlinewidth
1 setlinejoin
2 setlinecap
[] 0 setdash
0.122 0.467 0.706 setrgbcolor
gsave
48.925 536.10625 m
68.925 536.10625 l
stroke
grestore
0.000 setgray
/DejaVuSans findfont
10.000 scalefont
setfont
gsave
76.925000 532.606250 translate
0.000000 rotate
0.000000 0.000000 m /a glyphshow
6.127930 0.000000 m /u glyphshow
12.465820 0.000000 m /c glyphshow
grestore
1.000 0.498 0.055 setrgbcolor
gsave
48.925 521.434375 m
68.925 521.434375 l
stroke
grestore
0.000 setgray
gsave
76.925000 517.934375 translate
0.000000 rotate
0.000000 0.000000 m /v glyphshow
5.917969 0.000000 m /a glyphshow
12.045898 0.000000 m /l glyphshow
14.824219 0.000000 m /A glyphshow
21.665039 0.000000 m /u glyphshow
28.002930 0.000000 m /c glyphshow
grestore
gsave
326.85 310.4 m
563.85 310.4 l
563.85 549.2 l
326.85 549.2 l
cl
1.000 setgray
fill
grestore
0.800 setlinewidth
0 setlinecap
gsave
/o {
gsave
newpath
translate
0.8 setlinewidth
1 setlinejoin
0 setlinecap
0 0 m
0 -3.5 l

gsave
0.000 setgray
fill
grestore
stroke
grestore
} bind def
332.027 310.4 o
grestore
gsave
328.846818 295.806250 translate
0.000000 rotate
0.000000 0.000000 m /zero glyphshow
grestore
gsave
/o {
gsave
newpath
translate
0.8 setlinewidth
1 setlinejoin
0 setlinecap
0 0 m
0 -3.5 l

gsave
0.000 setgray
fill
grestore
stroke
grestore
} bind def
387.989 310.4 o
grestore
gsave
381.629350 295.806250 translate
0.000000 rotate
0.000000 0.000000 m /two glyphshow
6.362305 0.000000 m /zero glyphshow
grestore
gsave
/o {
gsave
newpath
translate
0.8 setlinewidth
1 setlinejoin
0 setlinecap
0 0 m
0 -3.5 l

gsave
0.000 setgray
fill
grestore
stroke
grestore
} bind def
443.951 310.4 o
grestore
gsave
437.591570 295.806250 translate
0.000000 rotate
0.000000 0.000000 m /four glyphshow
6.362305 0.000000 m /zero glyphshow
grestore
gsave
/o {
gsave
newpath
translate
0.8 setlinewidth
1 setlinejoin
0 setlinecap
0 0 m
0 -3.5 l

gsave
0.000 setgray
fill
grestore
stroke
grestore
} bind def
499.913 310.4 o
grestore
gsave
493.553789 295.806250 translate
0.000000 rotate
0.000000 0.000000 m /six glyphshow
6.362305 0.000000 m /zero glyphshow
grestore
gsave
/o {
gsave
newpath
translate
0.8 setlinewidth
1 setlinejoin
0 setlinecap
0 0 m
0 -3.5 l

gsave
0.000 setgray
fill
grestore
stroke
grestore
} bind def
555.875 310.4 o
grestore
gsave
549.516009 295.806250 translate
0.000000 rotate
0.000000 0.000000 m /eight glyphshow
6.362305 0.000000 m /zero glyphshow
grestore
gsave
/o {
gsave
newpath
translate
0.8 setlinewidth
1 setlinejoin
0 setlinecap
0 0 m
-3.5 0 l

gsave
0.000 setgray
fill
grestore
stroke
grestore
} bind def
326.85 318.784 o
grestore
gsave
297.584375 314.987409 translate
0.000000 rotate
0.000000 0.000000 m /zero glyphshow
6.362305 0.000000 m /period glyphshow
9.541016 0.000000 m /eight glyphshow
15.903320 0.000000 m /one glyphshow
grestore
gsave
/o {
gsave
newpath
translate
0.8 setlinewidth
1 setlinejoin
0 setlinecap
0 0 m
-3.5 0 l

gsave
0.000 setgray
fill
grestore
stroke
grestore
} bind def
326.85 363.945 o
grestore
gsave
297.584375 360.147712 translate
0.000000 rotate
0.000000 0.000000 m /zero glyphshow
6.362305 0.000000 m /period glyphshow
9.541016 0.000000 m /eight glyphshow
15.903320 0.000000 m /two glyphshow
grestore
gsave
/o {
gsave
newpath
translate
0.8 setlinewidth
1 setlinejoin
0 setlinecap
0 0 m
-3.5 0 l

gsave
0.000 setgray
fill
grestore
stroke
grestore
} bind def
326.85 409.105 o
grestore
gsave
297.584375 405.308015 translate
0.000000 rotate
0.000000 0.000000 m /zero glyphshow
6.362305 0.000000 m /period glyphshow
9.541016 0.000000 m /eight glyphshow
15.903320 0.000000 m /three glyphshow
grestore
gsave
/o {
gsave
newpath
translate
0.8 setlinewidth
1 setlinejoin
0 setlinecap
0 0 m
-3.5 0 l

gsave
0.000 setgray
fill
grestore
stroke
grestore
} bind def
326.85 454.265 o
grestore
gsave
297.584375 450.468317 translate
0.000000 rotate
0.000000 0.000000 m /zero glyphshow
6.362305 0.000000 m /period glyphshow
9.541016 0.000000 m /eight glyphshow
15.903320 0.000000 m /four glyphshow
grestore
gsave
/o {
gsave
newpath
translate
0.8 setlinewidth
1 setlinejoin
0 setlinecap
0 0 m
-3.5 0 l

gsave
0.000 setgray
fill
grestore
stroke
grestore
} bind def
326.85 499.425 o
grestore
gsave
297.584375 495.628620 translate
0.000000 rotate
0.000000 0.000000 m /zero glyphshow
6.362305 0.000000 m /period glyphshow
9.541016 0.000000 m /eight glyphshow
15.903320 0.000000 m /five glyphshow
grestore
gsave
/o {
gsave
newpath
translate
0.8 setlinewidth
1 setlinejoin
0 setlinecap
0 0 m
-3.5 0 l

gsave
0.000 setgray
fill
grestore
stroke
grestore
} bind def
326.85 544.586 o
grestore
gsave
297.584375 540.788922 translate
0.000000 rotate
0.000000 0.000000 m /zero glyphshow
6.362305 0.000000 m /period glyphshow
9.541016 0.000000 m /eight glyphshow
15.903320 0.000000 m /six glyphshow
grestore
1.500 setlinewidth
2 setlinecap
0.122 0.467 0.706 setrgbcolor
gsave
237 238.8 326.9 310.4 clipbox
337.622727 340.486307 m
340.420838 367.084646 l
343.218949 383.929949 l
346.01706 396.770044 l
348.815171 406.558158 l
351.613282 415.16212 l
354.411393 421.050832 l
357.209504 427.972535 l
360.007615 434.059186 l
362.805726 437.352642 l
365.603837 442.9397 l
368.401948 446.623397 l
371.200059 451.363216 l
373.99817 455.388554 l
376.796281 458.464335 l
379.594392 461.21357 l
382.392503 464.884776 l
385.190614 468.627136 l
387.988725 470.751235 l
390.786836 473.735761 l
393.584947 475.352748 l
396.383058 477.913352 l
399.181169 481.939327 l
401.97928 483.638049 l
404.777391 484.084406 l
407.575502 487.077451 l
410.373613 487.83671 l
413.171724 490.750324 l
415.969835 491.786559 l
418.767946 493.053021 l
421.566057 495.049304 l
424.364168 496.655801 l
427.162279 498.030404 l
429.96039 498.742429 l
432.758501 501.068924 l
435.556612 500.825631 l
438.354723 499.106809 l
441.152834 504.163653 l
443.950945 504.037534 l
446.749055 504.898446 l
449.547166 506.925167 l
452.345277 507.928326 l
455.143388 510.008162 l
457.941499 509.973146 l
460.73961 511.019567 l
463.537721 510.141618 l
466.335832 512.720745 l
469.133943 512.922504 l
471.932054 514.883044 l
474.730165 515.269585 l
477.528276 516.219386 l
480.326387 517.898068 l
483.124498 517.651197 l
485.922609 517.643406 l
488.72072 520.358201 l
491.518831 520.082802 l
494.316942 521.846917 l
497.115053 521.620904 l
499.913164 522.372068 l
502.711275 523.279759 l
505.509386 524.195484 l
508.307497 525.819989 l
511.105608 525.536253 l
513.903719 527.497398 l
516.70183 528.110196 l
519.499941 527.515588 l
522.298052 528.577047 l
525.096163 529.000697 l
527.894274 528.380866 l
530.692385 532.638675 l
533.490496 532.550028 l
536.288607 533.155671 l
539.086718 533.70174 l
541.884829 534.366198 l
544.68294 533.549125 l
547.481051 535.285955 l
550.279162 536.758421 l
553.077273 538.345455 l
stroke
grestore
1.000 0.498 0.055 setrgbcolor
gsave
237 238.8 326.9 310.4 clipbox
337.622727 321.254545 m
340.420838 345.974648 l
343.218949 361.94045 l
346.01706 374.206933 l
348.815171 383.235172 l
351.613282 391.551336 l
354.411393 396.296075 l
357.209504 402.01907 l
360.007615 406.724863 l
362.805726 410.739871 l
365.603837 414.463778 l
368.401948 416.538446 l
371.200059 420.812374 l
373.99817 423.408185 l
376.796281 424.254092 l
379.594392 427.774196 l
382.392503 430.103989 l
385.190614 433.881034 l
387.988725 434.232203 l
390.786836 437.246181 l
393.584947 437.479193 l
396.383058 439.601718 l
399.181169 441.716322 l
401.97928 443.085682 l
404.777391 443.653856 l
407.575502 445.346331 l
410.373613 445.684463 l
413.171724 447.542951 l
415.969835 448.376152 l
418.767946 448.430114 l
421.566057 449.455401 l
424.364168 451.610766 l
427.162279 451.420824 l
429.96039 451.96309 l
432.758501 453.095147 l
435.556612 453.091021 l
438.354723 451.460595 l
441.152834 454.421766 l
443.950945 455.015848 l
446.749055 456.54231 l
449.547166 455.002482 l
452.345277 456.347913 l
455.143388 457.331615 l
457.941499 457.817277 l
460.73961 458.697675 l
463.537721 457.990552 l
466.335832 457.756384 l
469.133943 459.948383 l
471.932054 459.464866 l
474.730165 461.43359 l
477.528276 460.820199 l
480.326387 462.042854 l
483.124498 460.110106 l
485.922609 461.912651 l
488.72072 462.51383 l
491.518831 462.824733 l
494.316942 463.460566 l
497.115053 462.151604 l
499.913164 462.634461 l
502.711275 462.467953 l
505.509386 464.047553 l
508.307497 465.485562 l
511.105608 463.435318 l
513.903719 465.223836 l
516.70183 464.424135 l
519.499941 465.009801 l
522.298052 464.758636 l
525.096163 463.989464 l
527.894274 463.320792 l
530.692385 467.551319 l
533.490496 466.445335 l
536.288607 466.170902 l
539.086718 467.305765 l
541.884829 467.440424 l
544.68294 466.671582 l
547.481051 467.134966 l
550.279162 467.732349 l
553.077273 468.106786 l
stroke
grestore
0.800 setlinewidth
0 setlinejoin
[] 0 setdash
0.000 setgray
gsave
326.85 310.4 m
326.85 549.2 l
stroke
grestore
gsave
563.85 310.4 m
563.85 549.2 l
stroke
grestore
gsave
326.85 310.4 m
563.85 310.4 l
stroke
grestore
gsave
326.85 549.2 m
563.85 549.2 l
stroke
grestore
/DejaVuSans findfont
12.000 scalefont
setfont
gsave
391.670313 555.200000 translate
0.000000 rotate
0.000000 0.000000 m /S glyphshow
7.617188 0.000000 m /G glyphshow
16.916016 0.000000 m /D glyphshow
26.156250 0.000000 m /space glyphshow
29.970703 0.000000 m /hyphen glyphshow
34.300781 0.000000 m /space glyphshow
38.115234 0.000000 m /one glyphshow
45.750000 0.000000 m /zero glyphshow
53.384766 0.000000 m /zero glyphshow
61.019531 0.000000 m /space glyphshow
64.833984 0.000000 m /hyphen glyphshow
69.164062 0.000000 m /space glyphshow
72.978516 0.000000 m /zero glyphshow
80.613281 0.000000 m /period glyphshow
84.427734 0.000000 m /eight glyphshow
92.062500 0.000000 m /four glyphshow
99.697266 0.000000 m /three glyphshow
grestore
1.000 setlinewidth
0 setlinecap
0.800 setgray
gsave
333.85 511.85625 m
399.365625 511.85625 l
400.698958 511.85625 401.365625 512.522917 401.365625 513.85625 c
401.365625 542.2 l
401.365625 543.533333 400.698958 544.2 399.365625 544.2 c
333.85 544.2 l
332.516667 544.2 331.85 543.533333 331.85 542.2 c
331.85 513.85625 l
331.85 512.522917 332.516667 511.85625 333.85 511.85625 c
cl
gsave
1.000 setgray
fill
grestore
stroke
grestore
1.500 setlinewidth
1 setlinejoin
2 setlinecap
[] 0 setdash
0.122 0.467 0.706 setrgbcolor
gsave
335.85 536.10625 m
355.85 536.10625 l
stroke
grestore
0.000 setgray
/DejaVuSans findfont
10.000 scalefont
setfont
gsave
363.850000 532.606250 translate
0.000000 rotate
0.000000 0.000000 m /a glyphshow
6.127930 0.000000 m /u glyphshow
12.465820 0.000000 m /c glyphshow
grestore
1.000 0.498 0.055 setrgbcolor
gsave
335.85 521.434375 m
355.85 521.434375 l
stroke
grestore
0.000 setgray
gsave
363.850000 517.934375 translate
0.000000 rotate
0.000000 0.000000 m /v glyphshow
5.917969 0.000000 m /a glyphshow
12.045898 0.000000 m /l glyphshow
14.824219 0.000000 m /A glyphshow
21.665039 0.000000 m /u glyphshow
28.002930 0.000000 m /c glyphshow
grestore
gsave
613.775 310.4 m
850.775 310.4 l
850.775 549.2 l
613.775 549.2 l
cl
1.000 setgray
fill
grestore
0.800 setlinewidth
0 setlinecap
gsave
/o {
gsave
newpath
translate
0.8 setlinewidth
1 setlinejoin
0 setlinecap
0 0 m
0 -3.5 l

gsave
0.000 setgray
fill
grestore
stroke
grestore
} bind def
618.952 310.4 o
grestore
gsave
615.771818 295.806250 translate
0.000000 rotate
0.000000 0.000000 m /zero glyphshow
grestore
gsave
/o {
gsave
newpath
translate
0.8 setlinewidth
1 setlinejoin
0 setlinecap
0 0 m
0 -3.5 l

gsave
0.000 setgray
fill
grestore
stroke
grestore
} bind def
674.914 310.4 o
grestore
gsave
668.554350 295.806250 translate
0.000000 rotate
0.000000 0.000000 m /two glyphshow
6.362305 0.000000 m /zero glyphshow
grestore
gsave
/o {
gsave
newpath
translate
0.8 setlinewidth
1 setlinejoin
0 setlinecap
0 0 m
0 -3.5 l

gsave
0.000 setgray
fill
grestore
stroke
grestore
} bind def
730.876 310.4 o
grestore
gsave
724.516570 295.806250 translate
0.000000 rotate
0.000000 0.000000 m /four glyphshow
6.362305 0.000000 m /zero glyphshow
grestore
gsave
/o {
gsave
newpath
translate
0.8 setlinewidth
1 setlinejoin
0 setlinecap
0 0 m
0 -3.5 l

gsave
0.000 setgray
fill
grestore
stroke
grestore
} bind def
786.838 310.4 o
grestore
gsave
780.478789 295.806250 translate
0.000000 rotate
0.000000 0.000000 m /six glyphshow
6.362305 0.000000 m /zero glyphshow
grestore
gsave
/o {
gsave
newpath
translate
0.8 setlinewidth
1 setlinejoin
0 setlinecap
0 0 m
0 -3.5 l

gsave
0.000 setgray
fill
grestore
stroke
grestore
} bind def
842.8 310.4 o
grestore
gsave
836.441009 295.806250 translate
0.000000 rotate
0.000000 0.000000 m /eight glyphshow
6.362305 0.000000 m /zero glyphshow
grestore
gsave
/o {
gsave
newpath
translate
0.8 setlinewidth
1 setlinejoin
0 setlinecap
0 0 m
-3.5 0 l

gsave
0.000 setgray
fill
grestore
stroke
grestore
} bind def
613.775 334.899 o
grestore
gsave
584.509375 331.102120 translate
0.000000 rotate
0.000000 0.000000 m /zero glyphshow
6.362305 0.000000 m /period glyphshow
9.541016 0.000000 m /eight glyphshow
15.903320 0.000000 m /zero glyphshow
grestore
gsave
/o {
gsave
newpath
translate
0.8 setlinewidth
1 setlinejoin
0 setlinecap
0 0 m
-3.5 0 l

gsave
0.000 setgray
fill
grestore
stroke
grestore
} bind def
613.775 375.898 o
grestore
gsave
584.509375 372.101210 translate
0.000000 rotate
0.000000 0.000000 m /zero glyphshow
6.362305 0.000000 m /period glyphshow
9.541016 0.000000 m /eight glyphshow
15.903320 0.000000 m /one glyphshow
grestore
gsave
/o {
gsave
newpath
translate
0.8 setlinewidth
1 setlinejoin
0 setlinecap
0 0 m
-3.5 0 l

gsave
0.000 setgray
fill
grestore
stroke
grestore
} bind def
613.775 416.897 o
grestore
gsave
584.509375 413.100300 translate
0.000000 rotate
0.000000 0.000000 m /zero glyphshow
6.362305 0.000000 m /period glyphshow
9.541016 0.000000 m /eight glyphshow
15.903320 0.000000 m /two glyphshow
grestore
gsave
/o {
gsave
newpath
translate
0.8 setlinewidth
1 setlinejoin
0 setlinecap
0 0 m
-3.5 0 l

gsave
0.000 setgray
fill
grestore
stroke
grestore
} bind def
613.775 457.896 o
grestore
gsave
584.509375 454.099389 translate
0.000000 rotate
0.000000 0.000000 m /zero glyphshow
6.362305 0.000000 m /period glyphshow
9.541016 0.000000 m /eight glyphshow
15.903320 0.000000 m /three glyphshow
grestore
gsave
/o {
gsave
newpath
translate
0.8 setlinewidth
1 setlinejoin
0 setlinecap
0 0 m
-3.5 0 l

gsave
0.000 setgray
fill
grestore
stroke
grestore
} bind def
613.775 498.895 o
grestore
gsave
584.509375 495.098479 translate
0.000000 rotate
0.000000 0.000000 m /zero glyphshow
6.362305 0.000000 m /period glyphshow
9.541016 0.000000 m /eight glyphshow
15.903320 0.000000 m /four glyphshow
grestore
gsave
/o {
gsave
newpath
translate
0.8 setlinewidth
1 setlinejoin
0 setlinecap
0 0 m
-3.5 0 l

gsave
0.000 setgray
fill
grestore
stroke
grestore
} bind def
613.775 539.894 o
grestore
gsave
584.509375 536.097568 translate
0.000000 rotate
0.000000 0.000000 m /zero glyphshow
6.362305 0.000000 m /period glyphshow
9.541016 0.000000 m /eight glyphshow
15.903320 0.000000 m /five glyphshow
grestore
1.500 setlinewidth
2 setlinecap
0.122 0.467 0.706 setrgbcolor
gsave
237 238.8 613.8 310.4 clipbox
624.547727 340.092942 m
627.345838 365.487709 l
630.143949 381.442855 l
632.94206 393.709743 l
635.740171 402.949461 l
638.538282 411.718719 l
641.336393 419.32712 l
644.134504 425.443692 l
646.932615 430.581695 l
649.730726 435.415204 l
652.528837 438.745299 l
655.326948 443.773372 l
658.125059 447.356628 l
660.92317 450.949681 l
663.721281 454.184792 l
666.519392 457.185431 l
669.317503 460.127251 l
672.115614 462.940509 l
674.913725 465.364063 l
677.711836 468.00651 l
680.509947 470.463037 l
683.308058 472.738348 l
686.106169 474.824106 l
688.90428 477.009361 l
691.702391 479.061347 l
694.500502 481.236638 l
697.298613 483.079611 l
700.096724 485.031026 l
702.894835 486.805989 l
705.692946 488.22532 l
708.491057 490.257049 l
711.289168 492.057828 l
714.087279 493.854644 l
716.88539 495.328554 l
719.683501 496.84463 l
722.481612 498.81011 l
725.279723 500.032594 l
728.077834 501.517348 l
730.875945 503.23897 l
733.674055 504.529656 l
736.472166 505.761855 l
739.270277 507.202297 l
742.068388 508.457588 l
744.866499 510.109878 l
747.66461 510.820232 l
750.462721 512.199186 l
753.260832 513.440771 l
756.058943 514.415983 l
758.857054 515.465839 l
761.655165 516.164633 l
764.453276 517.71693 l
767.251387 518.771961 l
770.049498 519.672034 l
772.847609 520.366341 l
775.64572 521.466097 l
778.443831 522.532632 l
781.241942 523.418806 l
784.040053 524.365091 l
786.838164 525.671439 l
789.636275 526.336048 l
792.434386 526.776369 l
795.232497 528.018009 l
798.030608 528.448228 l
800.828719 529.643849 l
803.62683 530.629052 l
806.424941 531.061336 l
809.223052 531.170411 l
812.021163 532.2648 l
814.819274 532.906786 l
817.617385 533.640287 l
820.415496 534.036707 l
823.213607 535.421882 l
826.011718 535.375505 l
828.809829 536.462875 l
831.60794 536.691348 l
834.406051 537.793471 l
837.204162 537.601797 l
840.002273 538.345455 l
stroke
grestore
1.000 0.498 0.055 setrgbcolor
gsave
237 238.8 613.8 310.4 clipbox
624.547727 321.254545 m
627.345838 346.324353 l
630.143949 361.298281 l
632.94206 372.475541 l
635.740171 380.758784 l
638.538282 389.217012 l
641.336393 396.933945 l
644.134504 402.872249 l
646.932615 407.849176 l
649.730726 412.685124 l
652.528837 415.020924 l
655.326948 420.533298 l
658.125059 423.98973 l
660.92317 428.099065 l
663.721281 430.963719 l
666.519392 433.839011 l
669.317503 436.263203 l
672.115614 439.139693 l
674.913725 441.514145 l
677.711836 443.636305 l
680.509947 445.557861 l
683.308058 447.703392 l
686.106169 449.795589 l
688.90428 451.66336 l
691.702391 452.833582 l
694.500502 454.67903 l
697.298613 456.165966 l
700.096724 457.671329 l
702.894835 459.250701 l
705.692946 460.609393 l
708.491057 462.180376 l
711.289168 463.426855 l
714.087279 465.350508 l
716.88539 466.387542 l
719.683501 467.966915 l
722.481612 469.030617 l
725.279723 470.243837 l
728.077834 471.514286 l
730.875945 472.452741 l
733.674055 473.426853 l
736.472166 474.294294 l
739.270277 475.242637 l
742.068388 476.678485 l
744.866499 477.711924 l
747.66461 478.308346 l
750.462721 479.558121 l
753.260832 480.305559 l
756.058943 480.90273 l
758.857054 481.779909 l
761.655165 482.072203 l
764.453276 483.592548 l
767.251387 484.682617 l
770.049498 485.491331 l
772.847609 485.418969 l
775.64572 486.118465 l
778.443831 486.893619 l
781.241942 488.079572 l
784.040053 488.689628 l
786.838164 489.496543 l
789.636275 489.878876 l
792.434386 490.290574 l
795.232497 491.102883 l
798.030608 491.527764 l
800.828719 492.122838 l
803.62683 492.994624 l
806.424941 493.044813 l
809.223052 493.217403 l
812.021163 494.09608 l
814.819274 494.220728 l
817.617385 493.890981 l
820.415496 494.975058 l
823.213607 496.124755 l
826.011718 495.907819 l
828.809829 496.339293 l
831.60794 497.101563 l
834.406051 497.524796 l
837.204162 497.253477 l
840.002273 497.352956 l
stroke
grestore
0.800 setlinewidth
0 setlinejoin
[] 0 setdash
0.000 setgray
gsave
613.775 310.4 m
613.775 549.2 l
stroke
grestore
gsave
850.775 310.4 m
850.775 549.2 l
stroke
grestore
gsave
613.775 310.4 m
850.775 310.4 l
stroke
grestore
gsave
613.775 549.2 m
850.775 549.2 l
stroke
grestore
/DejaVuSans findfont
12.000 scalefont
setfont
gsave
682.415625 555.200000 translate
0.000000 rotate
0.000000 0.000000 m /S glyphshow
7.617188 0.000000 m /G glyphshow
16.916016 0.000000 m /D glyphshow
26.156250 0.000000 m /space glyphshow
29.970703 0.000000 m /hyphen glyphshow
34.300781 0.000000 m /space glyphshow
38.115234 0.000000 m /two glyphshow
45.750000 0.000000 m /zero glyphshow
53.384766 0.000000 m /zero glyphshow
61.019531 0.000000 m /space glyphshow
64.833984 0.000000 m /hyphen glyphshow
69.164062 0.000000 m /space glyphshow
72.978516 0.000000 m /zero glyphshow
80.613281 0.000000 m /period glyphshow
84.427734 0.000000 m /eight glyphshow
92.062500 0.000000 m /four glyphshow
grestore
1.000 setlinewidth
0 setlinecap
0.800 setgray
gsave
620.775 511.85625 m
686.290625 511.85625 l
687.623958 511.85625 688.290625 512.522917 688.290625 513.85625 c
688.290625 542.2 l
688.290625 543.533333 687.623958 544.2 686.290625 544.2 c
620.775 544.2 l
619.441667 544.2 618.775 543.533333 618.775 542.2 c
618.775 513.85625 l
618.775 512.522917 619.441667 511.85625 620.775 511.85625 c
cl
gsave
1.000 setgray
fill
grestore
stroke
grestore
1.500 setlinewidth
1 setlinejoin
2 setlinecap
[] 0 setdash
0.122 0.467 0.706 setrgbcolor
gsave
622.775 536.10625 m
642.775 536.10625 l
stroke
grestore
0.000 setgray
/DejaVuSans findfont
10.000 scalefont
setfont
gsave
650.775000 532.606250 translate
0.000000 rotate
0.000000 0.000000 m /a glyphshow
6.127930 0.000000 m /u glyphshow
12.465820 0.000000 m /c glyphshow
grestore
1.000 0.498 0.055 setrgbcolor
gsave
622.775 521.434375 m
642.775 521.434375 l
stroke
grestore
0.000 setgray
gsave
650.775000 517.934375 translate
0.000000 rotate
0.000000 0.000000 m /v glyphshow
5.917969 0.000000 m /a glyphshow
12.045898 0.000000 m /l glyphshow
14.824219 0.000000 m /A glyphshow
21.665039 0.000000 m /u glyphshow
28.002930 0.000000 m /c glyphshow
grestore
gsave
900.7 310.4 m
1137.7 310.4 l
1137.7 549.2 l
900.7 549.2 l
cl
1.000 setgray
fill
grestore
0.800 setlinewidth
0 setlinecap
gsave
/o {
gsave
newpath
translate
0.8 setlinewidth
1 setlinejoin
0 setlinecap
0 0 m
0 -3.5 l

gsave
0.000 setgray
fill
grestore
stroke
grestore
} bind def
905.877 310.4 o
grestore
gsave
902.696818 295.806250 translate
0.000000 rotate
0.000000 0.000000 m /zero glyphshow
grestore
gsave
/o {
gsave
newpath
translate
0.8 setlinewidth
1 setlinejoin
0 setlinecap
0 0 m
0 -3.5 l

gsave
0.000 setgray
fill
grestore
stroke
grestore
} bind def
961.839 310.4 o
grestore
gsave
955.479350 295.806250 translate
0.000000 rotate
0.000000 0.000000 m /two glyphshow
6.362305 0.000000 m /zero glyphshow
grestore
gsave
/o {
gsave
newpath
translate
0.8 setlinewidth
1 setlinejoin
0 setlinecap
0 0 m
0 -3.5 l

gsave
0.000 setgray
fill
grestore
stroke
grestore
} bind def
1017.8 310.4 o
grestore
gsave
1011.441570 295.806250 translate
0.000000 rotate
0.000000 0.000000 m /four glyphshow
6.362305 0.000000 m /zero glyphshow
grestore
gsave
/o {
gsave
newpath
translate
0.8 setlinewidth
1 setlinejoin
0 setlinecap
0 0 m
0 -3.5 l

gsave
0.000 setgray
fill
grestore
stroke
grestore
} bind def
1073.76 310.4 o
grestore
gsave
1067.403789 295.806250 translate
0.000000 rotate
0.000000 0.000000 m /six glyphshow
6.362305 0.000000 m /zero glyphshow
grestore
gsave
/o {
gsave
newpath
translate
0.8 setlinewidth
1 setlinejoin
0 setlinecap
0 0 m
0 -3.5 l

gsave
0.000 setgray
fill
grestore
stroke
grestore
} bind def
1129.73 310.4 o
grestore
gsave
1123.366009 295.806250 translate
0.000000 rotate
0.000000 0.000000 m /eight glyphshow
6.362305 0.000000 m /zero glyphshow
grestore
gsave
/o {
gsave
newpath
translate
0.8 setlinewidth
1 setlinejoin
0 setlinecap
0 0 m
-3.5 0 l

gsave
0.000 setgray
fill
grestore
stroke
grestore
} bind def
900.7 339.475 o
grestore
gsave
865.075000 335.678201 translate
0.000000 rotate
0.000000 0.000000 m /zero glyphshow
6.362305 0.000000 m /period glyphshow
9.541016 0.000000 m /six glyphshow
15.903320 0.000000 m /seven glyphshow
22.265625 0.000000 m /five glyphshow
grestore
gsave
/o {
gsave
newpath
translate
0.8 setlinewidth
1 setlinejoin
0 setlinecap
0 0 m
-3.5 0 l

gsave
0.000 setgray
fill
grestore
stroke
grestore
} bind def
900.7 369.897 o
grestore
gsave
865.075000 366.099718 translate
0.000000 rotate
0.000000 0.000000 m /zero glyphshow
6.362305 0.000000 m /period glyphshow
9.541016 0.000000 m /seven glyphshow
15.903320 0.000000 m /zero glyphshow
22.265625 0.000000 m /zero glyphshow
grestore
gsave
/o {
gsave
newpath
translate
0.8 setlinewidth
1 setlinejoin
0 setlinecap
0 0 m
-3.5 0 l

gsave
0.000 setgray
fill
grestore
stroke
grestore
} bind def
900.7 400.318 o
grestore
gsave
865.075000 396.521235 translate
0.000000 rotate
0.000000 0.000000 m /zero glyphshow
6.362305 0.000000 m /period glyphshow
9.541016 0.000000 m /seven glyphshow
15.903320 0.000000 m /two glyphshow
22.265625 0.000000 m /five glyphshow
grestore
gsave
/o {
gsave
newpath
translate
0.8 setlinewidth
1 setlinejoin
0 setlinecap
0 0 m
-3.5 0 l

gsave
0.000 setgray
fill
grestore
stroke
grestore
} bind def
900.7 430.74 o
grestore
gsave
865.075000 426.942752 translate
0.000000 rotate
0.000000 0.000000 m /zero glyphshow
6.362305 0.000000 m /period glyphshow
9.541016 0.000000 m /seven glyphshow
15.903320 0.000000 m /five glyphshow
22.265625 0.000000 m /zero glyphshow
grestore
gsave
/o {
gsave
newpath
translate
0.8 setlinewidth
1 setlinejoin
0 setlinecap
0 0 m
-3.5 0 l

gsave
0.000 setgray
fill
grestore
stroke
grestore
} bind def
900.7 461.161 o
grestore
gsave
865.075000 457.364269 translate
0.000000 rotate
0.000000 0.000000 m /zero glyphshow
6.362305 0.000000 m /period glyphshow
9.541016 0.000000 m /seven glyphshow
15.903320 0.000000 m /seven glyphshow
22.265625 0.000000 m /five glyphshow
grestore
gsave
/o {
gsave
newpath
translate
0.8 setlinewidth
1 setlinejoin
0 setlinecap
0 0 m
-3.5 0 l

gsave
0.000 setgray
fill
grestore
stroke
grestore
} bind def
900.7 491.583 o
grestore
gsave
865.075000 487.785786 translate
0.000000 rotate
0.000000 0.000000 m /zero glyphshow
6.362305 0.000000 m /period glyphshow
9.541016 0.000000 m /eight glyphshow
15.903320 0.000000 m /zero glyphshow
22.265625 0.000000 m /zero glyphshow
grestore
gsave
/o {
gsave
newpath
translate
0.8 setlinewidth
1 setlinejoin
0 setlinecap
0 0 m
-3.5 0 l

gsave
0.000 setgray
fill
grestore
stroke
grestore
} bind def
900.7 522.004 o
grestore
gsave
865.075000 518.207303 translate
0.000000 rotate
0.000000 0.000000 m /zero glyphshow
6.362305 0.000000 m /period glyphshow
9.541016 0.000000 m /eight glyphshow
15.903320 0.000000 m /two glyphshow
22.265625 0.000000 m /five glyphshow
grestore
1.500 setlinewidth
2 setlinecap
0.122 0.467 0.706 setrgbcolor
gsave
237 238.8 900.7 310.4 clipbox
911.472727 328.980851 m
914.270838 366.453067 l
917.068949 398.212676 l
919.86706 426.79751 l
922.665171 447.040806 l
925.463282 463.031114 l
928.261393 474.962895 l
931.059504 483.230396 l
933.857615 489.394887 l
936.655726 494.084438 l
939.453837 498.009833 l
942.251948 501.011442 l
945.050059 503.759698 l
947.84817 505.746012 l
950.646281 507.815528 l
953.444392 509.580004 l
956.242503 511.198721 l
959.040614 512.517136 l
961.838725 513.773875 l
964.636836 514.985022 l
967.434947 516.018183 l
970.233058 516.894605 l
973.031169 517.835791 l
975.82928 518.675239 l
978.627391 519.380863 l
981.425502 520.134358 l
984.223613 520.950737 l
987.021724 521.564941 l
989.819835 522.310487 l
992.617946 522.797565 l
995.416057 523.423027 l
998.214168 523.879634 l
1001.012279 524.343602 l
1003.81039 524.877064 l
1006.608501 525.297319 l
1009.406612 525.84921 l
1012.204723 526.186068 l
1015.002834 526.676299 l
1017.800945 527.155412 l
1020.599055 527.480752 l
1023.397166 527.937547 l
1026.195277 528.403288 l
1028.993388 528.724306 l
1031.791499 529.0896 l
1034.58961 529.527182 l
1037.387721 529.838422 l
1040.185832 530.240313 l
1042.983943 530.510242 l
1045.782054 530.867555 l
1048.580165 531.170773 l
1051.378276 531.513357 l
1054.176387 531.830561 l
1056.974498 532.106755 l
1059.772609 532.339115 l
1062.57072 532.666227 l
1065.368831 532.98727 l
1068.166942 533.284843 l
1070.965053 533.60029 l
1073.763164 533.858488 l
1076.561275 534.135834 l
1079.359386 534.374762 l
1082.157497 534.616197 l
1084.955608 534.874036 l
1087.753719 535.251707 l
1090.55183 535.463946 l
1093.349941 535.732233 l
1096.148052 535.994238 l
1098.946163 536.206723 l
1101.744274 536.418823 l
1104.542385 536.663093 l
1107.340496 536.940979 l
1110.138607 537.082973 l
1112.936718 537.311934 l
1115.734829 537.522507 l
1118.53294 537.74468 l
1121.331051 537.855999 l
1124.129162 538.175784 l
1126.927273 538.345455 l
stroke
grestore
1.000 0.498 0.055 setrgbcolor
gsave
237 238.8 900.7 310.4 clipbox
911.472727 321.254545 m
914.270838 358.699115 l
917.068949 390.4061 l
919.86706 419.118655 l
922.665171 439.555994 l
925.463282 455.865819 l
928.261393 468.041371 l
931.059504 476.624514 l
933.857615 482.943269 l
936.655726 487.696954 l
939.453837 491.702675 l
942.251948 494.679675 l
945.050059 497.413579 l
947.84817 499.419975 l
950.646281 501.45145 l
953.444392 503.134622 l
956.242503 504.652514 l
959.040614 505.846338 l
961.838725 507.102636 l
964.636836 508.118685 l
967.434947 509.123439 l
970.233058 510.000087 l
973.031169 510.925736 l
975.82928 511.782507 l
978.627391 512.298358 l
981.425502 513.060194 l
984.223613 513.888151 l
987.021724 514.471323 l
989.819835 515.321914 l
992.617946 515.720062 l
995.416057 516.400704 l
998.214168 516.843185 l
1001.012279 517.269081 l
1003.81039 517.885024 l
1006.608501 518.264497 l
1009.406612 518.962525 l
1012.204723 519.180453 l
1015.002834 519.696081 l
1017.800945 520.139184 l
1020.599055 520.423945 l
1023.397166 520.900621 l
1026.195277 521.327005 l
1028.993388 521.603139 l
1031.791499 521.985547 l
1034.58961 522.468581 l
1037.387721 522.749162 l
1040.185832 523.127657 l
1042.983943 523.366084 l
1045.782054 523.738398 l
1048.580165 523.938584 l
1051.378276 524.25487 l
1054.176387 524.595925 l
1056.974498 524.715449 l
1059.772609 524.904563 l
1062.57072 525.337351 l
1065.368831 525.574355 l
1068.166942 525.792639 l
1070.965053 526.137606 l
1073.763164 526.410138 l
1076.561275 526.562212 l
1079.359386 526.768712 l
1082.157497 526.952179 l
1084.955608 527.209682 l
1087.753719 527.568923 l
1090.55183 527.764129 l
1093.349941 528.040352 l
1096.148052 528.195983 l
1098.946163 528.310794 l
1101.744274 528.578568 l
1104.542385 528.798008 l
1107.340496 529.056801 l
1110.138607 529.190154 l
1112.936718 529.278864 l
1115.734829 529.53112 l
1118.53294 529.676657 l
1121.331051 529.779418 l
1124.129162 529.978359 l
1126.927273 530.193663 l
stroke
grestore
0.800 setlinewidth
0 setlinejoin
[] 0 setdash
0.000 setgray
gsave
900.7 310.4 m
900.7 549.2 l
stroke
grestore
gsave
1137.7 310.4 m
1137.7 549.2 l
stroke
grestore
gsave
900.7 310.4 m
1137.7 310.4 l
stroke
grestore
gsave
900.7 549.2 m
1137.7 549.2 l
stroke
grestore
/DejaVuSans findfont
12.000 scalefont
setfont
gsave
965.520313 555.200000 translate
0.000000 rotate
0.000000 0.000000 m /S glyphshow
7.617188 0.000000 m /G glyphshow
16.916016 0.000000 m /D glyphshow
26.156250 0.000000 m /space glyphshow
29.970703 0.000000 m /hyphen glyphshow
34.300781 0.000000 m /space glyphshow
38.115234 0.000000 m /five glyphshow
45.750000 0.000000 m /zero glyphshow
53.384766 0.000000 m /zero glyphshow
61.019531 0.000000 m /space glyphshow
64.833984 0.000000 m /hyphen glyphshow
69.164062 0.000000 m /space glyphshow
72.978516 0.000000 m /zero glyphshow
80.613281 0.000000 m /period glyphshow
84.427734 0.000000 m /eight glyphshow
92.062500 0.000000 m /three glyphshow
99.697266 0.000000 m /two glyphshow
grestore
1.000 setlinewidth
0 setlinecap
0.800 setgray
gsave
1065.184375 315.4 m
1130.7 315.4 l
1132.033333 315.4 1132.7 316.066667 1132.7 317.4 c
1132.7 345.74375 l
1132.7 347.077083 1132.033333 347.74375 1130.7 347.74375 c
1065.184375 347.74375 l
1063.851042 347.74375 1063.184375 347.077083 1063.184375 345.74375 c
1063.184375 317.4 l
1063.184375 316.066667 1063.851042 315.4 1065.184375 315.4 c
cl
gsave
1.000 setgray
fill
grestore
stroke
grestore
1.500 setlinewidth
1 setlinejoin
2 setlinecap
[] 0 setdash
0.122 0.467 0.706 setrgbcolor
gsave
1067.184375 339.65 m
1087.184375 339.65 l
stroke
grestore
0.000 setgray
/DejaVuSans findfont
10.000 scalefont
setfont
gsave
1095.184375 336.150000 translate
0.000000 rotate
0.000000 0.000000 m /a glyphshow
6.127930 0.000000 m /u glyphshow
12.465820 0.000000 m /c glyphshow
grestore
1.000 0.498 0.055 setrgbcolor
gsave
1067.184375 324.978125 m
1087.184375 324.978125 l
stroke
grestore
0.000 setgray
gsave
1095.184375 321.478125 translate
0.000000 rotate
0.000000 0.000000 m /v glyphshow
5.917969 0.000000 m /a glyphshow
12.045898 0.000000 m /l glyphshow
14.824219 0.000000 m /A glyphshow
21.665039 0.000000 m /u glyphshow
28.002930 0.000000 m /c glyphshow
grestore
gsave
39.925 27.8 m
276.925 27.8 l
276.925 266.6 l
39.925 266.6 l
cl
1.000 setgray
fill
grestore
0.800 setlinewidth
0 setlinecap
gsave
/o {
gsave
newpath
translate
0.8 setlinewidth
1 setlinejoin
0 setlinecap
0 0 m
0 -3.5 l

gsave
0.000 setgray
fill
grestore
stroke
grestore
} bind def
45.1015 27.8 o
grestore
gsave
41.921818 13.206250 translate
0.000000 rotate
0.000000 0.000000 m /zero glyphshow
grestore
gsave
/o {
gsave
newpath
translate
0.8 setlinewidth
1 setlinejoin
0 setlinecap
0 0 m
0 -3.5 l

gsave
0.000 setgray
fill
grestore
stroke
grestore
} bind def
101.064 27.8 o
grestore
gsave
94.704350 13.206250 translate
0.000000 rotate
0.000000 0.000000 m /two glyphshow
6.362305 0.000000 m /zero glyphshow
grestore
gsave
/o {
gsave
newpath
translate
0.8 setlinewidth
1 setlinejoin
0 setlinecap
0 0 m
0 -3.5 l

gsave
0.000 setgray
fill
grestore
stroke
grestore
} bind def
157.026 27.8 o
grestore
gsave
150.666570 13.206250 translate
0.000000 rotate
0.000000 0.000000 m /four glyphshow
6.362305 0.000000 m /zero glyphshow
grestore
gsave
/o {
gsave
newpath
translate
0.8 setlinewidth
1 setlinejoin
0 setlinecap
0 0 m
0 -3.5 l

gsave
0.000 setgray
fill
grestore
stroke
grestore
} bind def
212.988 27.8 o
grestore
gsave
206.628789 13.206250 translate
0.000000 rotate
0.000000 0.000000 m /six glyphshow
6.362305 0.000000 m /zero glyphshow
grestore
gsave
/o {
gsave
newpath
translate
0.8 setlinewidth
1 setlinejoin
0 setlinecap
0 0 m
0 -3.5 l

gsave
0.000 setgray
fill
grestore
stroke
grestore
} bind def
268.95 27.8 o
grestore
gsave
262.591009 13.206250 translate
0.000000 rotate
0.000000 0.000000 m /eight glyphshow
6.362305 0.000000 m /zero glyphshow
grestore
gsave
/o {
gsave
newpath
translate
0.8 setlinewidth
1 setlinejoin
0 setlinecap
0 0 m
-3.5 0 l

gsave
0.000 setgray
fill
grestore
stroke
grestore
} bind def
39.925 47.2997 o
grestore
gsave
10.659375 43.502807 translate
0.000000 rotate
0.000000 0.000000 m /zero glyphshow
6.362305 0.000000 m /period glyphshow
9.541016 0.000000 m /eight glyphshow
15.903320 0.000000 m /four glyphshow
grestore
gsave
/o {
gsave
newpath
translate
0.8 setlinewidth
1 setlinejoin
0 setlinecap
0 0 m
-3.5 0 l

gsave
0.000 setgray
fill
grestore
stroke
grestore
} bind def
39.925 90.3946 o
grestore
gsave
10.659375 86.597754 translate
0.000000 rotate
0.000000 0.000000 m /zero glyphshow
6.362305 0.000000 m /period glyphshow
9.541016 0.000000 m /eight glyphshow
15.903320 0.000000 m /five glyphshow
grestore
gsave
/o {
gsave
newpath
translate
0.8 setlinewidth
1 setlinejoin
0 setlinecap
0 0 m
-3.5 0 l

gsave
0.000 setgray
fill
grestore
stroke
grestore
} bind def
39.925 133.49 o
grestore
gsave
10.659375 129.692702 translate
0.000000 rotate
0.000000 0.000000 m /zero glyphshow
6.362305 0.000000 m /period glyphshow
9.541016 0.000000 m /eight glyphshow
15.903320 0.000000 m /six glyphshow
grestore
gsave
/o {
gsave
newpath
translate
0.8 setlinewidth
1 setlinejoin
0 setlinecap
0 0 m
-3.5 0 l

gsave
0.000 setgray
fill
grestore
stroke
grestore
} bind def
39.925 176.585 o
grestore
gsave
10.659375 172.787649 translate
0.000000 rotate
0.000000 0.000000 m /zero glyphshow
6.362305 0.000000 m /period glyphshow
9.541016 0.000000 m /eight glyphshow
15.903320 0.000000 m /seven glyphshow
grestore
gsave
/o {
gsave
newpath
translate
0.8 setlinewidth
1 setlinejoin
0 setlinecap
0 0 m
-3.5 0 l

gsave
0.000 setgray
fill
grestore
stroke
grestore
} bind def
39.925 219.679 o
grestore
gsave
10.659375 215.882596 translate
0.000000 rotate
0.000000 0.000000 m /zero glyphshow
6.362305 0.000000 m /period glyphshow
9.541016 0.000000 m /eight glyphshow
15.903320 0.000000 m /eight glyphshow
grestore
gsave
/o {
gsave
newpath
translate
0.8 setlinewidth
1 setlinejoin
0 setlinecap
0 0 m
-3.5 0 l

gsave
0.000 setgray
fill
grestore
stroke
grestore
} bind def
39.925 262.774 o
grestore
gsave
10.659375 258.977544 translate
0.000000 rotate
0.000000 0.000000 m /zero glyphshow
6.362305 0.000000 m /period glyphshow
9.541016 0.000000 m /eight glyphshow
15.903320 0.000000 m /nine glyphshow
grestore
1.500 setlinewidth
2 setlinecap
0.122 0.467 0.706 setrgbcolor
gsave
237 238.8 39.93 27.8 clipbox
50.697727 93.617462 m
53.495838 106.027943 l
56.293949 111.846643 l
59.09206 115.979506 l
61.890171 119.891081 l
64.688282 123.31642 l
67.486393 131.714186 l
70.284504 135.08641 l
73.082615 137.345793 l
75.880726 141.854724 l
78.678837 143.918075 l
81.476948 147.151981 l
84.275059 150.955587 l
87.07317 153.78548 l
89.871281 156.501849 l
92.669392 159.330093 l
95.467503 161.216794 l
98.265614 160.960325 l
101.063725 165.631787 l
103.861836 168.599563 l
106.659947 170.657012 l
109.458058 170.265004 l
112.256169 174.79893 l
115.05428 178.586451 l
117.852391 180.327198 l
120.650502 179.441288 l
123.448613 183.680038 l
126.246724 185.571078 l
129.044835 187.690988 l
131.842946 188.555865 l
134.641057 190.984318 l
137.439168 193.904242 l
140.237279 194.258901 l
143.03539 195.652482 l
145.833501 198.076827 l
148.631612 200.276296 l
151.429723 199.728642 l
154.227834 201.873403 l
157.025945 204.874998 l
159.824055 205.030991 l
162.622166 206.535839 l
165.420277 206.734852 l
168.218388 210.05338 l
171.016499 210.469979 l
173.81461 213.226996 l
176.612721 213.97806 l
179.410832 216.25862 l
182.208943 217.01521 l
185.007054 219.099622 l
187.805165 220.045504 l
190.603276 220.992254 l
193.401387 220.926785 l
196.199498 223.660165 l
198.997609 224.43232 l
201.79572 225.371229 l
204.593831 227.051107 l
207.391942 229.276613 l
210.190053 229.633701 l
212.988164 232.639231 l
215.786275 233.048077 l
218.584386 232.774192 l
221.382497 235.4051 l
224.180608 234.63364 l
226.978719 237.551337 l
229.77683 238.933057 l
232.574941 240.70771 l
235.373052 242.292666 l
238.171163 241.34664 l
240.969274 244.173986 l
243.767385 242.917131 l
246.565496 247.073804 l
249.363607 248.013003 l
252.161718 249.037026 l
254.959829 249.832267 l
257.75794 250.618887 l
260.556051 252.20069 l
263.354162 253.496515 l
266.152273 255.745455 l
stroke
grestore
1.000 0.498 0.055 setrgbcolor
gsave
237 238.8 39.93 27.8 clipbox
50.697727 48.855039 m
53.495838 55.25013 l
56.293949 58.964669 l
59.09206 60.466043 l
61.890171 60.330299 l
64.688282 57.414162 l
67.486393 60.892487 l
70.284504 64.076963 l
73.082615 64.30294 l
75.880726 67.192778 l
78.678837 64.667812 l
81.476948 64.675056 l
84.275059 65.019613 l
87.07317 65.292991 l
89.871281 65.52196 l
92.669392 64.528288 l
95.467503 65.095358 l
98.265614 65.52511 l
101.063725 65.580069 l
103.861836 65.696443 l
106.659947 66.982233 l
109.458058 61.112953 l
112.256169 66.252018 l
115.05428 64.171448 l
117.852391 63.710359 l
120.650502 63.423596 l
123.448613 63.294623 l
126.246724 61.115158 l
129.044835 61.457353 l
131.842946 61.191061 l
134.641057 61.723015 l
137.439168 58.384213 l
140.237279 60.198019 l
143.03539 60.165579 l
145.833501 59.101673 l
148.631612 57.208499 l
151.429723 57.054803 l
154.227834 59.485756 l
157.025945 57.173854 l
159.824055 57.502821 l
162.622166 57.218263 l
165.420277 56.81229 l
168.218388 52.154629 l
171.016499 54.712193 l
173.81461 54.327007 l
176.612721 54.994862 l
179.410832 53.685766 l
182.208943 53.455694 l
185.007054 50.482079 l
187.805165 52.513674 l
190.603276 53.583092 l
193.401387 51.975579 l
196.199498 51.396698 l
198.997609 51.245521 l
201.79572 51.954477 l
204.593831 49.44699 l
207.391942 50.253896 l
210.190053 47.110207 l
212.988164 48.080731 l
215.786275 49.431085 l
218.584386 45.557181 l
221.382497 47.902625 l
224.180608 46.919504 l
226.978719 47.06265 l
229.77683 45.516552 l
232.574941 46.902024 l
235.373052 43.351418 l
238.171163 42.574905 l
240.969274 46.75006 l
243.767385 43.249531 l
246.565496 41.80847 l
249.363607 43.878174 l
252.161718 41.362499 l
254.959829 41.199669 l
257.75794 40.477328 l
260.556051 39.819079 l
263.354162 40.522051 l
266.152273 38.654545 l
stroke
grestore
0.800 setlinewidth
0 setlinejoin
[] 0 setdash
0.000 setgray
gsave
39.925 27.8 m
39.925 266.6 l
stroke
grestore
gsave
276.925 27.8 m
276.925 266.6 l
stroke
grestore
gsave
39.925 27.8 m
276.925 27.8 l
stroke
grestore
gsave
39.925 266.6 m
276.925 266.6 l
stroke
grestore
/DejaVuSans findfont
12.000 scalefont
setfont
gsave
96.276562 272.600000 translate
0.000000 rotate
0.000000 0.000000 m /A glyphshow
8.208984 0.000000 m /d glyphshow
15.826172 0.000000 m /a glyphshow
23.179688 0.000000 m /g glyphshow
30.796875 0.000000 m /r glyphshow
35.730469 0.000000 m /a glyphshow
43.083984 0.000000 m /d glyphshow
50.701172 0.000000 m /space glyphshow
54.515625 0.000000 m /hyphen glyphshow
58.845703 0.000000 m /space glyphshow
62.660156 0.000000 m /five glyphshow
70.294922 0.000000 m /zero glyphshow
77.929688 0.000000 m /space glyphshow
81.744141 0.000000 m /hyphen glyphshow
86.074219 0.000000 m /space glyphshow
89.888672 0.000000 m /zero glyphshow
97.523438 0.000000 m /period glyphshow
101.337891 0.000000 m /eight glyphshow
108.972656 0.000000 m /four glyphshow
116.607422 0.000000 m /five glyphshow
grestore
1.000 setlinewidth
0 setlinecap
0.800 setgray
gsave
46.925 229.25625 m
112.440625 229.25625 l
113.773958 229.25625 114.440625 229.922917 114.440625 231.25625 c
114.440625 259.6 l
114.440625 260.933333 113.773958 261.6 112.440625 261.6 c
46.925 261.6 l
45.591667 261.6 44.925 260.933333 44.925 259.6 c
44.925 231.25625 l
44.925 229.922917 45.591667 229.25625 46.925 229.25625 c
cl
gsave
1.000 setgray
fill
grestore
stroke
grestore
1.500 setlinewidth
1 setlinejoin
2 setlinecap
[] 0 setdash
0.122 0.467 0.706 setrgbcolor
gsave
48.925 253.50625 m
68.925 253.50625 l
stroke
grestore
0.000 setgray
/DejaVuSans findfont
10.000 scalefont
setfont
gsave
76.925000 250.006250 translate
0.000000 rotate
0.000000 0.000000 m /a glyphshow
6.127930 0.000000 m /u glyphshow
12.465820 0.000000 m /c glyphshow
grestore
1.000 0.498 0.055 setrgbcolor
gsave
48.925 238.834375 m
68.925 238.834375 l
stroke
grestore
0.000 setgray
gsave
76.925000 235.334375 translate
0.000000 rotate
0.000000 0.000000 m /v glyphshow
5.917969 0.000000 m /a glyphshow
12.045898 0.000000 m /l glyphshow
14.824219 0.000000 m /A glyphshow
21.665039 0.000000 m /u glyphshow
28.002930 0.000000 m /c glyphshow
grestore
gsave
326.85 27.8 m
563.85 27.8 l
563.85 266.6 l
326.85 266.6 l
cl
1.000 setgray
fill
grestore
0.800 setlinewidth
0 setlinecap
gsave
/o {
gsave
newpath
translate
0.8 setlinewidth
1 setlinejoin
0 setlinecap
0 0 m
0 -3.5 l

gsave
0.000 setgray
fill
grestore
stroke
grestore
} bind def
332.027 27.8 o
grestore
gsave
328.846818 13.206250 translate
0.000000 rotate
0.000000 0.000000 m /zero glyphshow
grestore
gsave
/o {
gsave
newpath
translate
0.8 setlinewidth
1 setlinejoin
0 setlinecap
0 0 m
0 -3.5 l

gsave
0.000 setgray
fill
grestore
stroke
grestore
} bind def
387.989 27.8 o
grestore
gsave
381.629350 13.206250 translate
0.000000 rotate
0.000000 0.000000 m /two glyphshow
6.362305 0.000000 m /zero glyphshow
grestore
gsave
/o {
gsave
newpath
translate
0.8 setlinewidth
1 setlinejoin
0 setlinecap
0 0 m
0 -3.5 l

gsave
0.000 setgray
fill
grestore
stroke
grestore
} bind def
443.951 27.8 o
grestore
gsave
437.591570 13.206250 translate
0.000000 rotate
0.000000 0.000000 m /four glyphshow
6.362305 0.000000 m /zero glyphshow
grestore
gsave
/o {
gsave
newpath
translate
0.8 setlinewidth
1 setlinejoin
0 setlinecap
0 0 m
0 -3.5 l

gsave
0.000 setgray
fill
grestore
stroke
grestore
} bind def
499.913 27.8 o
grestore
gsave
493.553789 13.206250 translate
0.000000 rotate
0.000000 0.000000 m /six glyphshow
6.362305 0.000000 m /zero glyphshow
grestore
gsave
/o {
gsave
newpath
translate
0.8 setlinewidth
1 setlinejoin
0 setlinecap
0 0 m
0 -3.5 l

gsave
0.000 setgray
fill
grestore
stroke
grestore
} bind def
555.875 27.8 o
grestore
gsave
549.516009 13.206250 translate
0.000000 rotate
0.000000 0.000000 m /eight glyphshow
6.362305 0.000000 m /zero glyphshow
grestore
gsave
/o {
gsave
newpath
translate
0.8 setlinewidth
1 setlinejoin
0 setlinecap
0 0 m
-3.5 0 l

gsave
0.000 setgray
fill
grestore
stroke
grestore
} bind def
326.85 60.3265 o
grestore
gsave
297.584375 56.529674 translate
0.000000 rotate
0.000000 0.000000 m /zero glyphshow
6.362305 0.000000 m /period glyphshow
9.541016 0.000000 m /eight glyphshow
15.903320 0.000000 m /four glyphshow
grestore
gsave
/o {
gsave
newpath
translate
0.8 setlinewidth
1 setlinejoin
0 setlinecap
0 0 m
-3.5 0 l

gsave
0.000 setgray
fill
grestore
stroke
grestore
} bind def
326.85 101.344 o
grestore
gsave
297.584375 97.547232 translate
0.000000 rotate
0.000000 0.000000 m /zero glyphshow
6.362305 0.000000 m /period glyphshow
9.541016 0.000000 m /eight glyphshow
15.903320 0.000000 m /five glyphshow
grestore
gsave
/o {
gsave
newpath
translate
0.8 setlinewidth
1 setlinejoin
0 setlinecap
0 0 m
-3.5 0 l

gsave
0.000 setgray
fill
grestore
stroke
grestore
} bind def
326.85 142.362 o
grestore
gsave
297.584375 138.564789 translate
0.000000 rotate
0.000000 0.000000 m /zero glyphshow
6.362305 0.000000 m /period glyphshow
9.541016 0.000000 m /eight glyphshow
15.903320 0.000000 m /six glyphshow
grestore
gsave
/o {
gsave
newpath
translate
0.8 setlinewidth
1 setlinejoin
0 setlinecap
0 0 m
-3.5 0 l

gsave
0.000 setgray
fill
grestore
stroke
grestore
} bind def
326.85 183.379 o
grestore
gsave
297.584375 179.582347 translate
0.000000 rotate
0.000000 0.000000 m /zero glyphshow
6.362305 0.000000 m /period glyphshow
9.541016 0.000000 m /eight glyphshow
15.903320 0.000000 m /seven glyphshow
grestore
gsave
/o {
gsave
newpath
translate
0.8 setlinewidth
1 setlinejoin
0 setlinecap
0 0 m
-3.5 0 l

gsave
0.000 setgray
fill
grestore
stroke
grestore
} bind def
326.85 224.397 o
grestore
gsave
297.584375 220.599905 translate
0.000000 rotate
0.000000 0.000000 m /zero glyphshow
6.362305 0.000000 m /period glyphshow
9.541016 0.000000 m /eight glyphshow
15.903320 0.000000 m /eight glyphshow
grestore
gsave
/o {
gsave
newpath
translate
0.8 setlinewidth
1 setlinejoin
0 setlinecap
0 0 m
-3.5 0 l

gsave
0.000 setgray
fill
grestore
stroke
grestore
} bind def
326.85 265.414 o
grestore
gsave
297.584375 261.617462 translate
0.000000 rotate
0.000000 0.000000 m /zero glyphshow
6.362305 0.000000 m /period glyphshow
9.541016 0.000000 m /eight glyphshow
15.903320 0.000000 m /nine glyphshow
grestore
1.500 setlinewidth
2 setlinecap
0.122 0.467 0.706 setrgbcolor
gsave
237 238.8 326.9 27.8 clipbox
337.622727 104.074984 m
340.420838 113.773371 l
343.218949 118.502219 l
346.01706 122.679523 l
348.815171 128.087075 l
351.613282 132.702062 l
354.411393 135.937226 l
357.209504 141.480558 l
360.007615 144.260967 l
362.805726 146.292041 l
365.603837 149.394344 l
368.401948 153.181878 l
371.200059 154.690349 l
373.99817 158.094142 l
376.796281 159.482749 l
379.594392 162.720749 l
382.392503 165.93069 l
385.190614 165.793314 l
387.988725 170.721577 l
390.786836 173.408996 l
393.584947 175.235149 l
396.383058 176.083777 l
399.181169 178.192558 l
401.97928 181.520793 l
404.777391 179.166392 l
407.575502 183.959812 l
410.373613 183.861702 l
413.171724 187.516319 l
415.969835 190.981986 l
418.767946 192.205461 l
421.566057 192.607898 l
424.364168 194.14049 l
427.162279 196.446593 l
429.96039 198.676311 l
432.758501 198.496419 l
435.556612 202.506718 l
438.354723 203.021419 l
441.152834 205.263776 l
443.950945 206.707042 l
446.749055 208.431229 l
449.547166 208.7887 l
452.345277 209.328266 l
455.143388 209.359216 l
457.941499 214.416815 l
460.73961 215.338551 l
463.537721 217.10765 l
466.335832 218.423975 l
469.133943 220.448496 l
471.932054 220.887886 l
474.730165 221.638156 l
477.528276 224.383402 l
480.326387 223.916999 l
483.124498 226.659683 l
485.922609 226.874904 l
488.72072 228.657247 l
491.518831 229.462892 l
494.316942 231.191897 l
497.115053 233.074829 l
499.913164 233.314061 l
502.711275 233.412391 l
505.509386 234.865047 l
508.307497 237.526473 l
511.105608 237.987424 l
513.903719 239.65731 l
516.70183 240.661406 l
519.499941 241.959117 l
522.298052 241.790047 l
525.096163 245.395789 l
527.894274 245.369382 l
530.692385 244.124016 l
533.490496 249.048534 l
536.288607 249.590413 l
539.086718 250.6487 l
541.884829 249.809984 l
544.68294 251.420751 l
547.481051 253.317808 l
550.279162 253.583254 l
553.077273 255.745455 l
stroke
grestore
1.000 0.498 0.055 setrgbcolor
gsave
237 238.8 326.9 27.8 clipbox
337.622727 63.586661 m
340.420838 66.970607 l
343.218949 65.755492 l
346.01706 66.597544 l
348.815171 69.399038 l
351.613282 69.220376 l
354.411393 73.29469 l
357.209504 70.923665 l
360.007615 74.600785 l
362.805726 71.54044 l
365.603837 69.089526 l
368.401948 71.15134 l
371.200059 69.768204 l
373.99817 72.436751 l
376.796281 69.939222 l
379.594392 71.615083 l
382.392503 70.711128 l
385.190614 69.775698 l
387.988725 67.023666 l
390.786836 70.925613 l
393.584947 69.484922 l
396.383058 66.730342 l
399.181169 68.043781 l
401.97928 65.778124 l
404.777391 63.65276 l
407.575502 68.082901 l
410.373613 66.958916 l
413.171724 68.833823 l
415.969835 61.57281 l
418.767946 63.780611 l
421.566057 65.950642 l
424.364168 65.200319 l
427.162279 64.385096 l
429.96039 62.278167 l
432.758501 59.44145 l
435.556612 61.322952 l
438.354723 59.632403 l
441.152834 62.01437 l
443.950945 59.966796 l
446.749055 58.459256 l
449.547166 59.267284 l
452.345277 57.526824 l
455.143388 57.100851 l
457.941499 56.054057 l
460.73961 56.973 l
463.537721 55.494088 l
466.335832 53.989845 l
469.133943 55.523465 l
471.932054 54.112151 l
474.730165 51.133943 l
477.528276 53.629672 l
480.326387 50.944788 l
483.124498 51.854588 l
485.922609 50.652813 l
488.72072 52.033401 l
491.518831 47.283705 l
494.316942 48.951322 l
497.115053 48.347437 l
499.913164 49.922875 l
502.711275 52.828239 l
505.509386 46.227168 l
508.307497 48.12216 l
511.105608 48.879677 l
513.903719 46.947064 l
516.70183 44.622054 l
519.499941 46.855935 l
522.298052 45.424386 l
525.096163 45.391711 l
527.894274 41.997873 l
530.692385 40.553284 l
533.490496 41.998472 l
536.288607 41.114752 l
539.086718 40.769118 l
541.884829 38.654545 l
544.68294 39.354507 l
547.481051 39.501094 l
550.279162 41.993526 l
553.077273 40.056567 l
stroke
grestore
0.800 setlinewidth
0 setlinejoin
[] 0 setdash
0.000 setgray
gsave
326.85 27.8 m
326.85 266.6 l
stroke
grestore
gsave
563.85 27.8 m
563.85 266.6 l
stroke
grestore
gsave
326.85 27.8 m
563.85 27.8 l
stroke
grestore
gsave
326.85 266.6 m
563.85 266.6 l
stroke
grestore
/DejaVuSans findfont
12.000 scalefont
setfont
gsave
379.381250 272.600000 translate
0.000000 rotate
0.000000 0.000000 m /A glyphshow
8.208984 0.000000 m /d glyphshow
15.826172 0.000000 m /a glyphshow
23.179688 0.000000 m /g glyphshow
30.796875 0.000000 m /r glyphshow
35.730469 0.000000 m /a glyphshow
43.083984 0.000000 m /d glyphshow
50.701172 0.000000 m /space glyphshow
54.515625 0.000000 m /hyphen glyphshow
58.845703 0.000000 m /space glyphshow
62.660156 0.000000 m /one glyphshow
70.294922 0.000000 m /zero glyphshow
77.929688 0.000000 m /zero glyphshow
85.564453 0.000000 m /space glyphshow
89.378906 0.000000 m /hyphen glyphshow
93.708984 0.000000 m /space glyphshow
97.523438 0.000000 m /zero glyphshow
105.158203 0.000000 m /period glyphshow
108.972656 0.000000 m /eight glyphshow
116.607422 0.000000 m /four glyphshow
124.242188 0.000000 m /three glyphshow
grestore
1.000 setlinewidth
0 setlinecap
0.800 setgray
gsave
333.85 229.25625 m
399.365625 229.25625 l
400.698958 229.25625 401.365625 229.922917 401.365625 231.25625 c
401.365625 259.6 l
401.365625 260.933333 400.698958 261.6 399.365625 261.6 c
333.85 261.6 l
332.516667 261.6 331.85 260.933333 331.85 259.6 c
331.85 231.25625 l
331.85 229.922917 332.516667 229.25625 333.85 229.25625 c
cl
gsave
1.000 setgray
fill
grestore
stroke
grestore
1.500 setlinewidth
1 setlinejoin
2 setlinecap
[] 0 setdash
0.122 0.467 0.706 setrgbcolor
gsave
335.85 253.50625 m
355.85 253.50625 l
stroke
grestore
0.000 setgray
/DejaVuSans findfont
10.000 scalefont
setfont
gsave
363.850000 250.006250 translate
0.000000 rotate
0.000000 0.000000 m /a glyphshow
6.127930 0.000000 m /u glyphshow
12.465820 0.000000 m /c glyphshow
grestore
1.000 0.498 0.055 setrgbcolor
gsave
335.85 238.834375 m
355.85 238.834375 l
stroke
grestore
0.000 setgray
gsave
363.850000 235.334375 translate
0.000000 rotate
0.000000 0.000000 m /v glyphshow
5.917969 0.000000 m /a glyphshow
12.045898 0.000000 m /l glyphshow
14.824219 0.000000 m /A glyphshow
21.665039 0.000000 m /u glyphshow
28.002930 0.000000 m /c glyphshow
grestore
gsave
613.775 27.8 m
850.775 27.8 l
850.775 266.6 l
613.775 266.6 l
cl
1.000 setgray
fill
grestore
0.800 setlinewidth
0 setlinecap
gsave
/o {
gsave
newpath
translate
0.8 setlinewidth
1 setlinejoin
0 setlinecap
0 0 m
0 -3.5 l

gsave
0.000 setgray
fill
grestore
stroke
grestore
} bind def
618.952 27.8 o
grestore
gsave
615.771818 13.206250 translate
0.000000 rotate
0.000000 0.000000 m /zero glyphshow
grestore
gsave
/o {
gsave
newpath
translate
0.8 setlinewidth
1 setlinejoin
0 setlinecap
0 0 m
0 -3.5 l

gsave
0.000 setgray
fill
grestore
stroke
grestore
} bind def
674.914 27.8 o
grestore
gsave
668.554350 13.206250 translate
0.000000 rotate
0.000000 0.000000 m /two glyphshow
6.362305 0.000000 m /zero glyphshow
grestore
gsave
/o {
gsave
newpath
translate
0.8 setlinewidth
1 setlinejoin
0 setlinecap
0 0 m
0 -3.5 l

gsave
0.000 setgray
fill
grestore
stroke
grestore
} bind def
730.876 27.8 o
grestore
gsave
724.516570 13.206250 translate
0.000000 rotate
0.000000 0.000000 m /four glyphshow
6.362305 0.000000 m /zero glyphshow
grestore
gsave
/o {
gsave
newpath
translate
0.8 setlinewidth
1 setlinejoin
0 setlinecap
0 0 m
0 -3.5 l

gsave
0.000 setgray
fill
grestore
stroke
grestore
} bind def
786.838 27.8 o
grestore
gsave
780.478789 13.206250 translate
0.000000 rotate
0.000000 0.000000 m /six glyphshow
6.362305 0.000000 m /zero glyphshow
grestore
gsave
/o {
gsave
newpath
translate
0.8 setlinewidth
1 setlinejoin
0 setlinecap
0 0 m
0 -3.5 l

gsave
0.000 setgray
fill
grestore
stroke
grestore
} bind def
842.8 27.8 o
grestore
gsave
836.441009 13.206250 translate
0.000000 rotate
0.000000 0.000000 m /eight glyphshow
6.362305 0.000000 m /zero glyphshow
grestore
gsave
/o {
gsave
newpath
translate
0.8 setlinewidth
1 setlinejoin
0 setlinecap
0 0 m
-3.5 0 l

gsave
0.000 setgray
fill
grestore
stroke
grestore
} bind def
613.775 52.6973 o
grestore
gsave
584.509375 48.900389 translate
0.000000 rotate
0.000000 0.000000 m /zero glyphshow
6.362305 0.000000 m /period glyphshow
9.541016 0.000000 m /eight glyphshow
15.903320 0.000000 m /four glyphshow
grestore
gsave
/o {
gsave
newpath
translate
0.8 setlinewidth
1 setlinejoin
0 setlinecap
0 0 m
-3.5 0 l

gsave
0.000 setgray
fill
grestore
stroke
grestore
} bind def
613.775 93.3181 o
grestore
gsave
584.509375 89.521216 translate
0.000000 rotate
0.000000 0.000000 m /zero glyphshow
6.362305 0.000000 m /period glyphshow
9.541016 0.000000 m /eight glyphshow
15.903320 0.000000 m /five glyphshow
grestore
gsave
/o {
gsave
newpath
translate
0.8 setlinewidth
1 setlinejoin
0 setlinecap
0 0 m
-3.5 0 l

gsave
0.000 setgray
fill
grestore
stroke
grestore
} bind def
613.775 133.939 o
grestore
gsave
584.509375 130.142043 translate
0.000000 rotate
0.000000 0.000000 m /zero glyphshow
6.362305 0.000000 m /period glyphshow
9.541016 0.000000 m /eight glyphshow
15.903320 0.000000 m /six glyphshow
grestore
gsave
/o {
gsave
newpath
translate
0.8 setlinewidth
1 setlinejoin
0 setlinecap
0 0 m
-3.5 0 l

gsave
0.000 setgray
fill
grestore
stroke
grestore
} bind def
613.775 174.56 o
grestore
gsave
584.509375 170.762870 translate
0.000000 rotate
0.000000 0.000000 m /zero glyphshow
6.362305 0.000000 m /period glyphshow
9.541016 0.000000 m /eight glyphshow
15.903320 0.000000 m /seven glyphshow
grestore
gsave
/o {
gsave
newpath
translate
0.8 setlinewidth
1 setlinejoin
0 setlinecap
0 0 m
-3.5 0 l

gsave
0.000 setgray
fill
grestore
stroke
grestore
} bind def
613.775 215.181 o
grestore
gsave
584.509375 211.383697 translate
0.000000 rotate
0.000000 0.000000 m /zero glyphshow
6.362305 0.000000 m /period glyphshow
9.541016 0.000000 m /eight glyphshow
15.903320 0.000000 m /eight glyphshow
grestore
gsave
/o {
gsave
newpath
translate
0.8 setlinewidth
1 setlinejoin
0 setlinecap
0 0 m
-3.5 0 l

gsave
0.000 setgray
fill
grestore
stroke
grestore
} bind def
613.775 255.801 o
grestore
gsave
584.509375 252.004524 translate
0.000000 rotate
0.000000 0.000000 m /zero glyphshow
6.362305 0.000000 m /period glyphshow
9.541016 0.000000 m /eight glyphshow
15.903320 0.000000 m /nine glyphshow
grestore
1.500 setlinewidth
2 setlinecap
0.122 0.467 0.706 setrgbcolor
gsave
237 238.8 613.8 27.8 clipbox
624.547727 92.765233 m
627.345838 100.825759 l
630.143949 108.691443 l
632.94206 114.732522 l
635.740171 120.831821 l
638.538282 123.87543 l
641.336393 127.308285 l
644.134504 132.881964 l
646.932615 136.362568 l
649.730726 137.157912 l
652.528837 143.010285 l
655.326948 145.226345 l
658.125059 147.829688 l
660.92317 152.390139 l
663.721281 154.093559 l
666.519392 158.082004 l
669.317503 160.132974 l
672.115614 162.374449 l
674.913725 165.728168 l
677.711836 168.329438 l
680.509947 170.522456 l
683.308058 172.634537 l
686.106169 175.975139 l
688.90428 178.224414 l
691.702391 178.562747 l
694.500502 182.683695 l
697.298613 183.662044 l
700.096724 185.472388 l
702.894835 188.976199 l
705.692946 190.29869 l
708.491057 192.407826 l
711.289168 191.746267 l
714.087279 195.62727 l
716.88539 198.346781 l
719.683501 196.816741 l
722.481612 200.903683 l
725.279723 203.209815 l
728.077834 204.540105 l
730.875945 206.816349 l
733.674055 207.617911 l
736.472166 209.541887 l
739.270277 209.739482 l
742.068388 212.811124 l
744.866499 214.758007 l
747.66461 215.903328 l
750.462721 217.460174 l
753.260832 218.816671 l
756.058943 219.522816 l
758.857054 218.794637 l
761.655165 222.540956 l
764.453276 223.42378 l
767.251387 223.844631 l
770.049498 226.657949 l
772.847609 227.811342 l
775.64572 227.741832 l
778.443831 230.662674 l
781.241942 231.512311 l
784.040053 230.829836 l
786.838164 233.006874 l
789.636275 235.68518 l
792.434386 235.455107 l
795.232497 236.491077 l
798.030608 238.4871 l
800.828719 240.52798 l
803.62683 241.035903 l
806.424941 242.528502 l
809.223052 243.154475 l
812.021163 244.020147 l
814.819274 245.723703 l
817.617385 246.202611 l
820.415496 246.876769 l
823.213607 247.909112 l
826.011718 251.15997 l
828.809829 248.941946 l
831.60794 253.654071 l
834.406051 253.310747 l
837.204162 255.248958 l
840.002273 255.745455 l
stroke
grestore
1.000 0.498 0.055 setrgbcolor
gsave
237 238.8 613.8 27.8 clipbox
624.547727 52.256382 m
627.345838 59.437813 l
630.143949 61.869178 l
632.94206 65.171262 l
635.740171 65.649519 l
638.538282 66.673275 l
641.336393 67.88302 l
644.134504 69.038883 l
646.932615 67.207789 l
649.730726 69.582897 l
652.528837 70.128544 l
655.326948 69.445298 l
658.125059 68.507337 l
660.92317 70.12038 l
663.721281 68.780012 l
666.519392 69.034133 l
669.317503 70.39632 l
672.115614 70.572661 l
674.913725 70.64109 l
677.711836 71.902193 l
680.509947 70.723916 l
683.308058 69.28098 l
686.106169 68.789215 l
688.90428 68.246537 l
691.702391 68.396159 l
694.500502 67.028777 l
697.298613 68.432526 l
700.096724 68.509267 l
702.894835 69.299831 l
705.692946 68.448409 l
708.491057 68.770215 l
711.289168 66.115011 l
714.087279 65.060975 l
716.88539 65.325931 l
719.683501 64.712004 l
722.481612 66.928731 l
725.279723 62.994166 l
728.077834 61.898271 l
730.875945 62.793928 l
733.674055 60.301705 l
736.472166 62.549307 l
739.270277 63.523337 l
742.068388 60.651714 l
744.866499 59.878665 l
747.66461 60.297549 l
750.462721 56.51602 l
753.260832 56.53116 l
756.058943 58.923783 l
758.857054 57.677078 l
761.655165 53.935923 l
764.453276 56.60612 l
767.251387 54.670825 l
770.049498 55.871812 l
772.847609 53.511103 l
775.64572 53.47251 l
778.443831 51.990387 l
781.241942 51.087308 l
784.040053 53.419964 l
786.838164 52.561416 l
789.636275 49.438048 l
792.434386 50.287392 l
795.232497 50.203081 l
798.030608 48.844011 l
800.828719 47.712788 l
803.62683 45.608426 l
806.424941 47.463714 l
809.223052 44.658145 l
812.021163 45.712182 l
814.819274 47.042456 l
817.617385 45.796641 l
820.415496 43.960501 l
823.213607 44.010672 l
826.011718 40.133551 l
828.809829 46.775422 l
831.60794 41.41974 l
834.406051 39.968046 l
837.204162 38.654545 l
840.002273 40.747181 l
stroke
grestore
0.800 setlinewidth
0 setlinejoin
[] 0 setdash
0.000 setgray
gsave
613.775 27.8 m
613.775 266.6 l
stroke
grestore
gsave
850.775 27.8 m
850.775 266.6 l
stroke
grestore
gsave
613.775 27.8 m
850.775 27.8 l
stroke
grestore
gsave
613.775 266.6 m
850.775 266.6 l
stroke
grestore
/DejaVuSans findfont
12.000 scalefont
setfont
gsave
666.306250 272.600000 translate
0.000000 rotate
0.000000 0.000000 m /A glyphshow
8.208984 0.000000 m /d glyphshow
15.826172 0.000000 m /a glyphshow
23.179688 0.000000 m /g glyphshow
30.796875 0.000000 m /r glyphshow
35.730469 0.000000 m /a glyphshow
43.083984 0.000000 m /d glyphshow
50.701172 0.000000 m /space glyphshow
54.515625 0.000000 m /hyphen glyphshow
58.845703 0.000000 m /space glyphshow
62.660156 0.000000 m /two glyphshow
70.294922 0.000000 m /zero glyphshow
77.929688 0.000000 m /zero glyphshow
85.564453 0.000000 m /space glyphshow
89.378906 0.000000 m /hyphen glyphshow
93.708984 0.000000 m /space glyphshow
97.523438 0.000000 m /zero glyphshow
105.158203 0.000000 m /period glyphshow
108.972656 0.000000 m /eight glyphshow
116.607422 0.000000 m /four glyphshow
124.242188 0.000000 m /five glyphshow
grestore
1.000 setlinewidth
0 setlinecap
0.800 setgray
gsave
620.775 229.25625 m
686.290625 229.25625 l
687.623958 229.25625 688.290625 229.922917 688.290625 231.25625 c
688.290625 259.6 l
688.290625 260.933333 687.623958 261.6 686.290625 261.6 c
620.775 261.6 l
619.441667 261.6 618.775 260.933333 618.775 259.6 c
618.775 231.25625 l
618.775 229.922917 619.441667 229.25625 620.775 229.25625 c
cl
gsave
1.000 setgray
fill
grestore
stroke
grestore
1.500 setlinewidth
1 setlinejoin
2 setlinecap
[] 0 setdash
0.122 0.467 0.706 setrgbcolor
gsave
622.775 253.50625 m
642.775 253.50625 l
stroke
grestore
0.000 setgray
/DejaVuSans findfont
10.000 scalefont
setfont
gsave
650.775000 250.006250 translate
0.000000 rotate
0.000000 0.000000 m /a glyphshow
6.127930 0.000000 m /u glyphshow
12.465820 0.000000 m /c glyphshow
grestore
1.000 0.498 0.055 setrgbcolor
gsave
622.775 238.834375 m
642.775 238.834375 l
stroke
grestore
0.000 setgray
gsave
650.775000 235.334375 translate
0.000000 rotate
0.000000 0.000000 m /v glyphshow
5.917969 0.000000 m /a glyphshow
12.045898 0.000000 m /l glyphshow
14.824219 0.000000 m /A glyphshow
21.665039 0.000000 m /u glyphshow
28.002930 0.000000 m /c glyphshow
grestore
gsave
900.7 27.8 m
1137.7 27.8 l
1137.7 266.6 l
900.7 266.6 l
cl
1.000 setgray
fill
grestore
0.800 setlinewidth
0 setlinecap
gsave
/o {
gsave
newpath
translate
0.8 setlinewidth
1 setlinejoin
0 setlinecap
0 0 m
0 -3.5 l

gsave
0.000 setgray
fill
grestore
stroke
grestore
} bind def
905.877 27.8 o
grestore
gsave
902.696818 13.206250 translate
0.000000 rotate
0.000000 0.000000 m /zero glyphshow
grestore
gsave
/o {
gsave
newpath
translate
0.8 setlinewidth
1 setlinejoin
0 setlinecap
0 0 m
0 -3.5 l

gsave
0.000 setgray
fill
grestore
stroke
grestore
} bind def
961.839 27.8 o
grestore
gsave
955.479350 13.206250 translate
0.000000 rotate
0.000000 0.000000 m /two glyphshow
6.362305 0.000000 m /zero glyphshow
grestore
gsave
/o {
gsave
newpath
translate
0.8 setlinewidth
1 setlinejoin
0 setlinecap
0 0 m
0 -3.5 l

gsave
0.000 setgray
fill
grestore
stroke
grestore
} bind def
1017.8 27.8 o
grestore
gsave
1011.441570 13.206250 translate
0.000000 rotate
0.000000 0.000000 m /four glyphshow
6.362305 0.000000 m /zero glyphshow
grestore
gsave
/o {
gsave
newpath
translate
0.8 setlinewidth
1 setlinejoin
0 setlinecap
0 0 m
0 -3.5 l

gsave
0.000 setgray
fill
grestore
stroke
grestore
} bind def
1073.76 27.8 o
grestore
gsave
1067.403789 13.206250 translate
0.000000 rotate
0.000000 0.000000 m /six glyphshow
6.362305 0.000000 m /zero glyphshow
grestore
gsave
/o {
gsave
newpath
translate
0.8 setlinewidth
1 setlinejoin
0 setlinecap
0 0 m
0 -3.5 l

gsave
0.000 setgray
fill
grestore
stroke
grestore
} bind def
1129.73 27.8 o
grestore
gsave
1123.366009 13.206250 translate
0.000000 rotate
0.000000 0.000000 m /eight glyphshow
6.362305 0.000000 m /zero glyphshow
grestore
gsave
/o {
gsave
newpath
translate
0.8 setlinewidth
1 setlinejoin
0 setlinecap
0 0 m
-3.5 0 l

gsave
0.000 setgray
fill
grestore
stroke
grestore
} bind def
900.7 54.0295 o
grestore
gsave
871.434375 50.232651 translate
0.000000 rotate
0.000000 0.000000 m /zero glyphshow
6.362305 0.000000 m /period glyphshow
9.541016 0.000000 m /eight glyphshow
15.903320 0.000000 m /four glyphshow
grestore
gsave
/o {
gsave
newpath
translate
0.8 setlinewidth
1 setlinejoin
0 setlinecap
0 0 m
-3.5 0 l

gsave
0.000 setgray
fill
grestore
stroke
grestore
} bind def
900.7 100.438 o
grestore
gsave
871.434375 96.641000 translate
0.000000 rotate
0.000000 0.000000 m /zero glyphshow
6.362305 0.000000 m /period glyphshow
9.541016 0.000000 m /eight glyphshow
15.903320 0.000000 m /five glyphshow
grestore
gsave
/o {
gsave
newpath
translate
0.8 setlinewidth
1 setlinejoin
0 setlinecap
0 0 m
-3.5 0 l

gsave
0.000 setgray
fill
grestore
stroke
grestore
} bind def
900.7 146.846 o
grestore
gsave
871.434375 143.049349 translate
0.000000 rotate
0.000000 0.000000 m /zero glyphshow
6.362305 0.000000 m /period glyphshow
9.541016 0.000000 m /eight glyphshow
15.903320 0.000000 m /six glyphshow
grestore
gsave
/o {
gsave
newpath
translate
0.8 setlinewidth
1 setlinejoin
0 setlinecap
0 0 m
-3.5 0 l

gsave
0.000 setgray
fill
grestore
stroke
grestore
} bind def
900.7 193.255 o
grestore
gsave
871.434375 189.457698 translate
0.000000 rotate
0.000000 0.000000 m /zero glyphshow
6.362305 0.000000 m /period glyphshow
9.541016 0.000000 m /eight glyphshow
15.903320 0.000000 m /seven glyphshow
grestore
gsave
/o {
gsave
newpath
translate
0.8 setlinewidth
1 setlinejoin
0 setlinecap
0 0 m
-3.5 0 l

gsave
0.000 setgray
fill
grestore
stroke
grestore
} bind def
900.7 239.663 o
grestore
gsave
871.434375 235.866046 translate
0.000000 rotate
0.000000 0.000000 m /zero glyphshow
6.362305 0.000000 m /period glyphshow
9.541016 0.000000 m /eight glyphshow
15.903320 0.000000 m /eight glyphshow
grestore
1.500 setlinewidth
2 setlinecap
0.122 0.467 0.706 setrgbcolor
gsave
237 238.8 900.7 27.8 clipbox
911.472727 88.431838 m
914.270838 99.04526 l
917.068949 108.251232 l
919.86706 91.284 l
922.665171 119.01345 l
925.463282 128.268708 l
928.261393 121.05973 l
931.059504 131.433728 l
933.857615 136.847191 l
936.655726 138.65308 l
939.453837 141.272173 l
942.251948 145.814205 l
945.050059 148.314349 l
947.84817 150.197284 l
950.646281 154.567715 l
953.444392 158.321498 l
956.242503 159.06641 l
959.040614 153.51895 l
961.838725 164.265746 l
964.636836 170.971325 l
967.434947 170.144351 l
970.233058 172.57016 l
973.031169 171.272 l
975.82928 176.980811 l
978.627391 179.122861 l
981.425502 181.054959 l
984.223613 178.703829 l
987.021724 185.03745 l
989.819835 186.121171 l
992.617946 188.213841 l
995.416057 189.995897 l
998.214168 193.946329 l
1001.012279 191.210998 l
1003.81039 188.527227 l
1006.608501 195.815775 l
1009.406612 201.956517 l
1012.204723 198.958674 l
1015.002834 197.134902 l
1017.800945 204.952801 l
1020.599055 205.126552 l
1023.397166 208.472518 l
1026.195277 209.463647 l
1028.993388 210.237813 l
1031.791499 211.295301 l
1034.58961 216.201315 l
1037.387721 216.278205 l
1040.185832 216.018342 l
1042.983943 215.971517 l
1045.782054 220.843976 l
1048.580165 218.979266 l
1051.378276 219.477027 l
1054.176387 221.321081 l
1056.974498 226.741866 l
1059.772609 224.439399 l
1062.57072 229.994337 l
1065.368831 229.010187 l
1068.166942 229.319554 l
1070.965053 230.593132 l
1073.763164 230.773706 l
1076.561275 230.806013 l
1079.359386 236.593428 l
1082.157497 239.471075 l
1084.955608 234.487642 l
1087.753719 240.682032 l
1090.55183 242.527146 l
1093.349941 242.247531 l
1096.148052 244.454508 l
1098.946163 244.897218 l
1101.744274 239.637473 l
1104.542385 243.642582 l
1107.340496 246.302114 l
1110.138607 248.599129 l
1112.936718 250.731521 l
1115.734829 248.356775 l
1118.53294 252.878057 l
1121.331051 255.745455 l
1124.129162 252.340886 l
1126.927273 245.171599 l
stroke
grestore
1.000 0.498 0.055 setrgbcolor
gsave
237 238.8 900.7 27.8 clipbox
911.472727 46.508974 m
914.270838 52.982653 l
917.068949 60.565239 l
919.86706 38.654545 l
922.665171 63.984551 l
925.463282 68.200735 l
928.261393 61.365843 l
931.059504 67.19307 l
933.857615 65.13704 l
936.655726 67.59193 l
939.453837 67.485771 l
942.251948 66.005477 l
945.050059 71.406541 l
947.84817 66.336165 l
950.646281 69.389685 l
953.444392 69.298957 l
956.242503 71.766397 l
959.040614 68.069986 l
961.838725 71.6755 l
964.636836 73.798007 l
967.434947 68.639956 l
970.233058 70.673601 l
973.031169 69.144297 l
975.82928 72.372149 l
978.627391 70.29543 l
981.425502 68.768161 l
984.223613 70.602546 l
987.021724 70.930181 l
989.819835 68.074904 l
992.617946 66.524911 l
995.416057 71.01192 l
998.214168 71.974985 l
1001.012279 71.383477 l
1003.81039 62.541056 l
1006.608501 68.078126 l
1009.406612 69.266567 l
1012.204723 64.648639 l
1015.002834 65.561677 l
1017.800945 67.098781 l
1020.599055 64.285731 l
1023.397166 57.762533 l
1026.195277 65.25083 l
1028.993388 68.66692 l
1031.791499 66.381952 l
1034.58961 68.714912 l
1037.387721 67.657898 l
1040.185832 62.777116 l
1042.983943 58.865504 l
1045.782054 65.158068 l
1048.580165 59.093763 l
1051.378276 58.045229 l
1054.176387 63.945038 l
1056.974498 63.766805 l
1059.772609 60.202839 l
1062.57072 59.935915 l
1065.368831 65.400403 l
1068.166942 56.789124 l
1070.965053 67.697411 l
1073.763164 63.745099 l
1076.561275 55.769588 l
1079.359386 60.52403 l
1082.157497 60.725495 l
1084.955608 63.50446 l
1087.753719 62.2258 l
1090.55183 60.268977 l
1093.349941 60.899488 l
1096.148052 62.500017 l
1098.946163 59.983228 l
1101.744274 57.235128 l
1104.542385 59.663564 l
1107.340496 52.854109 l
1110.138607 57.210199 l
1112.936718 50.387687 l
1115.734829 47.660445 l
1118.53294 57.923976 l
1121.331051 59.603022 l
1124.129162 59.430217 l
1126.927273 39.833659 l
stroke
grestore
0.800 setlinewidth
0 setlinejoin
[] 0 setdash
0.000 setgray
gsave
900.7 27.8 m
900.7 266.6 l
stroke
grestore
gsave
1137.7 27.8 m
1137.7 266.6 l
stroke
grestore
gsave
900.7 27.8 m
1137.7 27.8 l
stroke
grestore
gsave
900.7 266.6 m
1137.7 266.6 l
stroke
grestore
/DejaVuSans findfont
12.000 scalefont
setfont
gsave
953.231250 272.600000 translate
0.000000 rotate
0.000000 0.000000 m /A glyphshow
8.208984 0.000000 m /d glyphshow
15.826172 0.000000 m /a glyphshow
23.179688 0.000000 m /g glyphshow
30.796875 0.000000 m /r glyphshow
35.730469 0.000000 m /a glyphshow
43.083984 0.000000 m /d glyphshow
50.701172 0.000000 m /space glyphshow
54.515625 0.000000 m /hyphen glyphshow
58.845703 0.000000 m /space glyphshow
62.660156 0.000000 m /five glyphshow
70.294922 0.000000 m /zero glyphshow
77.929688 0.000000 m /zero glyphshow
85.564453 0.000000 m /space glyphshow
89.378906 0.000000 m /hyphen glyphshow
93.708984 0.000000 m /space glyphshow
97.523438 0.000000 m /zero glyphshow
105.158203 0.000000 m /period glyphshow
108.972656 0.000000 m /eight glyphshow
116.607422 0.000000 m /four glyphshow
124.242188 0.000000 m /four glyphshow
grestore
1.000 setlinewidth
0 setlinecap
0.800 setgray
gsave
907.7 229.25625 m
973.215625 229.25625 l
974.548958 229.25625 975.215625 229.922917 975.215625 231.25625 c
975.215625 259.6 l
975.215625 260.933333 974.548958 261.6 973.215625 261.6 c
907.7 261.6 l
906.366667 261.6 905.7 260.933333 905.7 259.6 c
905.7 231.25625 l
905.7 229.922917 906.366667 229.25625 907.7 229.25625 c
cl
gsave
1.000 setgray
fill
grestore
stroke
grestore
1.500 setlinewidth
1 setlinejoin
2 setlinecap
[] 0 setdash
0.122 0.467 0.706 setrgbcolor
gsave
909.7 253.50625 m
929.7 253.50625 l
stroke
grestore
0.000 setgray
/DejaVuSans findfont
10.000 scalefont
setfont
gsave
937.700000 250.006250 translate
0.000000 rotate
0.000000 0.000000 m /a glyphshow
6.127930 0.000000 m /u glyphshow
12.465820 0.000000 m /c glyphshow
grestore
1.000 0.498 0.055 setrgbcolor
gsave
909.7 238.834375 m
929.7 238.834375 l
stroke
grestore
0.000 setgray
gsave
937.700000 235.334375 translate
0.000000 rotate
0.000000 0.000000 m /v glyphshow
5.917969 0.000000 m /a glyphshow
12.045898 0.000000 m /l glyphshow
14.824219 0.000000 m /A glyphshow
21.665039 0.000000 m /u glyphshow
28.002930 0.000000 m /c glyphshow
grestore

end
showpage
