# ADSP - from LA.UM.9.6.3.r1-06200-89xx.0
vendor/bin/adsprpcd|12e09d8e87b260a8721c7938890186a0877a9e85
vendor/etc/init/vendor.qti.adsprpc-guestos-sensorspd-service.rc|2bf8b1b71811ecfa2d73e3c6847be37b7500e7a0
vendor/lib/libadsp_default_listener.so|4baca0fcd9a7e7eb6c3030d6ac2a8d6554c508ae
vendor/lib/libadsprpc.so|d925886afb2efe4f190d26b8b1f08ae193e3c41c
vendor/lib/libfastcvadsp_stub.so|886e33a28a32f6a143081ab07deb186fd379408f
vendor/lib/libfastcvopt.so|88c9301642acfc619cae94fc4839a3c1075e826f
vendor/lib/libmdsprpc.so|1e18d90f9955a4bcb89aabf5c1836793e07de7ff
vendor/lib64/libadsp_default_listener.so|3ebcf635d6cdc447b8ecd40ea76bda39bf82c308
vendor/lib64/libadsprpc.so|b61f1875c78c69fd9d466515f3f4eaf12be8ac94
vendor/lib64/libfastcvadsp_stub.so|a7dd1371e6f8f888d3a411cbbc6778c6a0271984
vendor/lib64/libfastcvopt.so|288261cba728a1865d527a129086a1073fc8a80c
vendor/lib64/libmdsprpc.so|9bba60b57b783a6690154c6993ead42e304ac39a

# ADSP modules - from LA.UM.9.6.3.r1-06200-89xx.0
vendor/lib/rfsa/adsp/libapps_mem_heap.so|5c82ad9cfe3f30105d899e2a4e90cc7566f81252
vendor/lib/rfsa/adsp/libdspCV_skel.so|628985174b0088bed21c866d7984d23855e5e150
vendor/lib/rfsa/adsp/libfastcvadsp.so|9818625bfa018f517e32a8f4a1e7fb4b255e5049
vendor/lib/rfsa/adsp/libfastcvadsp_skel.so|1ff4a48009e88435d93fd2b9b0c5ea59cedbb4f7
vendor/lib/rfsa/adsp/libscveObjectSegmentation_skel.so|944169db3ac67056b92ef4f850f69346958370b5
vendor/lib/rfsa/adsp/libscveT2T_skel.so|91b9200dbb982abf0d6b440668252d892a616f66

# ANT+ - from LA.UM.9.6.3.r1-06200-89xx.0
system_ext/lib/com.qualcomm.qti.ant@1.0.so|7d5c61562d046e6ba4950ccbeaecef4cafd3f1af
system_ext/lib64/com.qualcomm.qti.ant@1.0.so|a858cae6254eb94831c50ac3df1d2d2f1ec5a65c
vendor/lib/hw/com.dsi.ant@1.0-impl.so|5c65523431b88a9aaa8c70a58b9d4ac66be26698
vendor/lib64/hw/com.dsi.ant@1.0-impl.so|87dc1a131534659173e71e108e7a3ffe6325845f

# AV Enhancements - from LA.UM.9.6.3.r1-06200-89xx.0
system_ext/lib/libavenhancements.so|e99c69d64249f9482b17953f7b25d7580bafb043
system_ext/lib64/libavenhancements.so|455ccbe2308bfc2411728ff619414a292ec37998

# Bluetooth - from LA.UM.9.6.3.r1-06200-89xx.0
vendor/bin/hw/android.hardware.bluetooth@1.0-service-qti|458aea3e8d0dec4a3e17fd476f4dea2392edc0e2
vendor/etc/init/android.hardware.bluetooth@1.0-service-qti.rc|f4ee3b2da2b08647447869ade86ec63f7340accc
vendor/lib64/hw/android.hardware.bluetooth@1.0-impl-qti.so|4e0ca2156568e14ffc061461af4e3b4acc2d9d1f
vendor/lib64/hw/vendor.qti.hardware.bluetooth_sar@1.1-impl.so|156ec51ccb53f667605cf99422abf9357888b4b6
vendor/lib64/hw/vendor.qti.hardware.btconfigstore@1.0-impl.so|a9685a3bc4d4c5a0afbd915ec7babd2ba3e929ff
vendor/lib64/hw/vendor.qti.hardware.btconfigstore@2.0-impl.so|3e1a8c52d73ef5e67bea68610906627226aabe21
vendor/lib64/libbt-hidlclient.so|ff301380cf3c0ff68d2b7fcda3ba428ebf0a859e
vendor/lib64/libbtnv.so|0c74a43550b939b9496b03b3285fa950cf560c48
vendor/lib64/libsoc_helper.so|a7de8fae284f55adf21ca161155b41d6df9dae56
vendor/lib64/vendor.qti.hardware.bluetooth_sar@1.0.so|23706dcfa35cc6f7dee934e13886c19a56a9aa12
vendor/lib64/vendor.qti.hardware.bluetooth_sar@1.1.so|ece3dafc4447e8302109851c3a6b0d3978b3506d

# CNE - from LA.UM.9.6.3.r1-06200-89xx.0
-vendor/app/CneApp/CneApp.apk|2839a8643422182451935867c83454dc7503c22b;REQUIRED=CneApp.libvndfwk_detect_jni.qti_symlink
-vendor/app/IWlanService/IWlanService.apk|416379b01261da80d4c497e5fb9df5e794a1d0f6
system_ext/lib64/com.quicinc.cne.api@1.0.so|76440d7953db0808e855eee393e116841b59c6d5
system_ext/lib64/com.quicinc.cne.api@1.1.so|0b7d8bca2364f1445f3ba1208fc68f7eac7578fe
system_ext/lib64/com.quicinc.cne.constants@1.0.so|e700fbf189a96fe1821a89d59d04c7d14ab14cf7
system_ext/lib64/com.quicinc.cne.constants@2.0.so|a5d80268d940651509d9bfc10f38538d6da04580
system_ext/lib64/com.quicinc.cne.constants@2.1.so|cf8a4412ca6ee339ac0dc2a14a9fad3091874c6f
system_ext/lib64/libmwqemiptablemgr.so|b45bd5f4e8d0905ea287af059bd7b06df0552127
vendor/bin/cnd|5ac2fd27a073dfd65acd0b19a2bce710e78651c7
vendor/etc/cne/wqeclient/ATT/ATT_profile1.xml|578f3f8f56059bfdbef926bcc68d01c15e06951f
vendor/etc/cne/wqeclient/ATT/ATT_profile2.xml|1fb42c672a12b6660bdce3ea94e0c43719dd9de8
vendor/etc/cne/wqeclient/ATT/ATT_profile3.xml|f88e13f1dd7b82388c90358f71813026370c9ed8
vendor/etc/cne/wqeclient/ATT/ATT_profile4.xml|fb08e04f57797c5684bf734f7ce4bb4968859b18
vendor/etc/cne/wqeclient/ATT/ATT_profile5.xml|eb726ad1a42b9b78b9ee3b821fc108611bc9eeac
vendor/etc/cne/wqeclient/ATT/ATT_profile6.xml|be97b46b0d07ee2f6ebcc677d8099ed2140d5d85
vendor/etc/cne/wqeclient/ROW/ROW_profile1.xml|e7ca213d0998cb3a6a603ad3eca7bda69830ff55
vendor/etc/cne/wqeclient/ROW/ROW_profile15.xml|0130dfd8326ee710bf4e15718ede87c49a85b763
vendor/etc/cne/wqeclient/ROW/ROW_profile16.xml|e05b935d7ccf48d306b71c719b2e4df83187d9c0
vendor/etc/cne/wqeclient/ROW/ROW_profile17.xml|f1b33204799268eda78dd8314f26abf2e37431e2
vendor/etc/cne/wqeclient/ROW/ROW_profile18.xml|19db16f62dabb806a62f192858a9d52b5bc2a064
vendor/etc/cne/wqeclient/ROW/ROW_profile19.xml|1fcc57b1fa4dbbc7d250e8dd92acf1527d447eb3
vendor/etc/cne/wqeclient/ROW/ROW_profile2.xml|169a5209000e357a1a3183e8e5bfdf6fd07c2787
vendor/etc/cne/wqeclient/ROW/ROW_profile20.xml|7be0614cf0116c39b736c58fe5eca36838aeb3db
vendor/etc/cne/wqeclient/ROW/ROW_profile21.xml|cc62517e6c37e12ee1ebebbb27f9c22878749be3
vendor/etc/cne/wqeclient/ROW/ROW_profile3.xml|4be4060e8ac2d9fcea490feec7938cadcff46e1f
vendor/etc/cne/wqeclient/ROW/ROW_profile32.xml|b87542b9284efe4c2bd0ae868bb9a765c2c3dbc5
vendor/etc/cne/wqeclient/ROW/ROW_profile4.xml|f88e13f1dd7b82388c90358f71813026370c9ed8
vendor/etc/cne/wqeclient/ROW/ROW_profile5.xml|96101f6b01436a02572c67a469ff67ccfb738874
vendor/etc/cne/wqeclient/ROW/ROW_profile6.xml|cef14ff8a160c7ad719b85d024a4b3301c3638d0
vendor/etc/cne/wqeclient/ROW/ROW_profile7.xml|8d6773a4c418d0dcc4dc9096017d2681c7a1defe
vendor/etc/cne/wqeclient/VZW/VZW_profile1.xml|c89d3c062790b442cbe941cafc641a4e322f2d59
vendor/etc/cne/wqeclient/VZW/VZW_profile2.xml|ba14a9df975cf872ed0cbe28bee8fac63cd848d4
vendor/etc/cne/wqeclient/VZW/VZW_profile3.xml|9b123d81c9b8991499cda33b0706810e0c8fb974
vendor/etc/cne/wqeclient/VZW/VZW_profile4.xml|ff91feb5060a6df07e3e4d9bc99ae58bccad7649
vendor/etc/cne/wqeclient/VZW/VZW_profile5.xml|f76c894f3c6d5b6ed35113a088dc3174c900501b
vendor/etc/cne/wqeclient/VZW/VZW_profile6.xml|14d136e7fcc682311757d3edc0b9d3eaeba11815
vendor/etc/cne/mwqem.conf|c42ad47b34b511075e5dfb9047d32f881fe0c159
vendor/etc/cne/profileMwqem.xml|947917691684584b7e2ddf3588cd6f8e99f3804f
vendor/etc/default-permissions/com.qualcomm.qti.cne.xml|c63c37d067e3009735fbc54d4603d43d7d6623e1
vendor/etc/init/cnd.rc|3a5183df3479500fb729493bc56c71166fc10bce
vendor/lib64/libcacertclient.so|69ae73b9be13507ff39398ac5813ad709b8b7c32
vendor/lib64/libcne.so|6c98c7c55a78a32265e12afc4d074f01f1714fbd
vendor/lib64/libcneapiclient.so|0973dc05f6d6d9c469fc804693af79e6f3a5056a
vendor/lib64/libcneoplookup.so|60d6abe85061de4fa75e5e4f69d477f37f1f8f64
vendor/lib64/libcneqmiutils.so|c2e2658698eb8b312ca6b28c1a1088a331bb28b9
vendor/lib64/libwms.so|8328702f0f7aa6a565502ed71793dc34747b1401
vendor/lib64/libwqe.so|faa6e6efb3fc240cae47f53917f48091b4f09b9e
vendor/lib64/libxml.so|4ede7cc6bd66b071200ddd3158b056d8298c6c30
vendor/lib64/vendor.qti.data.factory@2.0.so|748bfbaa57a409b8962e2b1725e1415e423a7315
vendor/lib64/vendor.qti.data.factory@2.1.so|bb1f3fa22563282ee24bf03ca681fdc45551feef
vendor/lib64/vendor.qti.data.factory@2.2.so|6951ff98d20902678e8af584c7b4cf89e360f31b
vendor/lib64/vendor.qti.data.factory@2.3.so|e9992039c400ef5fb57db62e108873a219348b4c
vendor/lib64/vendor.qti.data.mwqem@1.0.so|cde93c45f93a82091513d31535f188569dda89fe
vendor/lib64/vendor.qti.data.slm@1.0.so|0b5e88dfdb4fd0fb3c890f0aa3405ef268814da9
vendor/lib64/vendor.qti.hardware.cacert@1.0.so|1633c31212d1ea9338b79ebfc2476f83424f36ee
vendor/lib64/vendor.qti.hardware.data.cne.internal.api@1.0.so|e4d002e61b2d6a4d3826e0563ee16cac74696833
vendor/lib64/vendor.qti.hardware.data.cne.internal.constants@1.0.so|f87a303f7a092c4d18b7db91d5162a777c920817
vendor/lib64/vendor.qti.hardware.data.cne.internal.server@1.0.so|7d80cd3bda9fd34dd1629116124579e5a4a787f5
vendor/lib64/vendor.qti.hardware.data.connection@1.0.so|39bf1d748c3bb90d38be5d031dcd0024b1f2bb2f
vendor/lib64/vendor.qti.hardware.data.connection@1.1.so|702dd62c50c91446de473f32e31da3a85ba0aea9
vendor/lib64/vendor.qti.hardware.data.dynamicdds@1.0.so|4494ebdbbcfa79a0ed5ac3445cf0e2e417742bc1
vendor/lib64/vendor.qti.hardware.data.iwlan@1.0.so|e67ecee0938f81d3241a5acf140d7fc7d24db469
vendor/lib64/vendor.qti.hardware.data.latency@1.0.so|c433c73b5469b787cb7fb70b05b83190b319edd6
vendor/lib64/vendor.qti.hardware.data.qmi@1.0.so|851db5940d5e9e4330e16221be114aef14f52325
vendor/lib64/vendor.qti.hardware.mwqemadapter@1.0.so|c041dbfc99643e791e52c4e7f3a87050a8cd6c93
vendor/lib64/vendor.qti.hardware.slmadapter@1.0.so|000e0d2ac4450c0ad8baca06985bc9065e119f1e
vendor/lib64/vendor.qti.latency@2.0.so|60ab3143325e855f8c72e3f603c28efe2e7227b9
vendor/lib64/vendor.qti.latency@2.1.so|47f0d25338274af94764be9d39eabef8cf5ca790

# DSP - from LA.UM.9.6.3.r1-06200-89xx.0
system_ext/lib/vendor.qti.hardware.dsp@1.0.so|4a5b835bc386a71f1922b6ffa7a58947e4930c19
system_ext/lib64/vendor.qti.hardware.dsp@1.0.so|cb00ecf199d18de8e2ce3ca4e75e2042504fa772
vendor/bin/dspservice|a7344fc3d27a49df30858ebc3f73ee5818e752d4
vendor/etc/init/vendor.qti.hardware.dsp@1.0-service.rc|fbf2bb38ca6bdddf98c7123da9e1f263a4eec55f
vendor/etc/seccomp_policy/vendor.qti.hardware.dsp.policy|f060101b26d3674bb173e5fc95e118f56a8ac15d
vendor/lib/vendor.qti.hardware.dsp@1.0.so|b6f474e60c482479b0d022111d376e1c9f1062ea
vendor/lib64/vendor.qti.hardware.dsp@1.0.so|223a9268bd92bd80dab3df02fbef38ea86bcbadd

# FM - from LA.UM.9.6.3.r1-06200-89xx.0
-system_ext/lib64/vendor.qti.hardware.fm@1.0.so|5eaf6d5d67361ff6236c1ec4f5225c6185a904a6
vendor/lib64/hw/vendor.qti.hardware.fm@1.0-impl.so|32e26691e6de770a0256c6d419686b21f494ab71
vendor/lib64/vendor.qti.hardware.fm@1.0.so|f6e23f902b7e15232b20af55161a24da93ffe25f

# GPS - from LA.UM.9.6.3.r1-06200-89xx.0
-vendor/etc/vintf/manifest/android.hardware.gnss@2.1-service-qti.xml|1c344aacaa6d17a1585ba58b2e6d438dcfe31fad
-vendor/lib64/libloc_api_v02.so|a8a5667565d0355b9e8a8008ce855b61bd47de0c
vendor/bin/hw/android.hardware.gnss@2.1-service-qti|b25a1d670f4b2614afe1faebd79fedc9d1bc78c9
vendor/bin/edgnss-daemon|5d438b733c455056598bf65057d41c1ab27a246f
vendor/bin/loc_launcher|10dc88b969b32d3058da7a9ab290e66f46496a15
vendor/bin/lowi-server|bd8293d6c884ddbbea880ff06342b5fa5d5b47ae
vendor/bin/xtra-daemon|ea3029397b6773de7581086c6c3dd83d66406fed
vendor/bin/xtwifi-client|fa1548098108f7bc8477089d6825c81c9684a43a
vendor/bin/xtwifi-inet-agent|5a6d6348e92bd2009d8a2825ad47d5fc95bf8e1d
vendor/etc/init/android.hardware.gnss@2.1-service-qti.rc|6a70a956838b5070d310acb6cc76181aa1b83be6
vendor/lib64/hw/android.hardware.gnss@2.1-impl-qti.so|2cf2ebaf060edb093277d3cd8c13b0575b960109
vendor/lib64/libbatching.so|32e64d5bf92e0a11d59333cac7777e18df6320ef
vendor/lib64/libcdfw.so|e664b0a96e839f2c2e5166b24fc52cbbae0852a0
vendor/lib64/libcdfw_remote_api.so|49edbd6cea4f2cd6adfd8f3661fdbd293419bc2d
vendor/lib64/libdataitems.so|c2407a6ce2aa9dfef835cb9506f6932183cc13c7
vendor/lib64/libgdtap.so|a4add1dbe192ba94e83d08043d25a54693b7594e
vendor/lib64/libgeofencing.so|407e84f5d93015df3ca3a1b3fd127f0282c27007
vendor/lib64/libgnss.so|f4773af470ea0aec2dcdb6fb442d4e015f34ae8c
vendor/lib64/libgnsspps.so|0c5104f4d964b0aaaf283fdb27f32461b76922c9
vendor/lib64/libgps.utils.so|465213c9a662f4ab528c044bf45b26da22375371
vendor/lib64/libizat_client_api.so|f666904c41c548908f6c62427f0453e4d416f80c
vendor/lib64/libizat_core.so|863c0efdebfb74c16c9ad51bce37aa045669cd5e
vendor/lib64/liblbs_core.so|ae75c801205577b0725e10a20759ba667623d8af
vendor/lib64/libloc_core.so|a701d3cb26ef61d1c17ced9aab382a4253bab32d
vendor/lib64/libloc_socket.so|eade4f99a53d53c0dfebf4beb818ad70ea0debe0
vendor/lib64/liblocation_api.so|a85adbedf56de5896ace5378a5dcf3083ad3343c
vendor/lib64/liblocationservice.so|e8f63561400b23db5c52bf24f0fadea36e05f38e
vendor/lib64/liblocationservice_glue.so|c5084307bd5fd1c968078954c7f2fd39d321824c
vendor/lib64/liblowi_client.so|aadd09b327bcabcc3020c4a2c598b45a4d032fdc
vendor/lib64/liblowi_wifihal.so|eae23a08ce10b85c580cdf1e08cc41b710505096
vendor/lib64/libpal_net_if.so|25ce6487bc8b4000f51049d3f460e11d76a570bb
vendor/lib64/libqcc_file_agent.so|cd70ce305d5036a027060aa989b0dcbcfab8edb6
vendor/lib64/libsys_info_cache.so|6749ad36366ea3b2c35420afa17e2838c5fe7505
vendor/lib64/libxtadapter.so|15a1c4cf298faf1fba6d745647dc95d62f015b66
vendor/lib64/vendor.qti.gnss@1.0.so|5cc0d0c8e7a8083f5892eb303ab1e6d4c9d66639
vendor/lib64/vendor.qti.gnss@1.1.so|9a516f4b1b55798f0ec1ebead0c653ad65546517
vendor/lib64/vendor.qti.gnss@1.2.so|1266128a166aed91804aebc1513524eb09424f64
vendor/lib64/vendor.qti.gnss@2.0.so|8dc78f86e141c05f5b404cb3236910896c10d941
vendor/lib64/vendor.qti.gnss@2.1.so|81142c88b15688a671bd372f013dfb2e77d1998d
vendor/lib64/vendor.qti.gnss@3.0.so|1c0b41eddcc4789e1ea842be02d511afad123a8e
vendor/lib64/vendor.qti.gnss@4.0.so|e38ae43982dc62bf48193a6c3eb2ae385adb37aa
vendor/lib64/vendor.qti.gnss@4.1-service.so|28226d16a4776585c48a1828ca525c250fefea21
vendor/lib64/vendor.qti.gnss@4.1.so|3667af69bd87428d84780ef6c3ad8300bb0e0564
vendor/lib64/vendor.qti.hardware.qccsyshal@1.0.so|3ff445db2dd2db1a1068fe70a54a6c04fbdd3123

# Graphics firmware - from LA.UM.9.6.3.r1-06200-89xx.0
vendor/firmware/a530_gpmu.fw2|706da8d5ee565dcf456341f805ee75a40773f65a
vendor/firmware/a530_pfp.fw|35b72dce880191ff087af2524205afce40ea8c97
vendor/firmware/a530_pm4.fw|b1cf625b5552b99839687f479c124ac5daca2ca2
vendor/firmware/a530v1_pfp.fw|0864291b99bed712edfcffa94be7b4595d3af306
vendor/firmware/a530v1_pm4.fw|6a82a4fb4035fa2a933c1a26b5535d7ec7c0ac4c
vendor/firmware/a530v2_seq.fw2|63b6d25594a5c1f4217d996a2b636e17a29fc840
vendor/firmware/a530v3_gpmu.fw2|0a2f6f450231673d75ba39e5d28776db3becf810
vendor/firmware/a530v3_seq.fw2|8963a53acc689725dee4b22881a4dd4b80e5def8
vendor/firmware/a540_gpmu.fw2|3530f10b4825a3b08c79e0bcfaf6471ec8422f24

# Listen - from LA.UM.9.6.3.r1-06200-89xx.0
system_ext/lib/liblistensoundmodel2.qti.so|251553f2a83362e5388021c16b6dc526c11577de
system_ext/lib64/liblistensoundmodel2.qti.so|dfa4b4e0f69cfb7654915d0d7fea506da1b5cfb6
vendor/lib/libadpcmdec.so|452d1123ab4e12c4444df33322f309e2ecc2e1e4
vendor/lib/liblistensoundmodel2.so|2477022cee3bf3025f41fa1fd3254bfb977fef25
vendor/lib/libmulawdec.so|ca1045d8cef044ef722c323ea22ffa1e60ac8a92
vendor/lib/libsmwrapper.so|bd5f722c74a85b9fa11f95950782559411d2fed7
vendor/lib/vendor.qti.voiceprint@1.0.so|d3147a3879be8c54a6e9d43a99225de75c724e62
vendor/lib64/liblistensoundmodel2.so|68be3f09449e8c13730b3fa9ceb5f4d203adec42
vendor/lib64/vendor.qti.voiceprint@1.0.so|487df9f214462b4eb9b02630992696f07c2b2acc

# Media - from LA.UM.9.6.3.r1-06200-89xx.0
system/lib/libFileMux.so|22005fb1595b2b76e199b82ff3790c1bc3d54a20
system/lib/libOmxMux.so|31906509ca781a2a579da26270c57a3856947afe
system_ext/lib/extractors/libmmparserextractor.so|8a695bafa6c22c26de6dd00511ad006a6c54ac44
system_ext/lib/libmmosal.so|1a5eb721c856425a8abfab066366a7b86c6372c4
system_ext/lib/libmmparser_lite.so|1c7a0e2ae267ec942301785d603391a1c70c63f9
system_ext/lib64/libmmosal.so|45ff43f7cac95bce47623f1a0f2f64534371cdc1
vendor/etc/seccomp_policy/mediacodec.policy|f1097f8e67ef20de89176cf2e9c4f5c91cb77897
vendor/etc/seccomp_policy/mediaextractor.policy|4234a844e9b1aef37397c8cfbd19566966ecd622
vendor/lib/libAlacSwDec.so|2db927b746f9521da19360d8908939fbc028c14e
vendor/lib/libApeSwDec.so|eb264167cd4f04b48e1aaca9fde13a38368ac1c1
vendor/lib/libFlacSwDec.so|ac96c00ac7eae265421ba3e6301dc560ec5e011e
vendor/lib/libI420colorconvert.so|a5af02b3d2d12ed1dfb9ed8015bb12756e6fd908
vendor/lib/libMpeg4SwEncoder.so|17add1e247c3b4fdfe9fcb3c9f31e5fc6e08fcfa
vendor/lib/libOmxAacDec.so|668fc930097b3e1f8f2e3597ea5c0276ef9ce563
vendor/lib/libOmxAlacDec.so|2e8a40c22da96aba1117f4b84b7120dd68f4383b
vendor/lib/libOmxAlacDecSw.so|407e1d197753140f686dbcb95ab191b21b38bcff
vendor/lib/libOmxAmrDec.so|38558f2e34a30528658d6b758bcc73bb7a7a535a
vendor/lib/libOmxAmrwbplusDec.so|30869a573928b5c60eaf0844e38e6876c63117d7
vendor/lib/libOmxApeDec.so|5abcc3ee931cdde23406b5696f6e2061a3823346
vendor/lib/libOmxApeDecSw.so|c36f7253818ee759988ba430896590fec4f0c570
vendor/lib/libOmxDsdDec.so|e669191874ef80c9569f06b9827e8c4c1fc2f977
vendor/lib/libOmxEvrcDec.so|1aa88b8f6cea51073bff854f849a52386a91e9c5
vendor/lib/libOmxG711Dec.so|73b81fae3e43e9a4607a5315a60cdb5167a08ef2
vendor/lib/libOmxQcelp13Dec.so|ca79dce103ec6d585e92317b601d2dc2d35531f4
vendor/lib/libOmxSwVdec.so|c0db6c08e2e629f63f4589e259d21b256478804e
vendor/lib/libOmxSwVencMpeg4.so|ffe016cd11911430eac0d234936db02af4788718
vendor/lib/libOmxVideoDSMode.so|3f4196a068394cc15ceb74fa3d9ac2665b935068
vendor/lib/libOmxVpp.so|d3ac48a87bfe2a9f185fa8e95f76e2fea29b81f7
vendor/lib/libOmxWmaDec.so|3ff8dca5f7062b62b115ed6c833ff978dba3efe0
vendor/lib/libmm-color-convertor.so|3415a0d6f6737e4b3fec89f39e5edf7beb88b8bb
vendor/lib/libmmosal.so|d3f57f4681a09cb7fb8c7152e9075e4180f753f2
vendor/lib/libswvdec.so|4b0b57f5d89ca25952652ba84f233ace704e9517
vendor/lib/libvpplibrary.so|942556f16df6a2c364d5cf70b192f6699ad97494
vendor/lib64/libmmosal.so|5d560958cce1a6fde1cb66951332b447ac4ad9bd
vendor/lib64/libswvdec.so|3d6adfc85f4f87b41a9b260eef03b5b33292e971
vendor/lib64/libvpplibrary.so|1f989aa6614a78fae14eb92e6fe8e6120a336294

# Peripheral manager - from LA.UM.9.6.3.r1-06200-89xx.0
vendor/bin/pm-proxy|cfa016d416eb95949c76090bde8ccffcd5517159
vendor/bin/pm-service|06608529b6125c5362dee26f459c52d9e51f3c92
vendor/lib/libperipheral_client.so|7ace2f7c8c7ebd986db6c7796de7237e584e658b
vendor/lib64/libperipheral_client.so|9bfd41e276e16b8f7c6808f3d87531fc5be4cdd5

# Power-off alarm - from LA.UM.9.6.3.r1-06200-89xx.0
-product/app/PowerOffAlarm/PowerOffAlarm.apk|bc906abd03e4a243201dde626b6580fd8a4f73ce
vendor/bin/hw/vendor.qti.hardware.alarm@1.0-service|586b142f9bc4bf3098b4962682c4de1c13810f9b
vendor/bin/power_off_alarm|b8c7ddc1bed336753c3746925fd0f4a9925aa36c
vendor/etc/init/vendor.qti.hardware.alarm@1.0-service.rc|a03a9a1c818595b19272ea6ffb466e23a7fc3b05
vendor/lib64/hw/vendor.qti.hardware.alarm@1.0-impl.so|4129558506dc078c03679ba362acda4755457742
vendor/lib64/vendor.qti.hardware.alarm@1.0.so|dcfdc04b4e0c6e6a4ffa60e1694268bd0327e65c

# QMI (diag) - from LA.UM.9.6.3.r1-06200-89xx.0
system_ext/lib64/libdiag_system.so|1e0006fd3be67cbb50fb28ecfec028bddcead4fe
system_ext/lib64/vendor.qti.diaghal@1.0.so|abe51fdbdcbf3449012395cf0ade8aa8d267dbe6
vendor/bin/irsc_util|121deb2d6fd21b122c6a8ca8b30ef167f6b90f61
vendor/etc/sec_config|38ed44170badad7ae9a05f53223e1addf8780083
vendor/lib/libdiag.so|1a946b18fcd5de254df8d631cd7677f595b3b2c8
vendor/lib64/libdiag.so|8d92025445dcf905778a15e76adc1afdc3395642

# QMI (shared dependencies) - from LA.UM.9.6.3.r1-06200-89xx.0
vendor/lib/libdsi_netctrl.so|431369267b8f16a65f52c8c0aa9f600617f7b74a
vendor/lib/libdsutils.so|e035f52080bee917975825d7f839e4f3226ed80c
vendor/lib/libidl.so|651e104b88449c15df430d7dfc8480e7fe33a7ce
vendor/lib/libpdmapper.so|567605fda4939a2eae5b2fa0d7d172deece121b6
vendor/lib/libqcci_legacy.so|21ab162a1656182bf476fa51102f85348e18f593
vendor/lib/libqdi.so|e6bc751b39027f7bd984a3e499b7279a4347cb2d
vendor/lib/libqdp.so|867a98d0056a335c90fc0cc51f5d6ddc694c9500
vendor/lib/libqmi.so|76f9f46b4af081ecbac72402a38f862b576e9d2b
vendor/lib/libqmi_cci.so|f8b91bad4d1d7d1d26f748ed7d7462c19749223e
vendor/lib/libqmi_client_helper.so|c76a00cd800c47dd3b0f531cb23960b9bd494726
vendor/lib/libqmi_client_qmux.so|ef0633ed4d120ce2f23cecd1a7604e51f82c545d
vendor/lib/libqmi_common_so.so|3de41cb14094a549b849795a2fde39a4c4182d98
vendor/lib/libqmi_csi.so|a38ce1f6ed1e9c335983cbcb202e01ae1635f4f7
vendor/lib/libqmi_encdec.so|7771bb05dfd737978ec0c8b6f969534a15cdb5a3
vendor/lib/libqmi_legacy.so|b9cd2f529f7f8747345787e650f1b54b77551d13
vendor/lib/libqmiservices.so|9ebb4110018bc246478687593114787735910aaa
vendor/lib64/libdsi_netctrl.so|d9c08f4eebe353600f11c06df08948736e6d85e6
vendor/lib64/libdsutils.so|05dfa7875f35264f0f8bdfb69a33fa4f9435b4a2
vendor/lib64/libidl.so|857f7a75a51ade7d3621f7fa6da0e9461244ca01
vendor/lib64/libpdmapper.so|b75e78f6ba0cbb47cb5681a415c1b07865a8f3e4
vendor/lib64/libqcci_legacy.so|0e78c75ce59453a09cc1d6bcba0507cab9ae663a
vendor/lib64/libqdi.so|55f2b1f84ab0863f54528e7ea1be3bd536da757a
vendor/lib64/libqdp.so|55cabaf9021a8f8f22b76ba7f8dca7299c0b21ab
vendor/lib64/libqmi.so|021bc09d398f1f465b8d86d0a3b8d74e7826283a
vendor/lib64/libqmi_cci.so|4d48845f07742c7084920bf8c5a2cfcf7364daec
vendor/lib64/libqmi_client_helper.so|937b9fa7d41063f65aeb609e354828f7acc1840f
vendor/lib64/libqmi_client_qmux.so|e8105f662cf95ffd280eccc5227303126d7afc73
vendor/lib64/libqmi_common_so.so|d817b576a054dd91e8e4346d73e6d635d221bfde
vendor/lib64/libqmi_csi.so|7e19c2266b7f63f3f9e69c039b1446acd460231b
vendor/lib64/libqmi_encdec.so|a18bb21e5b9b53e3dc8dc45f6e7e65e32a467607
vendor/lib64/libqmi_legacy.so|f324c6701ecf78ff50975c0bc7f99aea09cb3539
vendor/lib64/libqmiservices.so|26831cc09412c98bb92da6edefa619d679d31057

# QC RIL - from LA.UM.9.6.3.r1-06200-89xx.0
vendor/bin/hw/qcrild|77d0168fbad7db01eec8abd9df25f19c05411eb4
vendor/etc/init/qcrild.rc|17cf4934bf443cf6469d8b3ff622eeb0e4a0aac6
vendor/lib64/libqcrilFramework.so|dc62bd4f3685c420d43f4f5f4141d5908212df86
vendor/lib64/libqcrildatactl.so|716112f6bdbbe968f867b7ad73c7b0a12d1be6e1
vendor/lib64/libril-qc-hal-qmi.so|eb0237f87bc36012f8ea7f2833b952864eebb493
vendor/lib64/libril-qc-logger.so|3ea877c66d4b5ef4a794e7d87cad1f4f9bb76022
vendor/lib64/qcrild_librilutils.so|f12ebc05420621d930ffe7f4b4859117e3c9fc35
vendor/lib64/qtibus.so|cef56e2d40f69b6b6c60b93edb612744395f7359
vendor/lib64/qtimutex.so|026d9acf29b23ab0419abfe3066bd4c9f13bf7ae
vendor/lib64/vendor.qti.hardware.radio.lpa@1.2.so|ff82aa5e007728edfe1e24e73b1ea0c50d805f2c

# Sensors - from LA.UM.9.6.3.r1-06200-89xx.0
system_ext/lib/vendor.qti.hardware.sensorscalibrate@1.0.so|5ce25016e9dc0330ac1fdf2a27c87149026181f9
system_ext/lib64/vendor.qti.hardware.sensorscalibrate@1.0.so|c69108a5df9cbce547b7d2b5605357ac37a8b916
vendor/bin/sensors.qti|7b71585b3e56dfb91755c1a8d0a82a5f311d127c
vendor/lib/hw/activity_recognition.msm8937.so|3b7a7a10cf39ee4654bfd68ce9eab6b8547fab38
vendor/lib/libsensor1.so|a540315d6ef2c51d9a7e6d61b03938d3f6d9ee7b
vendor/lib/libsensor_reg.so|e01015508b5fc7ea28085af90c09c0b0478bce8e
vendor/lib/sensor_calibrate.so|e5b770754b1b548c1f04a9629f9b153c2266cf8e
vendor/lib64/hw/activity_recognition.msm8937.so|5ab27068d75aec4fd65101c8e5afc8cacf074ce0
vendor/lib64/libsensor1.so|ff579545548b9bca7fb9f419ac565534df4a5f47
vendor/lib64/libsensor_reg.so|bfb27dfc51abb5e99a12fb482e6fe60502859e7a
vendor/lib64/sensor_calibrate.so|ecb95cee65056ba4adc4b30ab28a8b9e3cff1b06

# Time services - from LA.UM.9.6.3.r1-06200-89xx.0
-vendor/app/TimeService/TimeService.apk|1a5f39aa2969feee50ff81ec870b5e2669ae515e
vendor/bin/time_daemon|48401d7f85c87aa3e12ce7b4a969a50cbf59c293
vendor/etc/init/init.time_daemon.rc|b253ca2a498757e14e1d7a051bf504ae09218f51
vendor/lib64/libtime_genoff.so|8bb116ad297a5e4a94da2f10509509cb6e863a5f

# TUI - from LA.UM.9.6.3.r1-06200-89xx.0
vendor/bin/hw/vendor.qti.hardware.tui_comm@1.0-service-qti|15378114c18fd1b1c8f9671f656396285ad1de48
vendor/etc/init/vendor.qti.hardware.tui_comm@1.0-service-qti.rc|2cfc563d7e1579374f001c94588fae7835a12ffc
vendor/lib/vendor.qti.hardware.tui_comm@1.0.so|680e563a4fe444f71ea56a825cc2aa8a59dfe2ce
vendor/lib64/vendor.qti.hardware.tui_comm@1.0.so|4ba792ee3234dca4cd7ebbd7b3f9003c800f51b4

# Wi-Fi - from LA.UM.9.6.3.r1-06200-89xx.0
vendor/bin/wcnss_service|4bf3962fa1444caca2d3497e71ae4cd2ba306aa1
